You are viewing a plain text version of this content. The canonical link for it is here.
- [jira] [Updated] (PDFBOX-6213) Run regression tests for 3.0.8 - posted by "Tilman Hausherr (Jira)" <ji...@apache.org> on 2026/07/01 06:14:00 UTC, 7 replies.
- [jira] [Created] (PDFBOX-6213) Run regression tests for 3.0.8 - posted by "Tilman Hausherr (Jira)" <ji...@apache.org> on 2026/07/01 06:14:00 UTC, 0 replies.
- [jira] [Commented] (PDFBOX-4951) Sequences of DIN SPEC 91379 with combining letters are rendered incorrectly - posted by "Andreas Lehmkühler (Jira)" <ji...@apache.org> on 2026/07/01 06:27:00 UTC, 105 replies.
- [jira] [Commented] (PDFBOX-6213) Run regression tests for 3.0.8 - posted by "Tilman Hausherr (Jira)" <ji...@apache.org> on 2026/07/01 07:07:00 UTC, 14 replies.
- [jira] [Created] (PDFBOX-6214) PDDocument static AWT warm-up fails hard when AWT native libs are unavailable (GraalVM native-image) - posted by "Tilman Hausherr (Jira)" <ji...@apache.org> on 2026/07/02 03:37:00 UTC, 0 replies.
- [jira] [Updated] (PDFBOX-6214) PDDocument static AWT warm-up fails hard when AWT native libs are unavailable (GraalVM native-image) - posted by "Tilman Hausherr (Jira)" <ji...@apache.org> on 2026/07/02 03:38:00 UTC, 1 replies.
- [jira] [Commented] (PDFBOX-6214) PDDocument static AWT warm-up fails hard when AWT native libs are unavailable (GraalVM native-image) - posted by "ASF subversion and git services (Jira)" <ji...@apache.org> on 2026/07/02 03:44:00 UTC, 2 replies.
- Build failed in Jenkins: PDFBox » PDFBox-sonar2 » pdfbox-reactor #2144 - posted by Apache Jenkins Server <je...@builds.apache.org> on 2026/07/02 03:53:28 UTC, 0 replies.
- Build failed in Jenkins: PDFBox » PDFBox-sonar2 #2144 - posted by Apache Jenkins Server <je...@builds.apache.org> on 2026/07/02 03:53:30 UTC, 0 replies.
- Jenkins build is back to normal : PDFBox » PDFBox-trunk » Apache PDFBox parent #3288 - posted by Apache Jenkins Server <je...@builds.apache.org> on 2026/07/02 04:01:24 UTC, 0 replies.
- Jenkins build is back to normal : PDFBox » PDFBox-trunk #3288 - posted by Apache Jenkins Server <je...@builds.apache.org> on 2026/07/02 04:01:25 UTC, 0 replies.
- Jenkins build is back to normal : PDFBox » PDFBox-3.0.x » Apache Preflight #1366 - posted by Apache Jenkins Server <je...@builds.apache.org> on 2026/07/02 04:01:34 UTC, 0 replies.
- Jenkins build is back to normal : PDFBox » PDFBox-3.0.x #1366 - posted by Apache Jenkins Server <je...@builds.apache.org> on 2026/07/02 04:01:35 UTC, 0 replies.
- [jira] [Commented] (PDFBOX-5660) Improve code quality (5) - posted by "ASF subversion and git services (Jira)" <ji...@apache.org> on 2026/07/02 09:10:00 UTC, 80 replies.
- Build failed in Jenkins: PDFBox » PDFBox-3.0.x » Apache Preflight #1367 - posted by Apache Jenkins Server <je...@builds.apache.org> on 2026/07/02 09:43:16 UTC, 0 replies.
- Build failed in Jenkins: PDFBox » PDFBox-3.0.x #1367 - posted by Apache Jenkins Server <je...@builds.apache.org> on 2026/07/02 09:43:18 UTC, 0 replies.
- Build failed in Jenkins: PDFBox » PDFBox-2.0.x » Apache Preflight #2014 - posted by Apache Jenkins Server <je...@builds.apache.org> on 2026/07/02 10:00:27 UTC, 0 replies.
- Build failed in Jenkins: PDFBox » PDFBox-2.0.x #2014 - posted by Apache Jenkins Server <je...@builds.apache.org> on 2026/07/02 10:00:28 UTC, 0 replies.
- Build failed in Jenkins: PDFBox » PDFBox-trunk » Apache PDFBox parent #3289 - posted by Apache Jenkins Server <je...@builds.apache.org> on 2026/07/02 10:02:47 UTC, 0 replies.
- Build failed in Jenkins: PDFBox » PDFBox-trunk #3289 - posted by Apache Jenkins Server <je...@builds.apache.org> on 2026/07/02 10:02:50 UTC, 0 replies.
- Build failed in Jenkins: PDFBox » PDFBox-3.0.x » Apache Preflight #1368 - posted by Apache Jenkins Server <je...@builds.apache.org> on 2026/07/02 10:09:12 UTC, 0 replies.
- Build failed in Jenkins: PDFBox » PDFBox-3.0.x #1368 - posted by Apache Jenkins Server <je...@builds.apache.org> on 2026/07/02 10:09:13 UTC, 0 replies.
- Build failed in Jenkins: PDFBox » PDFBox-sonar2 » pdfbox-reactor #2145 - posted by Apache Jenkins Server <je...@builds.apache.org> on 2026/07/02 10:31:07 UTC, 0 replies.
- Build failed in Jenkins: PDFBox » PDFBox-sonar2 #2145 - posted by Apache Jenkins Server <je...@builds.apache.org> on 2026/07/02 10:31:09 UTC, 0 replies.
- Build failed in Jenkins: PDFBox » PDFBox-sonar2 » pdfbox-reactor #2146 - posted by Apache Jenkins Server <je...@builds.apache.org> on 2026/07/02 10:55:04 UTC, 0 replies.
- Build failed in Jenkins: PDFBox » PDFBox-sonar2 #2146 - posted by Apache Jenkins Server <je...@builds.apache.org> on 2026/07/02 10:55:05 UTC, 0 replies.
- Jenkins build is back to normal : PDFBox » PDFBox-sonar2 » pdfbox-reactor #2147 - posted by Apache Jenkins Server <je...@builds.apache.org> on 2026/07/02 11:47:35 UTC, 0 replies.
- Jenkins build is back to normal : PDFBox » PDFBox-sonar2 #2147 - posted by Apache Jenkins Server <je...@builds.apache.org> on 2026/07/02 11:47:41 UTC, 0 replies.
- Build failed in Jenkins: PDFBox » PDFBox-trunk » Apache PDFBox parent #3290 - posted by Apache Jenkins Server <je...@builds.apache.org> on 2026/07/02 12:04:54 UTC, 0 replies.
- Build failed in Jenkins: PDFBox » PDFBox-trunk #3290 - posted by Apache Jenkins Server <je...@builds.apache.org> on 2026/07/02 12:04:55 UTC, 0 replies.
- Jenkins build is back to normal : PDFBox » PDFBox-3.0.x » Apache Preflight #1369 - posted by Apache Jenkins Server <je...@builds.apache.org> on 2026/07/02 13:49:07 UTC, 0 replies.
- Jenkins build is back to normal : PDFBox » PDFBox-3.0.x #1369 - posted by Apache Jenkins Server <je...@builds.apache.org> on 2026/07/02 13:49:08 UTC, 0 replies.
- Build failed in Jenkins: PDFBox » PDFBox-2.0.x » Apache Preflight #2015 - posted by Apache Jenkins Server <je...@builds.apache.org> on 2026/07/02 13:59:13 UTC, 0 replies.
- Build failed in Jenkins: PDFBox » PDFBox-2.0.x #2015 - posted by Apache Jenkins Server <je...@builds.apache.org> on 2026/07/02 13:59:15 UTC, 0 replies.
- Jenkins build is back to normal : PDFBox » PDFBox-trunk » Apache PDFBox parent #3291 - posted by Apache Jenkins Server <je...@builds.apache.org> on 2026/07/02 14:06:08 UTC, 0 replies.
- Jenkins build is back to normal : PDFBox » PDFBox-trunk #3291 - posted by Apache Jenkins Server <je...@builds.apache.org> on 2026/07/02 14:06:09 UTC, 0 replies.
- [jira] [Resolved] (PDFBOX-6214) PDDocument static AWT warm-up fails hard when AWT native libs are unavailable (GraalVM native-image) - posted by "Tilman Hausherr (Jira)" <ji...@apache.org> on 2026/07/03 03:22:00 UTC, 0 replies.
- [jira] [Comment Edited] (PDFBOX-6213) Run regression tests for 3.0.8 - posted by "Tilman Hausherr (Jira)" <ji...@apache.org> on 2026/07/03 06:53:00 UTC, 1 replies.
- Jenkins build is back to normal : PDFBox » PDFBox-2.0.x » Apache Preflight #2016 - posted by Apache Jenkins Server <je...@builds.apache.org> on 2026/07/03 10:24:08 UTC, 0 replies.
- Jenkins build is back to normal : PDFBox » PDFBox-2.0.x #2016 - posted by Apache Jenkins Server <je...@builds.apache.org> on 2026/07/03 10:24:09 UTC, 0 replies.
- [jira] [Created] (PDFBOX-6215) LTV DSS generation creates duplicate certificate streams - posted by "robo (Jira)" <ji...@apache.org> on 2026/07/03 10:49:00 UTC, 0 replies.
- partial skip owasp dependency check - posted by Tilman Hausherr <TH...@t-online.de> on 2026/07/03 11:42:05 UTC, 1 replies.
- [jira] [Comment Edited] (PDFBOX-4951) Sequences of DIN SPEC 91379 with combining letters are rendered incorrectly - posted by "Tilman Hausherr (Jira)" <ji...@apache.org> on 2026/07/03 19:36:00 UTC, 20 replies.
- Build failed in Jenkins: PDFBox » PDFBox-trunk » Apache PDFBox Layout awt #3300 - posted by Apache Jenkins Server <je...@builds.apache.org> on 2026/07/04 11:35:23 UTC, 0 replies.
- Build failed in Jenkins: PDFBox » PDFBox-trunk #3300 - posted by Apache Jenkins Server <je...@builds.apache.org> on 2026/07/04 11:35:24 UTC, 0 replies.
- Jenkins build is back to normal : PDFBox » PDFBox-trunk » Apache PDFBox Layout awt #3301 - posted by Apache Jenkins Server <je...@builds.apache.org> on 2026/07/04 11:53:39 UTC, 0 replies.
- Jenkins build is back to normal : PDFBox » PDFBox-trunk #3301 - posted by Apache Jenkins Server <je...@builds.apache.org> on 2026/07/04 11:53:40 UTC, 0 replies.
- Build failed in Jenkins: PDFBox » PDFBox-trunk » Apache PDFBox Layout awt #3303 - posted by Apache Jenkins Server <je...@builds.apache.org> on 2026/07/04 13:39:45 UTC, 0 replies.
- Build failed in Jenkins: PDFBox » PDFBox-trunk #3303 - posted by Apache Jenkins Server <je...@builds.apache.org> on 2026/07/04 13:39:46 UTC, 0 replies.
- Build failed in Jenkins: PDFBox » PDFBox-trunk » Apache PDFBox Layout awt #3304 - posted by Apache Jenkins Server <je...@builds.apache.org> on 2026/07/04 14:09:25 UTC, 0 replies.
- Build failed in Jenkins: PDFBox » PDFBox-trunk #3304 - posted by Apache Jenkins Server <je...@builds.apache.org> on 2026/07/04 14:09:27 UTC, 0 replies.
- Jenkins build is back to normal : PDFBox » PDFBox-trunk » Apache PDFBox Layout awt #3305 - posted by Apache Jenkins Server <je...@builds.apache.org> on 2026/07/04 14:24:30 UTC, 0 replies.
- Jenkins build is back to normal : PDFBox » PDFBox-trunk #3305 - posted by Apache Jenkins Server <je...@builds.apache.org> on 2026/07/04 14:24:46 UTC, 0 replies.
- [jira] [Updated] (PDFBOX-4951) Sequences of DIN SPEC 91379 with combining letters are rendered incorrectly - posted by "Tilman Hausherr (Jira)" <ji...@apache.org> on 2026/07/04 19:38:00 UTC, 6 replies.
- Build failed in Jenkins: PDFBox » PDFBox-trunk » Apache PDFBox Layout awt #3310 - posted by Apache Jenkins Server <je...@builds.apache.org> on 2026/07/05 06:03:40 UTC, 0 replies.
- Build failed in Jenkins: PDFBox » PDFBox-trunk #3310 - posted by Apache Jenkins Server <je...@builds.apache.org> on 2026/07/05 06:03:41 UTC, 0 replies.
- Jenkins build is back to normal : PDFBox » PDFBox-trunk » Apache PDFBox Layout awt #3311 - posted by Apache Jenkins Server <je...@builds.apache.org> on 2026/07/05 08:06:52 UTC, 0 replies.
- Jenkins build is back to normal : PDFBox » PDFBox-trunk #3311 - posted by Apache Jenkins Server <je...@builds.apache.org> on 2026/07/05 08:06:53 UTC, 0 replies.
- [jira] [Created] (PDFBOX-6216) Reject OpenType fonts using CFF2 outlines - posted by "Andreas Lehmkühler (Jira)" <ji...@apache.org> on 2026/07/05 10:12:00 UTC, 0 replies.
- [jira] [Commented] (PDFBOX-6216) Reject OpenType fonts using CFF2 outlines - posted by "ASF subversion and git services (Jira)" <ji...@apache.org> on 2026/07/05 10:22:00 UTC, 1 replies.
- [jira] [Resolved] (PDFBOX-6216) Reject OpenType fonts using CFF2 outlines - posted by "Andreas Lehmkühler (Jira)" <ji...@apache.org> on 2026/07/05 11:26:00 UTC, 0 replies.
- Re: [PR] GlyphLayoutProcessor for correct glyph layout and support of DIN 91379 (Issue PDFBOX-4951) [pdfbox] - posted by "vk-github18 (via GitHub)" <gi...@apache.org> on 2026/07/05 14:46:32 UTC, 0 replies.
- [jira] [Commented] (PDFBOX-3293) Chinese font glyphs with overlapping paths not rendered correctly - posted by "Patrick Corless (Jira)" <ji...@apache.org> on 2026/07/05 18:52:00 UTC, 1 replies.
- [jira] [Reopened] (PDFBOX-6175) OutOfMemoryError parsing large CID fonts: soft-reference font cache cleared + W2 range expansion leads to OOM - posted by "Andreas Lehmkühler (Jira)" <ji...@apache.org> on 2026/07/06 15:17:00 UTC, 0 replies.
- [jira] [Commented] (PDFBOX-6175) OutOfMemoryError parsing large CID fonts: soft-reference font cache cleared + W2 range expansion leads to OOM - posted by "ASF subversion and git services (Jira)" <ji...@apache.org> on 2026/07/06 15:27:00 UTC, 4 replies.
- [jira] [Updated] (PDFBOX-6175) OutOfMemoryError parsing large CID fonts: soft-reference font cache cleared + W2 range expansion leads to OOM - posted by "Andreas Lehmkühler (Jira)" <ji...@apache.org> on 2026/07/06 15:31:00 UTC, 0 replies.
- Build failed in Jenkins: PDFBox » PDFBox-3.0.x » Apache Preflight #1372 - posted by Apache Jenkins Server <je...@builds.apache.org> on 2026/07/06 15:43:58 UTC, 0 replies.
- Build failed in Jenkins: PDFBox » PDFBox-3.0.x #1372 - posted by Apache Jenkins Server <je...@builds.apache.org> on 2026/07/06 15:43:59 UTC, 0 replies.
- [jira] [Commented] (PDFBOX-6215) LTV DSS generation creates duplicate certificate streams - posted by "Michael Klink (Jira)" <ji...@apache.org> on 2026/07/06 17:46:00 UTC, 1 replies.
- Jenkins build is back to normal : PDFBox » PDFBox-3.0.x » Apache Preflight #1373 - posted by Apache Jenkins Server <je...@builds.apache.org> on 2026/07/06 18:57:46 UTC, 0 replies.
- Jenkins build is back to normal : PDFBox » PDFBox-3.0.x #1373 - posted by Apache Jenkins Server <je...@builds.apache.org> on 2026/07/06 18:57:47 UTC, 0 replies.
- Re: 3.0.8 release? - posted by Andreas Lehmkühler via dev <de...@pdfbox.apache.org> on 2026/07/06 19:10:32 UTC, 1 replies.
- [jira] [Assigned] (PDFBOX-6213) Run regression tests for 3.0.8 - posted by "Tilman Hausherr (Jira)" <ji...@apache.org> on 2026/07/07 07:03:00 UTC, 0 replies.
- [jira] [Resolved] (PDFBOX-6213) Run regression tests for 3.0.8 - posted by "Tilman Hausherr (Jira)" <ji...@apache.org> on 2026/07/07 07:03:00 UTC, 0 replies.
- [VOTE] Release Apache PDFBox 3.0.8 - posted by Andreas Lehmkühler via dev <de...@pdfbox.apache.org> on 2026/07/08 05:43:36 UTC, 3 replies.
- [RESULT][VOTE] Release Apache PDFBox 3.0.8 - posted by Andreas Lehmkühler via dev <de...@pdfbox.apache.org> on 2026/07/11 09:35:58 UTC, 0 replies.
- [ANNOUNCE] Apache PDFBox 3.0.8 released - posted by Andreas Lehmkühler via dev <de...@pdfbox.apache.org> on 2026/07/11 10:33:57 UTC, 0 replies.
- [PR] delete unused parameters for ShadingContext constructor [pdfbox] - posted by "valerybokov (via GitHub)" <gi...@apache.org> on 2026/07/11 16:16:25 UTC, 2 replies.
- [PR] close-stream-in-PDFontTest.testPDFBox6172 method [pdfbox] - posted by "valerybokov (via GitHub)" <gi...@apache.org> on 2026/07/11 16:52:29 UTC, 1 replies.
- [PR] close streams in TestFontEmbedding [pdfbox] - posted by "valerybokov (via GitHub)" <gi...@apache.org> on 2026/07/11 16:52:43 UTC, 1 replies.
- [PR] fix comment for TTFParser.parseTableHeaders method [pdfbox] - posted by "valerybokov (via GitHub)" <gi...@apache.org> on 2026/07/11 17:05:20 UTC, 1 replies.
- [jira] [Created] (PDFBOX-6217) Run regression tests for 2.0.37 - posted by "Tilman Hausherr (Jira)" <ji...@apache.org> on 2026/07/11 19:30:00 UTC, 0 replies.
- [jira] [Updated] (PDFBOX-6217) Run regression tests for 2.0.37 - posted by "Tilman Hausherr (Jira)" <ji...@apache.org> on 2026/07/11 19:59:00 UTC, 0 replies.
- [jira] [Resolved] (PDFBOX-6217) Run regression tests for 2.0.37 - posted by "Tilman Hausherr (Jira)" <ji...@apache.org> on 2026/07/11 20:05:00 UTC, 0 replies.
- Build failed in Jenkins: PDFBox » PDFBox-trunk » Apache PDFBox parent #3319 - posted by Apache Jenkins Server <je...@builds.apache.org> on 2026/07/11 20:06:56 UTC, 0 replies.
- Build failed in Jenkins: PDFBox » PDFBox-trunk #3319 - posted by Apache Jenkins Server <je...@builds.apache.org> on 2026/07/11 20:06:57 UTC, 0 replies.
- Build failed in Jenkins: PDFBox » PDFBox-trunk » Apache PDFBox parent #3320 - posted by Apache Jenkins Server <je...@builds.apache.org> on 2026/07/11 20:15:50 UTC, 0 replies.
- Build failed in Jenkins: PDFBox » PDFBox-trunk #3320 - posted by Apache Jenkins Server <je...@builds.apache.org> on 2026/07/11 20:15:52 UTC, 0 replies.
- Build failed in Jenkins: PDFBox » PDFBox-trunk » Apache PDFBox parent #3321 - posted by Apache Jenkins Server <je...@builds.apache.org> on 2026/07/11 22:01:01 UTC, 0 replies.
- Build failed in Jenkins: PDFBox » PDFBox-trunk #3321 - posted by Apache Jenkins Server <je...@builds.apache.org> on 2026/07/11 22:01:02 UTC, 0 replies.
- [jira] [Commented] (PDFBOX-6217) Run regression tests for 2.0.37 - posted by "Andreas Lehmkühler (Jira)" <ji...@apache.org> on 2026/07/12 06:17:00 UTC, 0 replies.
- 2.0.37 release - posted by Andreas Lehmkühler via dev <de...@pdfbox.apache.org> on 2026/07/12 06:50:30 UTC, 1 replies.
- [jira] [Commented] (PDFBOX-6212) LTV test assumes OCSP response contains embedded certificate, but e.g. DigiCert OCSP responses omit it - posted by "Tilman Hausherr (Jira)" <ji...@apache.org> on 2026/07/12 08:06:00 UTC, 3 replies.
- [VOTE] Release Apache PDFBox 2.0.37 - posted by Andreas Lehmkühler via dev <de...@pdfbox.apache.org> on 2026/07/12 09:09:47 UTC, 3 replies.
- Jenkins build is back to normal : PDFBox » PDFBox-trunk » Apache PDFBox parent #3323 - posted by Apache Jenkins Server <je...@builds.apache.org> on 2026/07/12 09:14:07 UTC, 0 replies.
- Jenkins build is back to normal : PDFBox » PDFBox-trunk #3323 - posted by Apache Jenkins Server <je...@builds.apache.org> on 2026/07/12 09:14:08 UTC, 0 replies.
- [jira] [Created] (PDFBOX-6218) org.bouncycastle.cms.CMSException: IOException reading content. - posted by "Tilman Hausherr (Jira)" <ji...@apache.org> on 2026/07/12 09:32:00 UTC, 0 replies.
- [jira] [Updated] (PDFBOX-6218) org.bouncycastle.cms.CMSException: IOException reading content. - posted by "Tilman Hausherr (Jira)" <ji...@apache.org> on 2026/07/13 09:40:00 UTC, 2 replies.
- [jira] [Assigned] (PDFBOX-6218) org.bouncycastle.cms.CMSException: IOException reading content. - posted by "Tilman Hausherr (Jira)" <ji...@apache.org> on 2026/07/13 09:40:00 UTC, 0 replies.
- [jira] [Commented] (PDFBOX-6218) org.bouncycastle.cms.CMSException: IOException reading content. - posted by "ASF subversion and git services (Jira)" <ji...@apache.org> on 2026/07/13 10:17:00 UTC, 3 replies.
- [jira] [Resolved] (PDFBOX-6218) org.bouncycastle.cms.CMSException: IOException reading content. - posted by "Tilman Hausherr (Jira)" <ji...@apache.org> on 2026/07/13 10:40:00 UTC, 0 replies.
- Build failed in Jenkins: PDFBox » PDFBox-3.0.x » Apache Preflight #1376 - posted by Apache Jenkins Server <je...@builds.apache.org> on 2026/07/13 10:44:14 UTC, 0 replies.
- Build failed in Jenkins: PDFBox » PDFBox-3.0.x #1376 - posted by Apache Jenkins Server <je...@builds.apache.org> on 2026/07/13 10:44:15 UTC, 0 replies.
- Jenkins build is back to normal : PDFBox » PDFBox-3.0.x » Apache Preflight #1377 - posted by Apache Jenkins Server <je...@builds.apache.org> on 2026/07/13 11:46:48 UTC, 0 replies.
- Jenkins build is back to normal : PDFBox » PDFBox-3.0.x #1377 - posted by Apache Jenkins Server <je...@builds.apache.org> on 2026/07/13 11:46:49 UTC, 0 replies.
- [jira] [Commented] (PDFBOX-5300) Enhance and update PDFBox website & documentation - Part 2 - posted by "ASF subversion and git services (Jira)" <ji...@apache.org> on 2026/07/14 08:10:00 UTC, 2 replies.
- [jira] [Commented] (PDFBOX-6151) Run serenity JBIG2 tests - posted by "Maruan Sahyoun (Jira)" <ji...@apache.org> on 2026/07/14 16:07:00 UTC, 5 replies.
- [RESULT][VOTE] Release Apache PDFBox 2.0.37 - posted by Andreas Lehmkühler via dev <de...@pdfbox.apache.org> on 2026/07/15 09:56:05 UTC, 0 replies.
- [ANNOUNCE] Apache PDFBox 2.0.37 released - posted by Andreas Lehmkühler via dev <de...@pdfbox.apache.org> on 2026/07/15 10:07:03 UTC, 0 replies.
- [jira] [Closed] (PDFBOX-6217) Run regression tests for 2.0.37 - posted by "Andreas Lehmkühler (Jira)" <ji...@apache.org> on 2026/07/15 10:09:00 UTC, 0 replies.
- GSUB splitter rebuilt on every showText - posted by Olivier Bruchez <ol...@bruchez.org> on 2026/07/16 09:15:07 UTC, 7 replies.
- [jira] [Created] (PDFBOX-6219) PDDocument static AWT warm-up fails hard when AWT native libs are unavailable (GraalVM native-image) (2) - posted by "Tilman Hausherr (Jira)" <ji...@apache.org> on 2026/07/16 09:26:00 UTC, 0 replies.
- [jira] [Updated] (PDFBOX-6219) PDDocument static AWT warm-up fails hard when AWT native libs are unavailable (GraalVM native-image) (2) - posted by "Tilman Hausherr (Jira)" <ji...@apache.org> on 2026/07/16 09:29:00 UTC, 2 replies.
- [jira] [Commented] (PDFBOX-6219) PDDocument static AWT warm-up fails hard when AWT native libs are unavailable (GraalVM native-image) (2) - posted by "ASF subversion and git services (Jira)" <ji...@apache.org> on 2026/07/16 10:35:00 UTC, 2 replies.
- Build failed in Jenkins: PDFBox » PDFBox-2.0.x » Apache Preflight #2020 - posted by Apache Jenkins Server <je...@builds.apache.org> on 2026/07/16 10:57:44 UTC, 0 replies.
- Build failed in Jenkins: PDFBox » PDFBox-2.0.x #2020 - posted by Apache Jenkins Server <je...@builds.apache.org> on 2026/07/16 10:57:45 UTC, 0 replies.
- Build failed in Jenkins: PDFBox » PDFBox-2.0.x » Apache Preflight #2021 - posted by Apache Jenkins Server <je...@builds.apache.org> on 2026/07/16 11:05:55 UTC, 0 replies.
- Build failed in Jenkins: PDFBox » PDFBox-2.0.x #2021 - posted by Apache Jenkins Server <je...@builds.apache.org> on 2026/07/16 11:05:56 UTC, 0 replies.
- Build failed in Jenkins: PDFBox » PDFBox-2.0.x » Apache Preflight #2022 - posted by Apache Jenkins Server <je...@builds.apache.org> on 2026/07/16 11:59:17 UTC, 0 replies.
- Build failed in Jenkins: PDFBox » PDFBox-2.0.x #2022 - posted by Apache Jenkins Server <je...@builds.apache.org> on 2026/07/16 11:59:19 UTC, 0 replies.
- Jenkins build is back to normal : PDFBox » PDFBox-2.0.x » Apache Preflight #2023 - posted by Apache Jenkins Server <je...@builds.apache.org> on 2026/07/16 17:49:57 UTC, 0 replies.
- Jenkins build is back to normal : PDFBox » PDFBox-2.0.x #2023 - posted by Apache Jenkins Server <je...@builds.apache.org> on 2026/07/16 17:49:58 UTC, 0 replies.
- [jira] [Resolved] (PDFBOX-6219) PDDocument static AWT warm-up fails hard when AWT native libs are unavailable (GraalVM native-image) (2) - posted by "Tilman Hausherr (Jira)" <ji...@apache.org> on 2026/07/17 04:03:00 UTC, 0 replies.
- [jira] [Created] (PDFBOX-6220) Cache gsubworker to avoid GSUB splitter rebuilt on every showText - posted by "Tilman Hausherr (Jira)" <ji...@apache.org> on 2026/07/17 08:37:00 UTC, 0 replies.
- [jira] [Commented] (PDFBOX-6220) Cache gsubworker to avoid GSUB splitter rebuilt on every showText - posted by "ASF subversion and git services (Jira)" <ji...@apache.org> on 2026/07/17 08:40:00 UTC, 13 replies.
- Build failed in Jenkins: PDFBox » PDFBox-3.0.x » Apache Preflight #1380 - posted by Apache Jenkins Server <je...@builds.apache.org> on 2026/07/17 08:51:10 UTC, 0 replies.
- Build failed in Jenkins: PDFBox » PDFBox-3.0.x #1380 - posted by Apache Jenkins Server <je...@builds.apache.org> on 2026/07/17 08:51:11 UTC, 0 replies.
- Jenkins build is back to normal : PDFBox » PDFBox-3.0.x » Apache Preflight #1381 - posted by Apache Jenkins Server <je...@builds.apache.org> on 2026/07/17 09:05:11 UTC, 0 replies.
- Jenkins build is back to normal : PDFBox » PDFBox-3.0.x #1381 - posted by Apache Jenkins Server <je...@builds.apache.org> on 2026/07/17 09:05:12 UTC, 0 replies.
- [jira] [Comment Edited] (PDFBOX-6220) Cache gsubworker to avoid GSUB splitter rebuilt on every showText - posted by "Tilman Hausherr (Jira)" <ji...@apache.org> on 2026/07/17 10:55:00 UTC, 2 replies.
- [PR] change a message for log in ASCIIHexFilter.decode method [pdfbox] - posted by "valerybokov (via GitHub)" <gi...@apache.org> on 2026/07/19 12:18:39 UTC, 1 replies.
- [PR] delete redundant SuppressWarning in PDVisibleSigBuilder.createAcroFormDictionary method [pdfbox] - posted by "valerybokov (via GitHub)" <gi...@apache.org> on 2026/07/19 12:19:26 UTC, 1 replies.
- [PR] fix log messages format in PNGConverter [pdfbox] - posted by "valerybokov (via GitHub)" <gi...@apache.org> on 2026/07/19 12:21:39 UTC, 2 replies.
- [PR] Fix CCITTFactory.readlong [pdfbox] - posted by "valerybokov (via GitHub)" <gi...@apache.org> on 2026/07/19 13:24:52 UTC, 3 replies.
- [PR] simplify TestPDPage.testNullThreadBeads method [pdfbox] - posted by "valerybokov (via GitHub)" <gi...@apache.org> on 2026/07/19 13:59:10 UTC, 2 replies.
- [PR] delete unneeded close calls in a couple tests [pdfbox] - posted by "valerybokov (via GitHub)" <gi...@apache.org> on 2026/07/19 13:59:34 UTC, 1 replies.
- [PR] fix typo in comment of PNGConverter.buildIndexImage method [pdfbox] - posted by "valerybokov (via GitHub)" <gi...@apache.org> on 2026/07/19 14:00:00 UTC, 1 replies.
- Build failed in Jenkins: PDFBox » PDFBox-3.0.x » Apache PDFBox Layout awt #1382 - posted by Apache Jenkins Server <je...@builds.apache.org> on 2026/07/20 07:44:05 UTC, 0 replies.
- Build failed in Jenkins: PDFBox » PDFBox-3.0.x #1382 - posted by Apache Jenkins Server <je...@builds.apache.org> on 2026/07/20 07:44:06 UTC, 0 replies.
- [jira] (PDFBOX-4951) Sequences of DIN SPEC 91379 with combining letters are rendered incorrectly - posted by "Tilman Hausherr (Jira)" <ji...@apache.org> on 2026/07/20 08:07:00 UTC, 0 replies.
- Jenkins build is back to normal : PDFBox » PDFBox-3.0.x » Apache PDFBox Layout awt #1383 - posted by Apache Jenkins Server <je...@builds.apache.org> on 2026/07/20 08:18:33 UTC, 0 replies.
- Jenkins build is back to normal : PDFBox » PDFBox-3.0.x #1383 - posted by Apache Jenkins Server <je...@builds.apache.org> on 2026/07/20 08:18:34 UTC, 0 replies.
- Build failed in Jenkins: PDFBox » PDFBox-sonar2 » Apache FontBox #2181 - posted by Apache Jenkins Server <je...@builds.apache.org> on 2026/07/20 13:45:05 UTC, 0 replies.
- Build failed in Jenkins: PDFBox » PDFBox-sonar2 #2181 - posted by Apache Jenkins Server <je...@builds.apache.org> on 2026/07/20 13:45:07 UTC, 0 replies.
- [jira] [Updated] (PDFBOX-6220) Cache gsubworker to avoid GSUB splitter rebuilt on every showText - posted by "Tilman Hausherr (Jira)" <ji...@apache.org> on 2026/07/20 13:47:00 UTC, 1 replies.
- Build failed in Jenkins: PDFBox » PDFBox-sonar2 » Apache FontBox #2182 - posted by Apache Jenkins Server <je...@builds.apache.org> on 2026/07/20 13:52:36 UTC, 0 replies.
- Build failed in Jenkins: PDFBox » PDFBox-sonar2 #2182 - posted by Apache Jenkins Server <je...@builds.apache.org> on 2026/07/20 13:52:39 UTC, 0 replies.
- [jira] [Closed] (PDFBOX-3147) PDFBox fail to write Thai character properly - posted by "Tilman Hausherr (Jira)" <ji...@apache.org> on 2026/07/20 13:54:00 UTC, 0 replies.
- Build failed in Jenkins: PDFBox » PDFBox-sonar2 » Apache FontBox #2183 - posted by Apache Jenkins Server <je...@builds.apache.org> on 2026/07/20 14:02:07 UTC, 0 replies.
- Build failed in Jenkins: PDFBox » PDFBox-sonar2 #2183 - posted by Apache Jenkins Server <je...@builds.apache.org> on 2026/07/20 14:02:10 UTC, 0 replies.
- [jira] [Resolved] (PDFBOX-6220) Cache gsubworker to avoid GSUB splitter rebuilt on every showText - posted by "Tilman Hausherr (Jira)" <ji...@apache.org> on 2026/07/20 14:31:00 UTC, 0 replies.
- Jenkins build is back to normal : PDFBox » PDFBox-sonar2 » Apache FontBox #2184 - posted by Apache Jenkins Server <je...@builds.apache.org> on 2026/07/20 14:40:12 UTC, 0 replies.
- Jenkins build is back to normal : PDFBox » PDFBox-sonar2 #2184 - posted by Apache Jenkins Server <je...@builds.apache.org> on 2026/07/20 14:40:15 UTC, 0 replies.
- [jira] [Commented] (PDFBOX-4213) Support Tamil - posted by "Tilman Hausherr (Jira)" <ji...@apache.org> on 2026/07/21 03:59:00 UTC, 0 replies.
- [jira] [Closed] (PDFBOX-4919) Form Field Filling does not render Thai diacritics propertly - posted by "Tilman Hausherr (Jira)" <ji...@apache.org> on 2026/07/21 04:00:00 UTC, 0 replies.
- [jira] [Closed] (PDFBOX-3550) OpenType Shaping - posted by "Tilman Hausherr (Jira)" <ji...@apache.org> on 2026/07/21 04:03:00 UTC, 0 replies.
- Build failed in Jenkins: PDFBox » PDFBox-2.0.x » Apache Preflight #2024 - posted by Apache Jenkins Server <je...@builds.apache.org> on 2026/07/21 19:57:54 UTC, 0 replies.
- Build failed in Jenkins: PDFBox » PDFBox-2.0.x #2024 - posted by Apache Jenkins Server <je...@builds.apache.org> on 2026/07/21 19:57:55 UTC, 0 replies.
- [jira] [Created] (PDFBOX-6221) Replace sylfaen entry - posted by "Tilman Hausherr (Jira)" <ji...@apache.org> on 2026/07/22 07:56:00 UTC, 0 replies.
- [jira] [Commented] (PDFBOX-6221) Replace sylfaen entry - posted by "ASF subversion and git services (Jira)" <ji...@apache.org> on 2026/07/22 07:58:00 UTC, 2 replies.
- [jira] [Created] (PDFBOX-6222) Refactor injectAppearanceStreams - posted by "Tilman Hausherr (Jira)" <ji...@apache.org> on 2026/07/22 08:06:00 UTC, 0 replies.
- [jira] [Commented] (PDFBOX-6222) Refactor injectAppearanceStreams - posted by "ASF subversion and git services (Jira)" <ji...@apache.org> on 2026/07/22 08:07:00 UTC, 1 replies.
- [jira] [Resolved] (PDFBOX-6222) Refactor injectAppearanceStreams - posted by "Tilman Hausherr (Jira)" <ji...@apache.org> on 2026/07/22 08:07:00 UTC, 0 replies.
- [jira] [Resolved] (PDFBOX-6221) Replace sylfaen entry - posted by "Tilman Hausherr (Jira)" <ji...@apache.org> on 2026/07/22 08:19:00 UTC, 0 replies.
- Build failed in Jenkins: PDFBox » PDFBox-2.0.x » Apache Preflight #2025 - posted by Apache Jenkins Server <je...@builds.apache.org> on 2026/07/22 08:57:29 UTC, 0 replies.
- Build failed in Jenkins: PDFBox » PDFBox-2.0.x #2025 - posted by Apache Jenkins Server <je...@builds.apache.org> on 2026/07/22 08:57:31 UTC, 0 replies.
- Build failed in Jenkins: PDFBox » PDFBox-2.0.x » Apache Preflight #2026 - posted by Apache Jenkins Server <je...@builds.apache.org> on 2026/07/22 09:26:35 UTC, 0 replies.
- Build failed in Jenkins: PDFBox » PDFBox-2.0.x #2026 - posted by Apache Jenkins Server <je...@builds.apache.org> on 2026/07/22 09:26:36 UTC, 0 replies.
- Build failed in Jenkins: PDFBox » PDFBox-2.0.x » Apache Preflight #2027 - posted by Apache Jenkins Server <je...@builds.apache.org> on 2026/07/22 11:57:26 UTC, 0 replies.
- Build failed in Jenkins: PDFBox » PDFBox-2.0.x #2027 - posted by Apache Jenkins Server <je...@builds.apache.org> on 2026/07/22 11:57:27 UTC, 0 replies.
- Build failed in Jenkins: PDFBox » PDFBox-2.0.x » Apache Preflight #2028 - posted by Apache Jenkins Server <je...@builds.apache.org> on 2026/07/22 12:57:33 UTC, 0 replies.
- Build failed in Jenkins: PDFBox » PDFBox-2.0.x #2028 - posted by Apache Jenkins Server <je...@builds.apache.org> on 2026/07/22 12:57:34 UTC, 0 replies.
- Build failed in Jenkins: PDFBox » PDFBox-2.0.x » Apache Preflight #2029 - posted by Apache Jenkins Server <je...@builds.apache.org> on 2026/07/22 13:57:48 UTC, 0 replies.
- Build failed in Jenkins: PDFBox » PDFBox-2.0.x #2029 - posted by Apache Jenkins Server <je...@builds.apache.org> on 2026/07/22 13:57:49 UTC, 0 replies.
- Build failed in Jenkins: PDFBox » PDFBox-2.0.x #2030 - posted by Apache Jenkins Server <je...@builds.apache.org> on 2026/07/22 17:45:31 UTC, 0 replies.
- Build failed in Jenkins: PDFBox » PDFBox-2.0.x » Apache Preflight #2031 - posted by Apache Jenkins Server <je...@builds.apache.org> on 2026/07/22 18:29:54 UTC, 0 replies.
- Build failed in Jenkins: PDFBox » PDFBox-2.0.x #2031 - posted by Apache Jenkins Server <je...@builds.apache.org> on 2026/07/22 18:29:57 UTC, 0 replies.
- Build failed in Jenkins: PDFBox » PDFBox-2.0.x » Apache Preflight #2032 - posted by Apache Jenkins Server <je...@builds.apache.org> on 2026/07/22 18:34:21 UTC, 0 replies.
- Build failed in Jenkins: PDFBox » PDFBox-2.0.x #2032 - posted by Apache Jenkins Server <je...@builds.apache.org> on 2026/07/22 18:34:22 UTC, 0 replies.
- Build failed in Jenkins: PDFBox » PDFBox-2.0.x #2033 - posted by Apache Jenkins Server <je...@builds.apache.org> on 2026/07/22 19:22:42 UTC, 0 replies.
- Build failed in Jenkins: PDFBox » PDFBox-2.0.x #2034 - posted by Apache Jenkins Server <je...@builds.apache.org> on 2026/07/22 19:24:53 UTC, 0 replies.
- Jenkins build is back to normal : PDFBox » PDFBox-2.0.x » Apache Preflight #2035 - posted by Apache Jenkins Server <je...@builds.apache.org> on 2026/07/22 19:40:25 UTC, 0 replies.
- Jenkins build is back to normal : PDFBox » PDFBox-2.0.x #2035 - posted by Apache Jenkins Server <je...@builds.apache.org> on 2026/07/22 19:40:26 UTC, 0 replies.
- Build failed in Jenkins: PDFBox » PDFBox-2.0.x » Apache Preflight #2036 - posted by Apache Jenkins Server <je...@builds.apache.org> on 2026/07/23 04:57:56 UTC, 0 replies.
- Build failed in Jenkins: PDFBox » PDFBox-2.0.x #2036 - posted by Apache Jenkins Server <je...@builds.apache.org> on 2026/07/23 04:57:57 UTC, 0 replies.
- Jenkins build is back to normal : PDFBox » PDFBox-2.0.x » Apache Preflight #2037 - posted by Apache Jenkins Server <je...@builds.apache.org> on 2026/07/23 09:05:23 UTC, 0 replies.
- Jenkins build is back to normal : PDFBox » PDFBox-2.0.x #2037 - posted by Apache Jenkins Server <je...@builds.apache.org> on 2026/07/23 09:05:24 UTC, 0 replies.
- [jira] [Commented] (PDFBOX-6169) Request to make PDFont.encode public - posted by "Philip Helger (Jira)" <ji...@apache.org> on 2026/07/23 11:22:00 UTC, 1 replies.
- [jira] [Commented] (PDFBOX-6170) Request to make PDDocument.getFontsToSubset() public - posted by "Tilman Hausherr (Jira)" <ji...@apache.org> on 2026/07/23 16:49:00 UTC, 0 replies.
- [PR] Fix ccittfactory.readlong v2 [pdfbox] - posted by "valerybokov (via GitHub)" <gi...@apache.org> on 2026/07/23 17:17:51 UTC, 1 replies.
- [jira] [Comment Edited] (PDFBOX-6169) Request to make PDFont.encode public - posted by "Tilman Hausherr (Jira)" <ji...@apache.org> on 2026/07/24 04:23:00 UTC, 0 replies.
- Re: [PR] Example for glyph positioning [pdfbox] - posted by "vk-github18 (via GitHub)" <gi...@apache.org> on 2026/07/24 07:39:35 UTC, 1 replies.
- Build failed in Jenkins: PDFBox » PDFBox-2.0.x » Apache Preflight #2039 - posted by Apache Jenkins Server <je...@builds.apache.org> on 2026/07/24 11:03:07 UTC, 0 replies.
- Build failed in Jenkins: PDFBox » PDFBox-2.0.x #2039 - posted by Apache Jenkins Server <je...@builds.apache.org> on 2026/07/24 11:03:09 UTC, 0 replies.
- Build failed in Jenkins: PDFBox » PDFBox-2.0.x » Apache Preflight #2040 - posted by Apache Jenkins Server <je...@builds.apache.org> on 2026/07/24 13:28:01 UTC, 0 replies.
- Build failed in Jenkins: PDFBox » PDFBox-2.0.x #2040 - posted by Apache Jenkins Server <je...@builds.apache.org> on 2026/07/24 13:28:02 UTC, 0 replies.
- [jira] [Updated] (PDFBOX-6212) LTV test assumes OCSP response contains embedded certificate, but e.g. DigiCert OCSP responses omit it - posted by "Tilman Hausherr (Jira)" <ji...@apache.org> on 2026/07/24 15:01:00 UTC, 2 replies.
- [jira] [Assigned] (PDFBOX-6212) LTV test assumes OCSP response contains embedded certificate, but e.g. DigiCert OCSP responses omit it - posted by "Tilman Hausherr (Jira)" <ji...@apache.org> on 2026/07/24 15:01:00 UTC, 0 replies.
- [jira] [Resolved] (PDFBOX-6212) LTV test assumes OCSP response contains embedded certificate, but e.g. DigiCert OCSP responses omit it - posted by "Tilman Hausherr (Jira)" <ji...@apache.org> on 2026/07/24 15:01:00 UTC, 0 replies.
- [jira] [Created] (PDFBOX-6223) Text areas completely missing on print - posted by "Tres Finocchiaro (Jira)" <ji...@apache.org> on 2026/07/24 15:14:00 UTC, 0 replies.
- [jira] [Updated] (PDFBOX-6223) Text areas completely missing on print - posted by "Tres Finocchiaro (Jira)" <ji...@apache.org> on 2026/07/24 15:15:00 UTC, 9 replies.
- [jira] [Commented] (PDFBOX-6223) Text areas completely missing on print - posted by "Tilman Hausherr (Jira)" <ji...@apache.org> on 2026/07/24 15:30:00 UTC, 30 replies.
- [jira] [Comment Edited] (PDFBOX-6223) Text areas completely missing on print - posted by "Tilman Hausherr (Jira)" <ji...@apache.org> on 2026/07/24 15:41:00 UTC, 10 replies.
- Build failed in Jenkins: PDFBox » PDFBox-3.0.x » Apache Preflight #1397 - posted by Apache Jenkins Server <je...@builds.apache.org> on 2026/07/24 15:43:50 UTC, 0 replies.
- Build failed in Jenkins: PDFBox » PDFBox-3.0.x #1397 - posted by Apache Jenkins Server <je...@builds.apache.org> on 2026/07/24 15:43:52 UTC, 0 replies.
- Jenkins build is back to normal : PDFBox » PDFBox-2.0.x » Apache Preflight #2041 - posted by Apache Jenkins Server <je...@builds.apache.org> on 2026/07/24 16:02:07 UTC, 0 replies.
- Jenkins build is back to normal : PDFBox » PDFBox-2.0.x #2041 - posted by Apache Jenkins Server <je...@builds.apache.org> on 2026/07/24 16:02:08 UTC, 0 replies.
- [PR] close PDDocument in MultilineFieldsTest.testMultilineAuto method [pdfbox] - posted by "valerybokov (via GitHub)" <gi...@apache.org> on 2026/07/25 08:41:46 UTC, 1 replies.
- [PR] Add PDRadioButton.setNoToggleToOff and isNoToggleToOff methods [pdfbox] - posted by "valerybokov (via GitHub)" <gi...@apache.org> on 2026/07/25 09:04:30 UTC, 1 replies.
- [jira] [Created] (PDFBOX-6224) Add PDRadioButton.setNoToggleToOff and isNoToggleToOff methods - posted by "Tilman Hausherr (Jira)" <ji...@apache.org> on 2026/07/25 14:20:00 UTC, 0 replies.
- [jira] [Resolved] (PDFBOX-6224) Add PDRadioButton.setNoToggleToOff and isNoToggleToOff methods - posted by "Tilman Hausherr (Jira)" <ji...@apache.org> on 2026/07/25 14:38:00 UTC, 0 replies.
- [jira] [Commented] (PDFBOX-6224) Add PDRadioButton.setNoToggleToOff and isNoToggleToOff methods - posted by "ASF subversion and git services (Jira)" <ji...@apache.org> on 2026/07/25 14:38:00 UTC, 2 replies.
- Jenkins build is back to normal : PDFBox » PDFBox-3.0.x » Apache Preflight #1398 - posted by Apache Jenkins Server <je...@builds.apache.org> on 2026/07/25 14:53:04 UTC, 0 replies.
- Jenkins build is back to normal : PDFBox » PDFBox-3.0.x #1398 - posted by Apache Jenkins Server <je...@builds.apache.org> on 2026/07/25 14:53:05 UTC, 0 replies.
- Build failed in Jenkins: PDFBox » PDFBox-2.0.x » Apache Preflight #2042 - posted by Apache Jenkins Server <je...@builds.apache.org> on 2026/07/25 14:57:36 UTC, 0 replies.
- Build failed in Jenkins: PDFBox » PDFBox-2.0.x #2042 - posted by Apache Jenkins Server <je...@builds.apache.org> on 2026/07/25 14:57:37 UTC, 0 replies.
- Build failed in Jenkins: PDFBox » PDFBox-2.0.x » Apache Preflight #2044 - posted by Apache Jenkins Server <je...@builds.apache.org> on 2026/07/25 15:50:17 UTC, 0 replies.
- Build failed in Jenkins: PDFBox » PDFBox-2.0.x #2044 - posted by Apache Jenkins Server <je...@builds.apache.org> on 2026/07/25 15:50:18 UTC, 0 replies.
- [jira] [Created] (PDFBOX-6225) Use log4j for build tests in 2.0 - posted by "Tilman Hausherr (Jira)" <ji...@apache.org> on 2026/07/25 16:17:00 UTC, 0 replies.
- [jira] [Commented] (PDFBOX-6225) Use log4j for build tests in 2.0 - posted by "ASF subversion and git services (Jira)" <ji...@apache.org> on 2026/07/25 16:20:00 UTC, 2 replies.
- [jira] [Resolved] (PDFBOX-6225) Use log4j for build tests in 2.0 - posted by "Tilman Hausherr (Jira)" <ji...@apache.org> on 2026/07/25 16:27:00 UTC, 0 replies.
- Build failed in Jenkins: PDFBox » PDFBox-2.0.x » Apache Preflight #2045 - posted by Apache Jenkins Server <je...@builds.apache.org> on 2026/07/25 17:39:47 UTC, 0 replies.
- Jenkins build became unstable: PDFBox » PDFBox-2.0.x » Apache PDFBox #2045 - posted by Apache Jenkins Server <je...@builds.apache.org> on 2026/07/25 17:39:47 UTC, 0 replies.
- Build failed in Jenkins: PDFBox » PDFBox-2.0.x #2045 - posted by Apache Jenkins Server <je...@builds.apache.org> on 2026/07/25 17:39:48 UTC, 0 replies.
- Jenkins build is back to stable : PDFBox » PDFBox-2.0.x » Apache PDFBox #2046 - posted by Apache Jenkins Server <je...@builds.apache.org> on 2026/07/25 18:48:05 UTC, 0 replies.
- Build failed in Jenkins: PDFBox » PDFBox-2.0.x » Apache Preflight #2046 - posted by Apache Jenkins Server <je...@builds.apache.org> on 2026/07/25 18:48:05 UTC, 0 replies.
- Build failed in Jenkins: PDFBox » PDFBox-2.0.x #2046 - posted by Apache Jenkins Server <je...@builds.apache.org> on 2026/07/25 18:48:06 UTC, 0 replies.
- Build failed in Jenkins: PDFBox » PDFBox-2.0.x » Apache Preflight #2047 - posted by Apache Jenkins Server <je...@builds.apache.org> on 2026/07/26 04:20:10 UTC, 0 replies.
- Build failed in Jenkins: PDFBox » PDFBox-2.0.x #2047 - posted by Apache Jenkins Server <je...@builds.apache.org> on 2026/07/26 04:20:11 UTC, 0 replies.
- Build failed in Jenkins: PDFBox » PDFBox-trunk » Apache PDFBox Debugger #3347 - posted by Apache Jenkins Server <je...@builds.apache.org> on 2026/07/26 12:04:50 UTC, 0 replies.
- Build failed in Jenkins: PDFBox » PDFBox-trunk #3347 - posted by Apache Jenkins Server <je...@builds.apache.org> on 2026/07/26 12:04:51 UTC, 0 replies.
- Build failed in Jenkins: PDFBox » PDFBox-sonar2 » Apache PDFBox Debugger #2204 - posted by Apache Jenkins Server <je...@builds.apache.org> on 2026/07/26 12:16:27 UTC, 0 replies.
- Build failed in Jenkins: PDFBox » PDFBox-sonar2 #2204 - posted by Apache Jenkins Server <je...@builds.apache.org> on 2026/07/26 12:16:29 UTC, 0 replies.
- [jira] [Created] (PDFBOX-6226) Cache byte representation of operator names instead of creating them again and again - posted by "Andreas Lehmkühler (Jira)" <ji...@apache.org> on 2026/07/26 15:09:00 UTC, 0 replies.
- [jira] [Commented] (PDFBOX-6226) Cache byte representation of operator names instead of creating them again and again - posted by "ASF subversion and git services (Jira)" <ji...@apache.org> on 2026/07/26 15:11:00 UTC, 6 replies.
- Build failed in Jenkins: PDFBox » PDFBox-trunk » Apache PDFBox #3348 - posted by Apache Jenkins Server <je...@builds.apache.org> on 2026/07/26 16:03:38 UTC, 0 replies.
- Build failed in Jenkins: PDFBox » PDFBox-trunk #3348 - posted by Apache Jenkins Server <je...@builds.apache.org> on 2026/07/26 16:03:39 UTC, 0 replies.
- Build failed in Jenkins: PDFBox » PDFBox-3.0.x » Apache PDFBox #1400 - posted by Apache Jenkins Server <je...@builds.apache.org> on 2026/07/26 16:43:58 UTC, 0 replies.
- Build failed in Jenkins: PDFBox » PDFBox-3.0.x #1400 - posted by Apache Jenkins Server <je...@builds.apache.org> on 2026/07/26 16:43:59 UTC, 0 replies.
- Build failed in Jenkins: PDFBox » PDFBox-sonar2 » Apache PDFBox Debugger #2205 - posted by Apache Jenkins Server <je...@builds.apache.org> on 2026/07/26 17:48:49 UTC, 0 replies.
- Build failed in Jenkins: PDFBox » PDFBox-sonar2 #2205 - posted by Apache Jenkins Server <je...@builds.apache.org> on 2026/07/26 17:48:52 UTC, 0 replies.
- Jenkins build is back to normal : PDFBox » PDFBox-3.0.x » Apache PDFBox #1401 - posted by Apache Jenkins Server <je...@builds.apache.org> on 2026/07/26 20:47:54 UTC, 0 replies.
- Jenkins build is back to normal : PDFBox » PDFBox-3.0.x #1401 - posted by Apache Jenkins Server <je...@builds.apache.org> on 2026/07/26 20:47:55 UTC, 0 replies.
- Jenkins build is back to normal : PDFBox » PDFBox-trunk » Apache PDFBox #3349 - posted by Apache Jenkins Server <je...@builds.apache.org> on 2026/07/26 21:33:52 UTC, 0 replies.
- Jenkins build is back to normal : PDFBox » PDFBox-trunk » Apache PDFBox Debugger #3349 - posted by Apache Jenkins Server <je...@builds.apache.org> on 2026/07/26 21:33:52 UTC, 0 replies.
- Jenkins build is back to normal : PDFBox » PDFBox-trunk #3349 - posted by Apache Jenkins Server <je...@builds.apache.org> on 2026/07/26 21:33:53 UTC, 0 replies.
- Build failed in Jenkins: PDFBox » PDFBox-2.0.x » Apache Preflight #2048 - posted by Apache Jenkins Server <je...@builds.apache.org> on 2026/07/27 03:20:02 UTC, 0 replies.
- Build failed in Jenkins: PDFBox » PDFBox-2.0.x #2048 - posted by Apache Jenkins Server <je...@builds.apache.org> on 2026/07/27 03:20:03 UTC, 0 replies.
- Jenkins build is back to normal : PDFBox » PDFBox-sonar2 » Apache PDFBox Debugger #2206 - posted by Apache Jenkins Server <je...@builds.apache.org> on 2026/07/27 03:29:00 UTC, 0 replies.
- Jenkins build became unstable: PDFBox » PDFBox-sonar2 » Apache PDFBox #2206 - posted by Apache Jenkins Server <je...@builds.apache.org> on 2026/07/27 03:29:00 UTC, 0 replies.
- Jenkins build is unstable: PDFBox » PDFBox-sonar2 #2206 - posted by Apache Jenkins Server <je...@builds.apache.org> on 2026/07/27 03:29:03 UTC, 0 replies.
- Jenkins build is back to stable : PDFBox » PDFBox-sonar2 » Apache PDFBox #2207 - posted by Apache Jenkins Server <je...@builds.apache.org> on 2026/07/27 03:48:45 UTC, 0 replies.
- Jenkins build is back to stable : PDFBox » PDFBox-sonar2 #2207 - posted by Apache Jenkins Server <je...@builds.apache.org> on 2026/07/27 03:48:47 UTC, 0 replies.
- Jenkins build is back to normal : PDFBox » PDFBox-2.0.x » Apache Preflight #2049 - posted by Apache Jenkins Server <je...@builds.apache.org> on 2026/07/27 08:28:30 UTC, 0 replies.
- Jenkins build is back to normal : PDFBox » PDFBox-2.0.x #2049 - posted by Apache Jenkins Server <je...@builds.apache.org> on 2026/07/27 08:28:31 UTC, 0 replies.
- [jira] [Assigned] (PDFBOX-6223) Text areas completely missing on print - posted by "Tilman Hausherr (Jira)" <ji...@apache.org> on 2026/07/27 10:10:00 UTC, 0 replies.
- [jira] [Resolved] (PDFBOX-6223) Text areas completely missing on print - posted by "Tilman Hausherr (Jira)" <ji...@apache.org> on 2026/07/27 10:13:00 UTC, 0 replies.
- [PR] Fix image masks (PDFBOX-6077) [pdfbox] - posted by "valerybokov (via GitHub)" <gi...@apache.org> on 2026/07/27 16:27:20 UTC, 2 replies.
- [PR] PDFBOX-6077: Add regression tests for stencil-mask pattern fills [pdfbox] - posted by "valerybokov (via GitHub)" <gi...@apache.org> on 2026/07/27 16:39:31 UTC, 0 replies.
- [jira] [Created] (PDFBOX-6227) Catch acroform cycles - posted by "Tilman Hausherr (Jira)" <ji...@apache.org> on 2026/07/30 04:22:00 UTC, 0 replies.
- [jira] [Created] (PDFBOX-6228) Catch structure element cycles - posted by "Tilman Hausherr (Jira)" <ji...@apache.org> on 2026/07/30 04:24:00 UTC, 0 replies.
- [jira] [Commented] (PDFBOX-6227) Catch acroform cycles - posted by "ASF subversion and git services (Jira)" <ji...@apache.org> on 2026/07/30 08:25:00 UTC, 7 replies.
- [jira] [Resolved] (PDFBOX-6227) Catch acroform cycles - posted by "Tilman Hausherr (Jira)" <ji...@apache.org> on 2026/07/30 08:25:00 UTC, 0 replies.
- Build failed in Jenkins: PDFBox » PDFBox-3.0.x » Apache Preflight #1406 - posted by Apache Jenkins Server <je...@builds.apache.org> on 2026/07/30 08:43:32 UTC, 0 replies.
- Build failed in Jenkins: PDFBox » PDFBox-3.0.x #1406 - posted by Apache Jenkins Server <je...@builds.apache.org> on 2026/07/30 08:43:33 UTC, 0 replies.
- [jira] [Resolved] (PDFBOX-6228) Catch structure element cycles - posted by "Tilman Hausherr (Jira)" <ji...@apache.org> on 2026/07/30 09:04:00 UTC, 0 replies.
- [jira] [Commented] (PDFBOX-6228) Catch structure element cycles - posted by "ASF subversion and git services (Jira)" <ji...@apache.org> on 2026/07/30 09:04:00 UTC, 2 replies.
- [jira] [Updated] (PDFBOX-6228) Catch structure element cycles - posted by "Tilman Hausherr (Jira)" <ji...@apache.org> on 2026/07/30 09:04:00 UTC, 0 replies.
- Build failed in Jenkins: PDFBox » PDFBox-3.0.x » Apache Preflight #1407 - posted by Apache Jenkins Server <je...@builds.apache.org> on 2026/07/30 09:22:47 UTC, 0 replies.
- Build failed in Jenkins: PDFBox » PDFBox-3.0.x #1407 - posted by Apache Jenkins Server <je...@builds.apache.org> on 2026/07/30 09:22:48 UTC, 0 replies.
- Jenkins build is back to normal : PDFBox » PDFBox-3.0.x » Apache Preflight #1408 - posted by Apache Jenkins Server <je...@builds.apache.org> on 2026/07/30 09:47:28 UTC, 0 replies.
- Jenkins build is back to normal : PDFBox » PDFBox-3.0.x #1408 - posted by Apache Jenkins Server <je...@builds.apache.org> on 2026/07/30 09:47:29 UTC, 0 replies.
- Build failed in Jenkins: PDFBox » PDFBox-2.0.x » Apache Preflight #2055 - posted by Apache Jenkins Server <je...@builds.apache.org> on 2026/07/30 15:58:39 UTC, 0 replies.
- Build failed in Jenkins: PDFBox » PDFBox-2.0.x #2055 - posted by Apache Jenkins Server <je...@builds.apache.org> on 2026/07/30 15:58:41 UTC, 0 replies.
- Jenkins build is back to normal : PDFBox » PDFBox-2.0.x » Apache Preflight #2056 - posted by Apache Jenkins Server <je...@builds.apache.org> on 2026/07/30 18:52:47 UTC, 0 replies.
- Jenkins build is back to normal : PDFBox » PDFBox-2.0.x #2056 - posted by Apache Jenkins Server <je...@builds.apache.org> on 2026/07/30 18:52:48 UTC, 0 replies.
- [jira] [Created] (PDFBOX-6229) Check minimum size of a line of a xref stream - posted by "Andreas Lehmkühler (Jira)" <ji...@apache.org> on 2026/07/31 06:17:00 UTC, 0 replies.
- [jira] [Commented] (PDFBOX-6229) Check minimum size of a line of a xref stream - posted by "ASF subversion and git services (Jira)" <ji...@apache.org> on 2026/07/31 06:21:00 UTC, 2 replies.
- Build failed in Jenkins: PDFBox » PDFBox-2.0.x » Apache Preflight #2057 - posted by Apache Jenkins Server <je...@builds.apache.org> on 2026/07/31 06:56:43 UTC, 0 replies.
- Build failed in Jenkins: PDFBox » PDFBox-2.0.x #2057 - posted by Apache Jenkins Server <je...@builds.apache.org> on 2026/07/31 06:56:44 UTC, 0 replies.
- Jenkins build is back to normal : PDFBox » PDFBox-2.0.x » Apache Preflight #2058 - posted by Apache Jenkins Server <je...@builds.apache.org> on 2026/07/31 08:05:33 UTC, 0 replies.
- Jenkins build is back to normal : PDFBox » PDFBox-2.0.x #2058 - posted by Apache Jenkins Server <je...@builds.apache.org> on 2026/07/31 08:05:34 UTC, 0 replies.
- [jira] [Resolved] (PDFBOX-4951) Sequences of DIN SPEC 91379 with combining letters are rendered incorrectly - posted by "Tilman Hausherr (Jira)" <ji...@apache.org> on 2026/07/31 11:02:28 UTC, 0 replies.