You are viewing a plain text version of this content. The canonical link for it is here.
Posted to dev@pdfbox.apache.org by Apache Jenkins Server <je...@builds.apache.org> on 2026/07/30 09:22:48 UTC
Build failed in Jenkins: PDFBox » PDFBox-3.0.x #1407
See <https://ci-builds.apache.org/job/PDFBox/job/PDFBox-3.0.x/1407/display/redirect?page=changes>
Changes:
[Tilman Hausherr] PDFBOX-4951: Sonar fix
[Tilman Hausherr] PDFBOX-4951: add FOP based glyph layout, by Volker Kunert
[Tilman Hausherr] PDFBOX-6228: catch cycle
[Tilman Hausherr] PDFBOX-6227: fix typo
[Tilman Hausherr] PDFBOX-4951: AWT instead of awt
[Tilman Hausherr] PDFBOX-4951: fix scm
------------------------------------------
[...truncated 515.91 KiB...]
[INFO] Tests run: 1, Failures: 0, Errors: 0, Skipped: 0, Time elapsed: 1.162 s -- in org.apache.pdfbox.glyphlayout.fop.GlyphLayoutBidiTest
[INFO] Running org.apache.pdfbox.glyphlayout.fop.GlyphLayoutHelloWorldTest
target/HelloWorld.pdf created!
[INFO] Tests run: 1, Failures: 0, Errors: 0, Skipped: 0, Time elapsed: 0.183 s -- in org.apache.pdfbox.glyphlayout.fop.GlyphLayoutHelloWorldTest
[INFO] Running org.apache.pdfbox.glyphlayout.fop.GlyphLayoutDin91379FormTest
Jul 30, 2026 9:21:40 AM org.apache.fontbox.ttf.PostScriptTable read
WARNING: No PostScript name data is provided for the font NotoSans-Regular
Jul 30, 2026 9:21:40 AM org.apache.fontbox.ttf.PostScriptTable read
WARNING: No PostScript name data is provided for the font NotoSans-Regular
Jul 30, 2026 9:21:40 AM org.apache.fontbox.ttf.PostScriptTable read
WARNING: No PostScript name data is provided for the font NotoSans-Regular
Jul 30, 2026 9:21:41 AM org.apache.fontbox.ttf.PostScriptTable read
WARNING: No PostScript name data is provided for the font NotoSans-Regular
[INFO] Tests run: 1, Failures: 0, Errors: 0, Skipped: 0, Time elapsed: 1.333 s -- in org.apache.pdfbox.glyphlayout.fop.GlyphLayoutDin91379FormTest
[INFO] Running org.apache.pdfbox.glyphlayout.fop.GlyphLayoutLigaturesAndKerningTest
Jul 30, 2026 9:21:41 AM org.apache.fop.complexscripts.fonts.GlyphClassTable$CoverageSetClassTable <init>
WARNING: coverage set class table not yet supported
Jul 30, 2026 9:21:41 AM org.apache.fop.complexscripts.fonts.GlyphClassTable$CoverageSetClassTable <init>
WARNING: coverage set class table not yet supported
Jul 30, 2026 9:21:41 AM org.apache.fop.complexscripts.fonts.GlyphClassTable$CoverageSetClassTable <init>
WARNING: coverage set class table not yet supported
Jul 30, 2026 9:21:42 AM org.apache.fop.complexscripts.scripts.IndicScriptProcessor getSyllabizer
WARNING: No syllabizer available for script 'bng2', language 'dflt', using default Indic syllabizer.
Jul 30, 2026 9:21:42 AM org.apache.pdfbox.pdmodel.PDAbstractContentStream close
WARNING: You did not call endText(), some viewers won't display your text
[INFO] Tests run: 2, Failures: 0, Errors: 0, Skipped: 0, Time elapsed: 0.484 s -- in org.apache.pdfbox.glyphlayout.fop.GlyphLayoutLigaturesAndKerningTest
[INFO] Running org.apache.pdfbox.glyphlayout.fop.GlyphLayoutSMPTest
Jul 30, 2026 9:21:42 AM org.apache.fontbox.ttf.CmapSubtable processSubtype14
WARNING: Format 14 cmap table is not supported and will be ignored
Jul 30, 2026 9:21:42 AM org.apache.fop.complexscripts.fonts.GlyphClassTable$CoverageSetClassTable <init>
WARNING: coverage set class table not yet supported
[INFO] Tests run: 1, Failures: 0, Errors: 0, Skipped: 0, Time elapsed: 0.159 s -- in org.apache.pdfbox.glyphlayout.fop.GlyphLayoutSMPTest
[INFO] Running org.apache.pdfbox.glyphlayout.fop.GlyphLayoutDin91379Test
[INFO] Tests run: 1, Failures: 0, Errors: 0, Skipped: 0, Time elapsed: 0.355 s -- in org.apache.pdfbox.glyphlayout.fop.GlyphLayoutDin91379Test
[INFO]
[INFO] Results:
[INFO]
[INFO] Tests run: 7, Failures: 0, Errors: 0, Skipped: 0
[INFO]
[JENKINS] Recording test results
[INFO]
[INFO] --- animal-sniffer:1.27:check (check-java-version) @ pdfbox-layout-fop ---
[INFO] Checking unresolved references to org.codehaus.mojo.signature:java18:1.0
[INFO]
[INFO] --- bundle:5.1.9:bundle (default-bundle) @ pdfbox-layout-fop ---
[INFO] Building bundle: <https://ci-builds.apache.org/job/PDFBox/job/PDFBox-3.0.x/ws/pdfbox-layout-fop/target/pdfbox-layout-fop-3.0.9-SNAPSHOT.jar>
[INFO] Writing manifest: <https://ci-builds.apache.org/job/PDFBox/job/PDFBox-3.0.x/ws/pdfbox-layout-fop/target/classes/META-INF/MANIFEST.MF>
[INFO]
[INFO] --- apache-rat:0.17:check (default) @ pdfbox-layout-fop ---
[WARNING] Basedir is : <https://ci-builds.apache.org/job/PDFBox/job/PDFBox-3.0.x/ws/pdfbox-layout-fop>
[INFO] Excluding patterns: src/test/resources/pdf/*.pdf, src/test/resources/txt/GlyphLayoutDIN91379.txt
[INFO] Excluding MAVEN collection.
[INFO] Excluding ECLIPSE collection.
[INFO] Excluding IDEA collection.
[INFO] Processing exclude file from STANDARD_SCMS.
[INFO] Excluding STANDARD_SCMS collection.
[INFO] Excluding MISC collection.
[INFO] Excluding HIDDEN_DIR collection.
[INFO] RAT summary:
[INFO] Approved: 13
[INFO] Archives: 0
[INFO] Binaries: 8
[INFO] Document types: 4
[INFO] Ignored: 9
[INFO] License categories: 1
[INFO] License names: 1
[INFO] Notices: 1
[INFO] Standards: 13
[INFO] Unapproved: 0
[INFO] Unknown: 0
[INFO]
[INFO] --- dependency-check:10.0.4:check (default) @ pdfbox-layout-fop ---
[INFO] Skipping dependency-check
[INFO]
[INFO] --- install:3.1.4:install (default-install) @ pdfbox-layout-fop ---
[INFO] Installing <https://ci-builds.apache.org/job/PDFBox/job/PDFBox-3.0.x/ws/pdfbox-layout-fop/pom.xml> to /home/jenkins/.m2/repository/org/apache/pdfbox/pdfbox-layout-fop/3.0.9-SNAPSHOT/pdfbox-layout-fop-3.0.9-SNAPSHOT.pom
[INFO] Installing <https://ci-builds.apache.org/job/PDFBox/job/PDFBox-3.0.x/ws/pdfbox-layout-fop/target/pdfbox-layout-fop-3.0.9-SNAPSHOT.jar> to /home/jenkins/.m2/repository/org/apache/pdfbox/pdfbox-layout-fop/3.0.9-SNAPSHOT/pdfbox-layout-fop-3.0.9-SNAPSHOT.jar
[INFO]
[INFO] --- bundle:5.1.9:install (default-install) @ pdfbox-layout-fop ---
[INFO] Installing org/apache/pdfbox/pdfbox-layout-fop/3.0.9-SNAPSHOT/pdfbox-layout-fop-3.0.9-SNAPSHOT.jar
[INFO] Writing OBR metadata
[INFO]
[INFO] --- deploy:3.1.4:deploy (default-deploy) @ pdfbox-layout-fop ---
[INFO] Downloading from apache.snapshots.https: https://repository.apache.org/content/repositories/snapshots/org/apache/pdfbox/pdfbox-layout-fop/3.0.9-SNAPSHOT/maven-metadata.xml
[INFO] Uploading to apache.snapshots.https: https://repository.apache.org/content/repositories/snapshots/org/apache/pdfbox/pdfbox-layout-fop/3.0.9-SNAPSHOT/pdfbox-layout-fop-3.0.9-20260730.091650-1.pom
[INFO] Uploaded to apache.snapshots.https: https://repository.apache.org/content/repositories/snapshots/org/apache/pdfbox/pdfbox-layout-fop/3.0.9-SNAPSHOT/pdfbox-layout-fop-3.0.9-20260730.091650-1.pom (3.8 kB at 3.6 kB/s)
[INFO] Uploading to apache.snapshots.https: https://repository.apache.org/content/repositories/snapshots/org/apache/pdfbox/pdfbox-layout-fop/3.0.9-SNAPSHOT/pdfbox-layout-fop-3.0.9-20260730.091650-1.jar
[INFO] Uploaded to apache.snapshots.https: https://repository.apache.org/content/repositories/snapshots/org/apache/pdfbox/pdfbox-layout-fop/3.0.9-SNAPSHOT/pdfbox-layout-fop-3.0.9-20260730.091650-1.jar (20 kB at 16 kB/s)
[INFO] Downloading from apache.snapshots.https: https://repository.apache.org/content/repositories/snapshots/org/apache/pdfbox/pdfbox-layout-fop/maven-metadata.xml
[INFO] Downloaded from apache.snapshots.https: https://repository.apache.org/content/repositories/snapshots/org/apache/pdfbox/pdfbox-layout-fop/maven-metadata.xml (294 B at 1.7 kB/s)
[INFO] Uploading to apache.snapshots.https: https://repository.apache.org/content/repositories/snapshots/org/apache/pdfbox/pdfbox-layout-fop/3.0.9-SNAPSHOT/maven-metadata.xml
[INFO] Uploaded to apache.snapshots.https: https://repository.apache.org/content/repositories/snapshots/org/apache/pdfbox/pdfbox-layout-fop/3.0.9-SNAPSHOT/maven-metadata.xml (784 B at 748 B/s)
[INFO] Uploading to apache.snapshots.https: https://repository.apache.org/content/repositories/snapshots/org/apache/pdfbox/pdfbox-layout-fop/maven-metadata.xml
[INFO] Uploaded to apache.snapshots.https: https://repository.apache.org/content/repositories/snapshots/org/apache/pdfbox/pdfbox-layout-fop/maven-metadata.xml (334 B at 318 B/s)
[INFO]
[INFO] --- bundle:5.1.9:deploy (default-deploy) @ pdfbox-layout-fop ---
[INFO] Remote OBR update disabled (enable with -DremoteOBR)
[INFO]
[INFO] --- ossindex:3.2.0:audit (default-cli) @ pdfbox-layout-fop ---
[INFO] Checking for vulnerabilities; 40 artifacts
[INFO] Exclude coordinates: []
[INFO] Exclude vulnerability identifiers: []
[INFO] CVSS-score threshold: 0.0
[WARNING] Failed to fetch component-reports
org.sonatype.ossindex.service.client.transport.Transport$TransportException: Unexpected response; status: HTTP/1.1 401 Unauthorized
at org.sonatype.ossindex.service.client.transport.HttpClientTransport.post (HttpClientTransport.java:102)
at org.sonatype.ossindex.service.client.internal.OssindexClientImpl.doRequestComponentReports (OssindexClientImpl.java:204)
at org.sonatype.ossindex.service.client.internal.OssindexClientImpl.requestComponentReports (OssindexClientImpl.java:170)
at org.sonatype.ossindex.maven.common.ComponentReportAssistant.request (ComponentReportAssistant.java:86)
at org.sonatype.ossindex.maven.plugin.AuditMojoSupport.execute (AuditMojoSupport.java:242)
at org.apache.maven.plugin.DefaultBuildPluginManager.executeMojo (DefaultBuildPluginManager.java:126)
at org.apache.maven.lifecycle.internal.MojoExecutor.doExecute2 (MojoExecutor.java:328)
at org.apache.maven.lifecycle.internal.MojoExecutor.doExecute (MojoExecutor.java:316)
at org.apache.maven.lifecycle.internal.MojoExecutor.execute (MojoExecutor.java:212)
at org.apache.maven.lifecycle.internal.MojoExecutor.execute (MojoExecutor.java:174)
at org.apache.maven.lifecycle.internal.MojoExecutor.access$000 (MojoExecutor.java:75)
at org.apache.maven.lifecycle.internal.MojoExecutor$1.run (MojoExecutor.java:162)
at org.apache.maven.plugin.DefaultMojosExecutionStrategy.execute (DefaultMojosExecutionStrategy.java:39)
at org.apache.maven.lifecycle.internal.MojoExecutor.execute (MojoExecutor.java:159)
at org.apache.maven.lifecycle.internal.LifecycleModuleBuilder.buildProject (LifecycleModuleBuilder.java:105)
at org.apache.maven.lifecycle.internal.LifecycleModuleBuilder.buildProject (LifecycleModuleBuilder.java:73)
at org.apache.maven.lifecycle.internal.builder.singlethreaded.SingleThreadedBuilder.build (SingleThreadedBuilder.java:53)
at org.apache.maven.lifecycle.internal.LifecycleStarter.execute (LifecycleStarter.java:118)
at org.apache.maven.DefaultMaven.doExecute (DefaultMaven.java:261)
at org.apache.maven.DefaultMaven.doExecute (DefaultMaven.java:173)
at org.apache.maven.DefaultMaven.execute (DefaultMaven.java:101)
at org.jvnet.hudson.maven3.launcher.Maven35Launcher.main (Maven35Launcher.java:138)
at jdk.internal.reflect.NativeMethodAccessorImpl.invoke0 (Native Method)
at jdk.internal.reflect.NativeMethodAccessorImpl.invoke (NativeMethodAccessorImpl.java:77)
at jdk.internal.reflect.DelegatingMethodAccessorImpl.invoke (DelegatingMethodAccessorImpl.java:43)
at java.lang.reflect.Method.invoke (Method.java:569)
at org.codehaus.plexus.classworlds.launcher.Launcher.launchEnhanced (Launcher.java:255)
at org.codehaus.plexus.classworlds.launcher.Launcher.launch (Launcher.java:201)
at jenkins.maven3.agent.Maven35Main.launch (Maven35Main.java:179)
at jdk.internal.reflect.NativeMethodAccessorImpl.invoke0 (Native Method)
at jdk.internal.reflect.NativeMethodAccessorImpl.invoke (NativeMethodAccessorImpl.java:77)
at jdk.internal.reflect.DelegatingMethodAccessorImpl.invoke (DelegatingMethodAccessorImpl.java:43)
at java.lang.reflect.Method.invoke (Method.java:569)
at hudson.maven.Maven3Builder.call (Maven3Builder.java:140)
at hudson.maven.Maven3Builder.call (Maven3Builder.java:71)
at hudson.remoting.UserRequest.perform (UserRequest.java:225)
at hudson.remoting.UserRequest.perform (UserRequest.java:50)
at hudson.remoting.Request$2.run (Request.java:391)
at hudson.remoting.InterceptingExecutorService.lambda$wrap$0 (InterceptingExecutorService.java:81)
at java.util.concurrent.FutureTask.run (FutureTask.java:264)
at java.util.concurrent.ThreadPoolExecutor.runWorker (ThreadPoolExecutor.java:1136)
at java.util.concurrent.ThreadPoolExecutor$Worker.run (ThreadPoolExecutor.java:635)
at java.lang.Thread.run (Thread.java:840)
[INFO]
[INFO] --------------------< org.apache.pdfbox:preflight >---------------------
[INFO] Building Apache Preflight 3.0.9-SNAPSHOT [8/15]
[INFO] from preflight/pom.xml
[INFO] -------------------------------[ bundle ]-------------------------------
[INFO]
[INFO] --- clean:3.5.0:clean (default-clean) @ preflight ---
[INFO]
[INFO] --- enforcer:3.6.3:enforce (default) @ preflight ---
[INFO]
[INFO] --- enforcer:3.6.3:enforce (enforce-maven-version) @ preflight ---
[INFO]
[INFO] --- enforcer:3.6.3:enforce (enforce-java-version) @ preflight ---
[INFO]
[INFO] --- checkstyle:3.6.0:check (check) @ preflight ---
[INFO] Starting audit...
Audit done.
[INFO] You have 0 Checkstyle violations.
[INFO]
[INFO] --- remote-resources:3.3.0:process (process-resource-bundles) @ preflight ---
[INFO] Preparing remote bundle org.apache.apache.resources:apache-jar-resource-bundle:1.8
[INFO] Copying 3 resources from 1 bundle.
[INFO]
[INFO] --- resources:3.5.0:resources (default-resources) @ preflight ---
[INFO] Copying 0 resource from src/main/resources to target/classes
[INFO] Copying 3 resources from target/maven-shared-archive-resources to target/classes
[INFO]
[INFO] --- compiler:3.15.0:compile (default-compile) @ preflight ---
[INFO] Recompiling the module because of changed dependency.
[INFO] Compiling 116 source files with javac [debug deprecation release 8] to target/classes
[INFO] <https://ci-builds.apache.org/job/PDFBox/job/PDFBox-3.0.x/ws/preflight/src/main/java/org/apache/pdfbox/preflight/font/descriptor/FontDescriptorHelper.java>: <https://ci-builds.apache.org/job/PDFBox/job/PDFBox-3.0.x/ws/preflight/src/main/java/org/apache/pdfbox/preflight/font/descriptor/FontDescriptorHelper.java> uses unchecked or unsafe operations.
[INFO] <https://ci-builds.apache.org/job/PDFBox/job/PDFBox-3.0.x/ws/preflight/src/main/java/org/apache/pdfbox/preflight/font/descriptor/FontDescriptorHelper.java>: Recompile with -Xlint:unchecked for details.
[INFO]
[INFO] --- download:1.9.0:wget (get-isartor) @ preflight ---
[WARNING] Invalid cookie header: "set-cookie: __cf_bm=EaP2JGGGX4DuMuQ8t9GfQFIepiYtV2OHmFeOxr.lF6g-1785403322.7821271-1.0.1.1-wI3VSDJfAMTSwuyXYdN0f0p4dw7VGCDJlOAkxAWQlrQ_14FYXFsPnYhdrw8lK5r8au5kmaQUF0cnP7S2eZ0PK91jI9X9Jnjt30Fa_KY7y2Go9rarPImmwWKUt7NdloB.; HttpOnly; SameSite=None; Secure; Path=/; Domain=www.pdfa.org; Expires=Thu, 30 Jul 2026 09:52:02 GMT". Invalid 'expires' attribute: Thu, 30 Jul 2026 09:52:02 GMT
[INFO] ------------------------------------------------------------------------
[INFO] Reactor Summary for Apache PDFBox Reactor 3.0.9-SNAPSHOT:
[INFO]
[INFO] Apache PDFBox parent ............................... SUCCESS [ 22.415 s]
[INFO] Apache PDFBox io ................................... SUCCESS [ 59.650 s]
[INFO] Apache FontBox ..................................... SUCCESS [ 37.814 s]
[INFO] Apache XmpBox ...................................... SUCCESS [ 26.543 s]
[INFO] Apache PDFBox ...................................... SUCCESS [01:36 min]
[INFO] Apache PDFBox Layout AWT ........................... SUCCESS [ 20.280 s]
[INFO] Apache PDFBox Layout FOP ........................... SUCCESS [ 21.064 s]
[INFO] Apache Preflight ................................... FAILURE [ 5.966 s]
[INFO] Apache Preflight application ....................... SKIPPED
[INFO] Apache PDFBox Debugger ............................. SKIPPED
[INFO] Apache PDFBox tools ................................ SKIPPED
[INFO] Apache PDFBox application .......................... SKIPPED
[INFO] Apache PDFBox Debugger application ................. SKIPPED
[INFO] Apache PDFBox examples ............................. SKIPPED
[INFO] Apache PDFBox Reactor .............................. SKIPPED
[INFO] ------------------------------------------------------------------------
[INFO] BUILD FAILURE
[INFO] ------------------------------------------------------------------------
[INFO] Total time: 05:32 min
[INFO] Finished at: 2026-07-30T09:22:22Z
[INFO] ------------------------------------------------------------------------
Waiting for Jenkins to finish collecting data
[ERROR] Failed to execute goal com.googlecode.maven-download-plugin:download-maven-plugin:1.9.0:wget (get-isartor) on project preflight: Download failed with code 403: Forbidden -> [Help 1]
[ERROR]
[ERROR] To see the full stack trace of the errors, re-run Maven with the -e switch.
[ERROR] Re-run Maven using the -X switch to enable full debug logging.
[ERROR]
[ERROR] For more information about the errors and possible solutions, please read the following articles:
[ERROR] [Help 1] http://cwiki.apache.org/confluence/display/MAVEN/MojoExecutionException
[ERROR]
[ERROR] After correcting the problems, you can resume the build with the command
[ERROR] mvn <goals> -rf :preflight
[JENKINS] Archiving <https://ci-builds.apache.org/job/PDFBox/job/PDFBox-3.0.x/ws/pdfbox-layout-fop/pom.xml> to org.apache.pdfbox/pdfbox-layout-fop/3.0.9-SNAPSHOT/pdfbox-layout-fop-3.0.9-SNAPSHOT.pom
[JENKINS] Archiving <https://ci-builds.apache.org/job/PDFBox/job/PDFBox-3.0.x/ws/pdfbox-layout-fop/target/pdfbox-layout-fop-3.0.9-SNAPSHOT.jar> to org.apache.pdfbox/pdfbox-layout-fop/3.0.9-SNAPSHOT/pdfbox-layout-fop-3.0.9-SNAPSHOT.jar
[JENKINS] Archiving <https://ci-builds.apache.org/job/PDFBox/job/PDFBox-3.0.x/ws/examples/pom.xml> to org.apache.pdfbox/pdfbox-examples/3.0.9-SNAPSHOT/pdfbox-examples-3.0.9-SNAPSHOT.pom
[JENKINS] Archiving <https://ci-builds.apache.org/job/PDFBox/job/PDFBox-3.0.x/ws/parent/pom.xml> to org.apache.pdfbox/pdfbox-parent/3.0.9-SNAPSHOT/pdfbox-parent-3.0.9-SNAPSHOT.pom
[JENKINS] Archiving <https://ci-builds.apache.org/job/PDFBox/job/PDFBox-3.0.x/ws/pdfbox-layout-awt/pom.xml> to org.apache.pdfbox/pdfbox-layout-awt/3.0.9-SNAPSHOT/pdfbox-layout-awt-3.0.9-SNAPSHOT.pom
[JENKINS] Archiving <https://ci-builds.apache.org/job/PDFBox/job/PDFBox-3.0.x/ws/pdfbox-layout-awt/target/pdfbox-layout-awt-3.0.9-SNAPSHOT.jar> to org.apache.pdfbox/pdfbox-layout-awt/3.0.9-SNAPSHOT/pdfbox-layout-awt-3.0.9-SNAPSHOT.jar
[JENKINS] Archiving <https://ci-builds.apache.org/job/PDFBox/job/PDFBox-3.0.x/ws/pdfbox/pom.xml> to org.apache.pdfbox/pdfbox/3.0.9-SNAPSHOT/pdfbox-3.0.9-SNAPSHOT.pom
[JENKINS] Archiving <https://ci-builds.apache.org/job/PDFBox/job/PDFBox-3.0.x/ws/pdfbox/target/pdfbox-3.0.9-SNAPSHOT.jar> to org.apache.pdfbox/pdfbox/3.0.9-SNAPSHOT/pdfbox-3.0.9-SNAPSHOT.jar
[JENKINS] Archiving <https://ci-builds.apache.org/job/PDFBox/job/PDFBox-3.0.x/ws/debugger-app/pom.xml> to org.apache.pdfbox/debugger-app/3.0.9-SNAPSHOT/debugger-app-3.0.9-SNAPSHOT.pom
[JENKINS] Archiving <https://ci-builds.apache.org/job/PDFBox/job/PDFBox-3.0.x/ws/io/pom.xml> to org.apache.pdfbox/pdfbox-io/3.0.9-SNAPSHOT/pdfbox-io-3.0.9-SNAPSHOT.pom
[JENKINS] Archiving <https://ci-builds.apache.org/job/PDFBox/job/PDFBox-3.0.x/ws/io/target/pdfbox-io-3.0.9-SNAPSHOT.jar> to org.apache.pdfbox/pdfbox-io/3.0.9-SNAPSHOT/pdfbox-io-3.0.9-SNAPSHOT.jar
[JENKINS] Archiving <https://ci-builds.apache.org/job/PDFBox/job/PDFBox-3.0.x/ws/fontbox/pom.xml> to org.apache.pdfbox/fontbox/3.0.9-SNAPSHOT/fontbox-3.0.9-SNAPSHOT.pom
[JENKINS] Archiving <https://ci-builds.apache.org/job/PDFBox/job/PDFBox-3.0.x/ws/fontbox/target/fontbox-3.0.9-SNAPSHOT.jar> to org.apache.pdfbox/fontbox/3.0.9-SNAPSHOT/fontbox-3.0.9-SNAPSHOT.jar
[JENKINS] Archiving <https://ci-builds.apache.org/job/PDFBox/job/PDFBox-3.0.x/ws/xmpbox/pom.xml> to org.apache.pdfbox/xmpbox/3.0.9-SNAPSHOT/xmpbox-3.0.9-SNAPSHOT.pom
[JENKINS] Archiving <https://ci-builds.apache.org/job/PDFBox/job/PDFBox-3.0.x/ws/xmpbox/target/xmpbox-3.0.9-SNAPSHOT.jar> to org.apache.pdfbox/xmpbox/3.0.9-SNAPSHOT/xmpbox-3.0.9-SNAPSHOT.jar
[JENKINS] Archiving <https://ci-builds.apache.org/job/PDFBox/job/PDFBox-3.0.x/ws/tools/pom.xml> to org.apache.pdfbox/pdfbox-tools/3.0.9-SNAPSHOT/pdfbox-tools-3.0.9-SNAPSHOT.pom
[JENKINS] Archiving <https://ci-builds.apache.org/job/PDFBox/job/PDFBox-3.0.x/ws/debugger/pom.xml> to org.apache.pdfbox/pdfbox-debugger/3.0.9-SNAPSHOT/pdfbox-debugger-3.0.9-SNAPSHOT.pom
[JENKINS] Archiving <https://ci-builds.apache.org/job/PDFBox/job/PDFBox-3.0.x/ws/preflight-app/pom.xml> to org.apache.pdfbox/preflight-app/3.0.9-SNAPSHOT/preflight-app-3.0.9-SNAPSHOT.pom
[JENKINS] Archiving <https://ci-builds.apache.org/job/PDFBox/job/PDFBox-3.0.x/ws/app/pom.xml> to org.apache.pdfbox/pdfbox-app/3.0.9-SNAPSHOT/pdfbox-app-3.0.9-SNAPSHOT.pom
[JENKINS] Archiving <https://ci-builds.apache.org/job/PDFBox/job/PDFBox-3.0.x/ws/preflight/pom.xml> to org.apache.pdfbox/preflight/3.0.9-SNAPSHOT/preflight-3.0.9-SNAPSHOT.pom
[JENKINS] Archiving <https://ci-builds.apache.org/job/PDFBox/job/PDFBox-3.0.x/ws/pom.xml> to org.apache.pdfbox/pdfbox-reactor/3.0.9-SNAPSHOT/pdfbox-reactor-3.0.9-SNAPSHOT.pom
No mail will be sent out, as 'PDFBox » PDFBox-3.0.x » Apache PDFBox examples #1407' does not have a result yet. Please make sure you set a proper result in case of pipeline/build scripts.
No mail will be sent out, as 'PDFBox » PDFBox-3.0.x » Apache PDFBox Debugger application #1407' does not have a result yet. Please make sure you set a proper result in case of pipeline/build scripts.
No mail will be sent out, as 'PDFBox » PDFBox-3.0.x » Apache PDFBox tools #1407' does not have a result yet. Please make sure you set a proper result in case of pipeline/build scripts.
No mail will be sent out, as 'PDFBox » PDFBox-3.0.x » Apache PDFBox Debugger #1407' does not have a result yet. Please make sure you set a proper result in case of pipeline/build scripts.
No mail will be sent out, as 'PDFBox » PDFBox-3.0.x » Apache Preflight application #1407' does not have a result yet. Please make sure you set a proper result in case of pipeline/build scripts.
No mail will be sent out, as 'PDFBox » PDFBox-3.0.x » Apache PDFBox application #1407' does not have a result yet. Please make sure you set a proper result in case of pipeline/build scripts.
Sending e-mails to: dev@pdfbox.apache.org
No mail will be sent out, as 'PDFBox » PDFBox-3.0.x » Apache PDFBox Reactor #1407' does not have a result yet. Please make sure you set a proper result in case of pipeline/build scripts.
channel stopped
Archiving artifacts
---------------------------------------------------------------------
To unsubscribe, e-mail: dev-unsubscribe@pdfbox.apache.org
For additional commands, e-mail: dev-help@pdfbox.apache.org
Jenkins build is back to normal : PDFBox » PDFBox-3.0.x #1408
Posted by Apache Jenkins Server <je...@builds.apache.org>.
See <https://ci-builds.apache.org/job/PDFBox/job/PDFBox-3.0.x/1408/display/redirect>
---------------------------------------------------------------------
To unsubscribe, e-mail: dev-unsubscribe@pdfbox.apache.org
For additional commands, e-mail: dev-help@pdfbox.apache.org