You are viewing a plain text version of this content. The canonical link for it is here.
Posted to dev@pdfbox.apache.org by Apache Jenkins Server <je...@builds.apache.org> on 2026/07/26 12:16:29 UTC

Build failed in Jenkins: PDFBox » PDFBox-sonar2 #2204

See <https://ci-builds.apache.org/job/PDFBox/job/PDFBox-sonar2/2204/display/redirect?page=changes>

Changes:

[Andreas Lehmkühler] PDFBOX-6175: remove parent Type0 font from PDCIDFont


------------------------------------------
[...truncated 476.37 KiB...]
              <https://ci-builds.apache.org/job/PDFBox/job/PDFBox-sonar2/ws/pdfbox/target/test-output/AlignmentTests-flattened-noRef.pdf-1.png>
Rendering of target/test-output/AlignmentTests-flattened-noRef.pdf failed or is not identical to expected rendering in src/test/resources/org/apache/pdfbox/pdmodel/interactive/form directory
26.07.2026 12:15:05 INFO  rendering.TestPDFToImage:272 - *** TEST OK *** for file: PDFBOX-5225.pdf-1.png
26.07.2026 12:15:05 INFO  rendering.TestPDFToImage:273 - Deleting: PDFBOX-5225.pdf-1.png
26.07.2026 12:15:05 INFO  rendering.TestPDFToImage:280 - *** TEST OK *** for file: PDFBOX-5225.pdf-3.png
26.07.2026 12:15:05 INFO  rendering.TestPDFToImage:281 - Deleting: PDFBOX-5225.pdf-3.png
26.07.2026 12:15:05 INFO  rendering.TestPDFToImage:280 - *** TEST OK *** for file: PDFBOX-5225.pdf-5.png
26.07.2026 12:15:05 INFO  rendering.TestPDFToImage:281 - Deleting: PDFBOX-5225.pdf-5.png
[INFO] Tests run: 13, Failures: 0, Errors: 0, Skipped: 0, Time elapsed: 13.97 s -- in org.apache.pdfbox.pdmodel.interactive.form.PDAcroFormFlattenTest
26.07.2026 12:15:05 WARN  pdmodel.PDDocument:985 - You are overwriting the existing file AlignmentTests-flattened-specificFields.pdf, this will produce a corrupted file if you're also reading from it
[INFO] Tests run: 12, Failures: 0, Errors: 0, Skipped: 0, Time elapsed: 12.23 s -- in org.apache.pdfbox.pdmodel.interactive.form.PDAcroFormTest
26.07.2026 12:15:05 WARN  pdmodel.PDDocument:985 - You are overwriting the existing file Acroform-PDFBOX-2333.pdf-Simple-128-bit-RC4-decrypted.pdf, this will produce a corrupted file if you're also reading from it
[INFO] Tests run: 30, Failures: 0, Errors: 0, Skipped: 0, Time elapsed: 21.35 s -- in org.apache.pdfbox.multipdf.PDFMergerUtilityTest
26.07.2026 12:15:06 WARN  pdmodel.PDDocument:1318 - do not call setAllSecurityToBeRemoved(true) before calling protect(), as protect() implies setAllSecurityToBeRemoved(false)
26.07.2026 12:15:06 WARN  pdmodel.PDDocument:985 - You are overwriting the existing file Acroform-PDFBOX-2333.pdf-Simple-128-bit-AES-encrypted.pdf, this will produce a corrupted file if you're also reading from it
[INFO] Tests run: 5, Failures: 0, Errors: 0, Skipped: 0, Time elapsed: 22.72 s -- in org.apache.pdfbox.filter.TestFilters
26.07.2026 12:15:08 WARN  pdmodel.PDDocument:985 - You are overwriting the existing file Acroform-PDFBOX-2333.pdf-Simple-128-bit-AES-decrypted.pdf, this will produce a corrupted file if you're also reading from it
26.07.2026 12:15:08 WARN  pdmodel.PDDocument:985 - You are overwriting the existing file Wing.pdf, this will produce a corrupted file if you're also reading from it
[INFO] Tests run: 10, Failures: 0, Errors: 0, Skipped: 0, Time elapsed: 20.68 s -- in org.apache.pdfbox.pdmodel.graphics.image.CCITTFactoryTest
26.07.2026 12:15:09 WARN  pdmodel.PDDocument:1318 - do not call setAllSecurityToBeRemoved(true) before calling protect(), as protect() implies setAllSecurityToBeRemoved(false)
26.07.2026 12:15:09 WARN  pdmodel.PDDocument:985 - You are overwriting the existing file Acroform-PDFBOX-2333.pdf-Simple-256-bit-AES-encrypted.pdf, this will produce a corrupted file if you're also reading from it
26.07.2026 12:15:10 WARN  pdmodel.PDDocument:985 - You are overwriting the existing file Acroform-PDFBOX-2333.pdf-Simple-256-bit-AES-decrypted.pdf, this will produce a corrupted file if you're also reading from it
[INFO] Tests run: 7, Failures: 0, Errors: 0, Skipped: 0, Time elapsed: 25.06 s -- in org.apache.pdfbox.encryption.TestSymmetricKeyEncryption
[INFO] Running org.apache.pdfbox.util.TestDateUtil
[INFO] Tests run: 6, Failures: 0, Errors: 0, Skipped: 0, Time elapsed: 0.132 s -- in org.apache.pdfbox.util.TestDateUtil
[INFO] 
[INFO] Results:
[INFO] 
[INFO] Tests run: 774, Failures: 0, Errors: 0, Skipped: 2
[INFO] 
[JENKINS] Recording test results
[INFO] 
[INFO] --- jacoco:0.8.15:report (report) @ pdfbox ---
[INFO] Loading execution data file <https://ci-builds.apache.org/job/PDFBox/job/PDFBox-sonar2/ws/pdfbox/target/jacoco.exec>
[INFO] Analyzed bundle 'Apache PDFBox' with 700 classes
[INFO] 
[INFO] --- bundle:5.1.9:bundle (default-bundle) @ pdfbox ---
[INFO] Building bundle: <https://ci-builds.apache.org/job/PDFBox/job/PDFBox-sonar2/ws/pdfbox/target/pdfbox-4.0.0-SNAPSHOT.jar>
[INFO] Writing manifest: <https://ci-builds.apache.org/job/PDFBox/job/PDFBox-sonar2/ws/pdfbox/target/classes/META-INF/MANIFEST.MF>
[INFO] 
[INFO] --- source:3.4.0:jar-no-fork (attach-sources) @ pdfbox ---
[INFO] Building jar: <https://ci-builds.apache.org/job/PDFBox/job/PDFBox-sonar2/ws/pdfbox/target/pdfbox-4.0.0-SNAPSHOT-sources.jar>
[INFO] 
[INFO] ----------------< org.apache.pdfbox:pdfbox-layout-awt >-----------------
[INFO] Building Apache PDFBox Layout awt 4.0.0-SNAPSHOT                  [6/12]
[INFO]   from pdfbox-layout-awt/pom.xml
[INFO] -------------------------------[ bundle ]-------------------------------
[INFO] 
[INFO] --- enforcer:3.6.3:enforce (default) @ pdfbox-layout-awt ---
[INFO] 
[INFO] --- enforcer:3.6.3:enforce (enforce-maven-version) @ pdfbox-layout-awt ---
[INFO] 
[INFO] --- enforcer:3.6.3:enforce (enforce-java-version) @ pdfbox-layout-awt ---
[INFO] 
[INFO] --- checkstyle:3.6.0:check (check) @ pdfbox-layout-awt ---
[INFO] Starting audit...
Audit done.
[INFO] You have 0 Checkstyle violations.
[INFO] 
[INFO] --- jacoco:0.8.15:prepare-agent (default) @ pdfbox-layout-awt ---
[INFO] surefireArgLine set to -javaagent:/home/jenkins/.m2/repository/org/jacoco/org.jacoco.agent/0.8.15/org.jacoco.agent-0.8.15-runtime.jar=destfile=<https://ci-builds.apache.org/job/PDFBox/job/PDFBox-sonar2/ws/pdfbox-layout-awt/target/jacoco.exec>
[INFO] 
[INFO] --- remote-resources:3.3.0:process (process-resource-bundles) @ pdfbox-layout-awt ---
[INFO] Preparing remote bundle org.apache.apache.resources:apache-jar-resource-bundle:1.8
[INFO] Copying 3 resources from 1 bundle.
[INFO] 
[INFO] --- resources:3.5.0:resources (default-resources) @ pdfbox-layout-awt ---
[INFO] skip non existing resourceDirectory <https://ci-builds.apache.org/job/PDFBox/job/PDFBox-sonar2/ws/pdfbox-layout-awt/src/main/resources>
[INFO] Copying 3 resources from target/maven-shared-archive-resources to target/classes
[INFO] 
[INFO] --- compiler:3.15.0:compile (default-compile) @ pdfbox-layout-awt ---
[INFO] Recompiling the module because of changed dependency.
[INFO] Compiling 3 source files with javac [debug deprecation release 11] to target/classes
[INFO] 
[INFO] --- resources:3.5.0:testResources (default-testResources) @ pdfbox-layout-awt ---
[INFO] Copying 16 resources from src/test/resources to target/test-classes
[INFO] Copying 3 resources from target/maven-shared-archive-resources to target/test-classes
[INFO] 
[INFO] --- compiler:3.15.0:testCompile (default-testCompile) @ pdfbox-layout-awt ---
[INFO] Recompiling the module because of changed dependency.
[INFO] Compiling 7 source files with javac [debug deprecation release 11] to target/test-classes
[INFO] 
[INFO] --- surefire:3.5.6:test (default-test) @ pdfbox-layout-awt ---
[INFO] Using auto detected provider org.apache.maven.surefire.junitplatform.JUnitPlatformProvider
[INFO] 
[INFO] -------------------------------------------------------
[INFO]  T E S T S
[INFO] -------------------------------------------------------
[INFO] Running org.apache.pdfbox.glyphlayout.awt.GlyphLayoutSMPTest
26.07.2026 12:15:30 WARN  ttf.CmapSubtable:359 - Format 14 cmap table is not supported and will be ignored
26.07.2026 12:15:30 WARN  pdmodel.PDDocument:985 - You are overwriting the existing file GlyphLayoutSMP.pdf, this will produce a corrupted file if you're also reading from it
[INFO] Tests run: 1, Failures: 0, Errors: 0, Skipped: 0, Time elapsed: 2.986 s -- in org.apache.pdfbox.glyphlayout.awt.GlyphLayoutSMPTest
[INFO] Running org.apache.pdfbox.glyphlayout.awt.GlyphLayoutLigaturesAndKerningTest
26.07.2026 12:15:31 WARN  pdmodel.PDDocument:985 - You are overwriting the existing file GlyphLayoutLigaturesAndKerning.pdf, this will produce a corrupted file if you're also reading from it
26.07.2026 12:15:31 WARN  pdmodel.PDAbstractContentStream:1702 - You did not call endText(), some viewers won't display your text
[INFO] Tests run: 2, Failures: 0, Errors: 0, Skipped: 0, Time elapsed: 0.429 s -- in org.apache.pdfbox.glyphlayout.awt.GlyphLayoutLigaturesAndKerningTest
[INFO] Running org.apache.pdfbox.glyphlayout.awt.GlyphLayoutDin91379FormTest
26.07.2026 12:15:32 WARN  ttf.PostScriptTable:75 - No PostScript name data is provided for the font NotoSans-Regular
26.07.2026 12:15:32 INFO  pdmodel.PDAbstractContentStream:233 - No GSUB data found in font Arimo-Regular
26.07.2026 12:15:32 WARN  ttf.PostScriptTable:75 - No PostScript name data is provided for the font NotoSans-Regular
26.07.2026 12:15:32 INFO  pdmodel.PDAbstractContentStream:233 - No GSUB data found in font Arimo-Regular
26.07.2026 12:15:32 WARN  pdmodel.PDDocument:985 - You are overwriting the existing file GlyphLayoutDIN91379Form.pdf, this will produce a corrupted file if you're also reading from it
26.07.2026 12:15:32 WARN  ttf.PostScriptTable:75 - No PostScript name data is provided for the font NotoSans-Regular
26.07.2026 12:15:33 WARN  ttf.PostScriptTable:75 - No PostScript name data is provided for the font NotoSans-Regular
[INFO] Tests run: 1, Failures: 0, Errors: 0, Skipped: 0, Time elapsed: 1.444 s -- in org.apache.pdfbox.glyphlayout.awt.GlyphLayoutDin91379FormTest
[INFO] Running org.apache.pdfbox.glyphlayout.awt.GlyphLayoutHelloWorldAWTTest
26.07.2026 12:15:33 WARN  pdmodel.PDDocument:985 - You are overwriting the existing file HelloWorld.pdf, this will produce a corrupted file if you're also reading from it
target/HelloWorld.pdf created!
[INFO] Tests run: 1, Failures: 0, Errors: 0, Skipped: 0, Time elapsed: 0.034 s -- in org.apache.pdfbox.glyphlayout.awt.GlyphLayoutHelloWorldAWTTest
[INFO] Running org.apache.pdfbox.glyphlayout.awt.GlyphLayoutBidiTest
26.07.2026 12:15:33 WARN  pdmodel.PDDocument:985 - You are overwriting the existing file GlyphLayoutBidi.pdf, this will produce a corrupted file if you're also reading from it
[INFO] Tests run: 1, Failures: 0, Errors: 0, Skipped: 0, Time elapsed: 0.074 s -- in org.apache.pdfbox.glyphlayout.awt.GlyphLayoutBidiTest
[INFO] Running org.apache.pdfbox.glyphlayout.awt.GlyphLayoutDin91379Test
26.07.2026 12:15:33 WARN  pdmodel.PDDocument:985 - You are overwriting the existing file GlyphLayoutDIN91379.pdf, this will produce a corrupted file if you're also reading from it
[INFO] Tests run: 1, Failures: 0, Errors: 0, Skipped: 0, Time elapsed: 0.405 s -- in org.apache.pdfbox.glyphlayout.awt.GlyphLayoutDin91379Test
[INFO] 
[INFO] Results:
[INFO] 
[INFO] Tests run: 7, Failures: 0, Errors: 0, Skipped: 0
[INFO] 
[JENKINS] Recording test results
[INFO] 
[INFO] --- jacoco:0.8.15:report (report) @ pdfbox-layout-awt ---
[INFO] Loading execution data file <https://ci-builds.apache.org/job/PDFBox/job/PDFBox-sonar2/ws/pdfbox-layout-awt/target/jacoco.exec>
[INFO] Analyzed bundle 'Apache PDFBox Layout awt' with 4 classes
[INFO] 
[INFO] --- bundle:5.1.9:bundle (default-bundle) @ pdfbox-layout-awt ---
[INFO] Building bundle: <https://ci-builds.apache.org/job/PDFBox/job/PDFBox-sonar2/ws/pdfbox-layout-awt/target/pdfbox-layout-awt-4.0.0-SNAPSHOT.jar>
[INFO] Writing manifest: <https://ci-builds.apache.org/job/PDFBox/job/PDFBox-sonar2/ws/pdfbox-layout-awt/target/classes/META-INF/MANIFEST.MF>
[INFO] 
[INFO] --- source:3.4.0:jar-no-fork (attach-sources) @ pdfbox-layout-awt ---
[INFO] Building jar: <https://ci-builds.apache.org/job/PDFBox/job/PDFBox-sonar2/ws/pdfbox-layout-awt/target/pdfbox-layout-awt-4.0.0-SNAPSHOT-sources.jar>
[INFO] 
[INFO] -----------------< org.apache.pdfbox:pdfbox-debugger >------------------
[INFO] Building Apache PDFBox Debugger 4.0.0-SNAPSHOT                    [7/12]
[INFO]   from debugger/pom.xml
[INFO] --------------------------------[ jar ]---------------------------------
[INFO] 
[INFO] --- enforcer:3.6.3:enforce (default) @ pdfbox-debugger ---
[INFO] 
[INFO] --- enforcer:3.6.3:enforce (enforce-maven-version) @ pdfbox-debugger ---
[INFO] 
[INFO] --- enforcer:3.6.3:enforce (enforce-java-version) @ pdfbox-debugger ---
[INFO] 
[INFO] --- checkstyle:3.6.0:check (check) @ pdfbox-debugger ---
[INFO] Starting audit...
Audit done.
[INFO] You have 0 Checkstyle violations.
[INFO] 
[INFO] --- jacoco:0.8.15:prepare-agent (default) @ pdfbox-debugger ---
[INFO] surefireArgLine set to -javaagent:/home/jenkins/.m2/repository/org/jacoco/org.jacoco.agent/0.8.15/org.jacoco.agent-0.8.15-runtime.jar=destfile=<https://ci-builds.apache.org/job/PDFBox/job/PDFBox-sonar2/ws/debugger/target/jacoco.exec>
[INFO] 
[INFO] --- remote-resources:3.3.0:process (process-resource-bundles) @ pdfbox-debugger ---
[INFO] Preparing remote bundle org.apache.apache.resources:apache-jar-resource-bundle:1.8
[INFO] Copying 3 resources from 1 bundle.
[INFO] 
[INFO] --- resources:3.5.0:resources (default-resources) @ pdfbox-debugger ---
[INFO] Copying 15 resources from src/main/resources to target/classes
[INFO] Copying 3 resources from target/maven-shared-archive-resources to target/classes
[INFO] 
[INFO] --- compiler:3.15.0:compile (default-compile) @ pdfbox-debugger ---
[INFO] Recompiling the module because of changed dependency.
[INFO] Compiling 91 source files with javac [debug deprecation release 11] to target/classes
[INFO] PluginProcessor: writing plugin descriptor for 1 Log4j Plugins to `META-INF/org/apache/logging/log4j/core/config/plugins/Log4j2Plugins.dat`.
[INFO] GraalVmProcessor: writing GraalVM metadata for 1 Java classes to `META-INF/native-image/log4j-generated/org.apache.pdfbox/pdfbox-debugger/reflect-config.json`.
[INFO] -------------------------------------------------------------
[WARNING] COMPILATION WARNING : 
[INFO] -------------------------------------------------------------
[WARNING] <https://ci-builds.apache.org/job/PDFBox/job/PDFBox-sonar2/ws/debugger/src/main/java/org/apache/pdfbox/debugger/fontencodingpane/Type3Font.java>:[190,19] appendRawCommands(byte[]) in org.apache.pdfbox.pdmodel.PDPageContentStream has been deprecated
[INFO] 1 warning
[INFO] -------------------------------------------------------------
[INFO] -------------------------------------------------------------
[ERROR] COMPILATION ERROR : 
[INFO] -------------------------------------------------------------
[ERROR] <https://ci-builds.apache.org/job/PDFBox/job/PDFBox-sonar2/ws/debugger/src/main/java/org/apache/pdfbox/debugger/fontencodingpane/Type0Font.java>:[56,46] cannot find symbol
  symbol:   method getName()
  location: variable descendantFont of type org.apache.pdfbox.pdmodel.font.PDCIDFont
[INFO] 1 error
[INFO] -------------------------------------------------------------
[INFO] 
[INFO] ------------------------------------------------------------------------
[INFO] Skipping pdfbox-reactor
[INFO] This project has been banned from the build due to previous failures.
[INFO] ------------------------------------------------------------------------
[INFO] ------------------------------------------------------------------------
[INFO] Reactor Summary for pdfbox-reactor 4.0.0-SNAPSHOT:
[INFO] 
[INFO] Apache PDFBox parent ............................... SUCCESS [ 12.377 s]
[INFO] Apache PDFBox io ................................... SUCCESS [ 40.340 s]
[INFO] Apache FontBox ..................................... SUCCESS [ 32.927 s]
[INFO] Apache XmpBox ...................................... SUCCESS [ 14.351 s]
[INFO] Apache PDFBox ...................................... SUCCESS [01:19 min]
[INFO] Apache PDFBox Layout awt ........................... SUCCESS [ 13.410 s]
[INFO] Apache PDFBox Debugger ............................. FAILURE [  4.261 s]
[INFO] Apache PDFBox tools ................................ SKIPPED
[INFO] Apache PDFBox application .......................... SKIPPED
[INFO] Apache PDFBox Debugger application ................. SKIPPED
[INFO] Apache PDFBox examples ............................. SKIPPED
[INFO] pdfbox-reactor ..................................... SKIPPED
[INFO] ------------------------------------------------------------------------
[INFO] BUILD FAILURE
[INFO] ------------------------------------------------------------------------
[INFO] Total time:  03:59 min
[INFO] Finished at: 2026-07-26T12:16:02Z
[INFO] ------------------------------------------------------------------------
Waiting for Jenkins to finish collecting data
[ERROR] Failed to execute goal org.apache.maven.plugins:maven-compiler-plugin:3.15.0:compile (default-compile) on project pdfbox-debugger: Compilation failure
[ERROR] <https://ci-builds.apache.org/job/PDFBox/job/PDFBox-sonar2/ws/debugger/src/main/java/org/apache/pdfbox/debugger/fontencodingpane/Type0Font.java>:[56,46] cannot find symbol
[ERROR] symbol:   method getName()
[ERROR] location: variable descendantFont of type org.apache.pdfbox.pdmodel.font.PDCIDFont
[ERROR] -> [Help 1]
[ERROR] 
[ERROR] To see the full stack trace of the errors, re-run Maven with the -e switch.
[ERROR] Re-run Maven using the -X switch to enable full debug logging.
[ERROR] 
[ERROR] For more information about the errors and possible solutions, please read the following articles:
[ERROR] [Help 1] http://cwiki.apache.org/confluence/display/MAVEN/MojoFailureException
[ERROR] 
[ERROR] After correcting the problems, you can resume the build with the command
[ERROR]   mvn <goals> -rf :pdfbox-debugger
[JENKINS] Archiving <https://ci-builds.apache.org/job/PDFBox/job/PDFBox-sonar2/ws/xmpbox/pom.xml> to org.apache.pdfbox/xmpbox/4.0.0-SNAPSHOT/xmpbox-4.0.0-SNAPSHOT.pom
[JENKINS] Archiving <https://ci-builds.apache.org/job/PDFBox/job/PDFBox-sonar2/ws/xmpbox/target/xmpbox-4.0.0-SNAPSHOT.jar> to org.apache.pdfbox/xmpbox/4.0.0-SNAPSHOT/xmpbox-4.0.0-SNAPSHOT.jar
[JENKINS] Archiving <https://ci-builds.apache.org/job/PDFBox/job/PDFBox-sonar2/ws/xmpbox/target/xmpbox-4.0.0-SNAPSHOT-sources.jar> to org.apache.pdfbox/xmpbox/4.0.0-SNAPSHOT/xmpbox-4.0.0-SNAPSHOT-sources.jar
[JENKINS] Archiving <https://ci-builds.apache.org/job/PDFBox/job/PDFBox-sonar2/ws/tools/pom.xml> to org.apache.pdfbox/pdfbox-tools/4.0.0-SNAPSHOT/pdfbox-tools-4.0.0-SNAPSHOT.pom
[JENKINS] Archiving <https://ci-builds.apache.org/job/PDFBox/job/PDFBox-sonar2/ws/debugger/pom.xml> to org.apache.pdfbox/pdfbox-debugger/4.0.0-SNAPSHOT/pdfbox-debugger-4.0.0-SNAPSHOT.pom
[JENKINS] Archiving <https://ci-builds.apache.org/job/PDFBox/job/PDFBox-sonar2/ws/app/pom.xml> to org.apache.pdfbox/pdfbox-app/4.0.0-SNAPSHOT/pdfbox-app-4.0.0-SNAPSHOT.pom
[JENKINS] Archiving <https://ci-builds.apache.org/job/PDFBox/job/PDFBox-sonar2/ws/examples/pom.xml> to org.apache.pdfbox/pdfbox-examples/4.0.0-SNAPSHOT/pdfbox-examples-4.0.0-SNAPSHOT.pom
[JENKINS] Archiving <https://ci-builds.apache.org/job/PDFBox/job/PDFBox-sonar2/ws/pom.xml> to org.apache.pdfbox/pdfbox-reactor/4.0.0-SNAPSHOT/pdfbox-reactor-4.0.0-SNAPSHOT.pom
[JENKINS] Archiving <https://ci-builds.apache.org/job/PDFBox/job/PDFBox-sonar2/ws/parent/pom.xml> to org.apache.pdfbox/pdfbox-parent/4.0.0-SNAPSHOT/pdfbox-parent-4.0.0-SNAPSHOT.pom
[JENKINS] Archiving <https://ci-builds.apache.org/job/PDFBox/job/PDFBox-sonar2/ws/pdfbox-layout-awt/pom.xml> to org.apache.pdfbox/pdfbox-layout-awt/4.0.0-SNAPSHOT/pdfbox-layout-awt-4.0.0-SNAPSHOT.pom
[JENKINS] Archiving <https://ci-builds.apache.org/job/PDFBox/job/PDFBox-sonar2/ws/pdfbox-layout-awt/target/pdfbox-layout-awt-4.0.0-SNAPSHOT.jar> to org.apache.pdfbox/pdfbox-layout-awt/4.0.0-SNAPSHOT/pdfbox-layout-awt-4.0.0-SNAPSHOT.jar
[JENKINS] Archiving <https://ci-builds.apache.org/job/PDFBox/job/PDFBox-sonar2/ws/pdfbox-layout-awt/target/pdfbox-layout-awt-4.0.0-SNAPSHOT-sources.jar> to org.apache.pdfbox/pdfbox-layout-awt/4.0.0-SNAPSHOT/pdfbox-layout-awt-4.0.0-SNAPSHOT-sources.jar
[JENKINS] Archiving <https://ci-builds.apache.org/job/PDFBox/job/PDFBox-sonar2/ws/pdfbox/pom.xml> to org.apache.pdfbox/pdfbox/4.0.0-SNAPSHOT/pdfbox-4.0.0-SNAPSHOT.pom
[JENKINS] Archiving <https://ci-builds.apache.org/job/PDFBox/job/PDFBox-sonar2/ws/pdfbox/target/pdfbox-4.0.0-SNAPSHOT.jar> to org.apache.pdfbox/pdfbox/4.0.0-SNAPSHOT/pdfbox-4.0.0-SNAPSHOT.jar
[JENKINS] Archiving <https://ci-builds.apache.org/job/PDFBox/job/PDFBox-sonar2/ws/pdfbox/target/pdfbox-4.0.0-SNAPSHOT-sources.jar> to org.apache.pdfbox/pdfbox/4.0.0-SNAPSHOT/pdfbox-4.0.0-SNAPSHOT-sources.jar
[JENKINS] Archiving <https://ci-builds.apache.org/job/PDFBox/job/PDFBox-sonar2/ws/debugger-app/pom.xml> to org.apache.pdfbox/debugger-app/4.0.0-SNAPSHOT/debugger-app-4.0.0-SNAPSHOT.pom
[JENKINS] Archiving <https://ci-builds.apache.org/job/PDFBox/job/PDFBox-sonar2/ws/io/pom.xml> to org.apache.pdfbox/pdfbox-io/4.0.0-SNAPSHOT/pdfbox-io-4.0.0-SNAPSHOT.pom
[JENKINS] Archiving <https://ci-builds.apache.org/job/PDFBox/job/PDFBox-sonar2/ws/io/target/pdfbox-io-4.0.0-SNAPSHOT.jar> to org.apache.pdfbox/pdfbox-io/4.0.0-SNAPSHOT/pdfbox-io-4.0.0-SNAPSHOT.jar
[JENKINS] Archiving <https://ci-builds.apache.org/job/PDFBox/job/PDFBox-sonar2/ws/io/target/pdfbox-io-4.0.0-SNAPSHOT-sources.jar> to org.apache.pdfbox/pdfbox-io/4.0.0-SNAPSHOT/pdfbox-io-4.0.0-SNAPSHOT-sources.jar
[JENKINS] Archiving <https://ci-builds.apache.org/job/PDFBox/job/PDFBox-sonar2/ws/fontbox/pom.xml> to org.apache.pdfbox/fontbox/4.0.0-SNAPSHOT/fontbox-4.0.0-SNAPSHOT.pom
[JENKINS] Archiving <https://ci-builds.apache.org/job/PDFBox/job/PDFBox-sonar2/ws/fontbox/target/fontbox-4.0.0-SNAPSHOT.jar> to org.apache.pdfbox/fontbox/4.0.0-SNAPSHOT/fontbox-4.0.0-SNAPSHOT.jar
[JENKINS] Archiving <https://ci-builds.apache.org/job/PDFBox/job/PDFBox-sonar2/ws/fontbox/target/fontbox-4.0.0-SNAPSHOT-sources.jar> to org.apache.pdfbox/fontbox/4.0.0-SNAPSHOT/fontbox-4.0.0-SNAPSHOT-sources.jar
No mail will be sent out, as 'PDFBox » PDFBox-sonar2 » Apache PDFBox examples #2204' does not have a result yet. Please make sure you set a proper result in case of pipeline/build scripts.
No mail will be sent out, as 'PDFBox » PDFBox-sonar2 » Apache PDFBox Debugger application #2204' does not have a result yet. Please make sure you set a proper result in case of pipeline/build scripts.
No mail will be sent out, as 'PDFBox » PDFBox-sonar2 » Apache PDFBox tools #2204' does not have a result yet. Please make sure you set a proper result in case of pipeline/build scripts.
Sending e-mails to: dev@pdfbox.apache.org
No mail will be sent out, as 'PDFBox » PDFBox-sonar2 » Apache PDFBox application #2204' does not have a result yet. Please make sure you set a proper result in case of pipeline/build scripts.
No mail will be sent out, as 'PDFBox » PDFBox-sonar2 » pdfbox-reactor #2204' does not have a result yet. Please make sure you set a proper result in case of pipeline/build scripts.
channel stopped

---------------------------------------------------------------------
To unsubscribe, e-mail: dev-unsubscribe@pdfbox.apache.org
For additional commands, e-mail: dev-help@pdfbox.apache.org


Jenkins build is back to stable : PDFBox » PDFBox-sonar2 #2207

Posted by Apache Jenkins Server <je...@builds.apache.org>.
See <https://ci-builds.apache.org/job/PDFBox/job/PDFBox-sonar2/2207/display/redirect>


---------------------------------------------------------------------
To unsubscribe, e-mail: dev-unsubscribe@pdfbox.apache.org
For additional commands, e-mail: dev-help@pdfbox.apache.org


Jenkins build is unstable: PDFBox » PDFBox-sonar2 #2206

Posted by Apache Jenkins Server <je...@builds.apache.org>.
See <https://ci-builds.apache.org/job/PDFBox/job/PDFBox-sonar2/2206/display/redirect?page=changes>


---------------------------------------------------------------------
To unsubscribe, e-mail: dev-unsubscribe@pdfbox.apache.org
For additional commands, e-mail: dev-help@pdfbox.apache.org


Build failed in Jenkins: PDFBox » PDFBox-sonar2 #2205

Posted by Apache Jenkins Server <je...@builds.apache.org>.
See <https://ci-builds.apache.org/job/PDFBox/job/PDFBox-sonar2/2205/display/redirect?page=changes>

Changes:

[Andreas Lehmkühler] PDFBOX-6226: cache byte representation of the name of an operator so that it doesn't have to be converted every time it is written to a pdf.

[Andreas Lehmkühler] PDFBOX-6226: replace ConcurrentHashMap with a regular HashMap

[Andreas Lehmkühler] PDFBOX-6226: eliminate remaining string conversions


------------------------------------------
[...truncated 437.42 KiB...]
26.07.2026 17:47:09 INFO  rendering.TestPDFToImage:281 - Deleting: PDFBOX-5225.pdf-4.png
26.07.2026 17:47:09 INFO  rendering.TestPDFToImage:280 - *** TEST OK *** for file: PDFBOX-5225.pdf-2.png
26.07.2026 17:47:09 INFO  rendering.TestPDFToImage:281 - Deleting: PDFBOX-5225.pdf-2.png
26.07.2026 17:47:09 INFO  rendering.TestPDFToImage:272 - *** TEST OK *** for file: PDFBOX-5225.pdf-1.png
26.07.2026 17:47:09 INFO  rendering.TestPDFToImage:273 - Deleting: PDFBOX-5225.pdf-1.png
26.07.2026 17:47:09 INFO  rendering.TestPDFToImage:280 - *** TEST OK *** for file: PDFBOX-5225.pdf-3.png
26.07.2026 17:47:09 INFO  rendering.TestPDFToImage:281 - Deleting: PDFBOX-5225.pdf-3.png
26.07.2026 17:47:09 INFO  rendering.TestPDFToImage:280 - *** TEST OK *** for file: PDFBOX-5225.pdf-5.png
26.07.2026 17:47:09 INFO  rendering.TestPDFToImage:281 - Deleting: PDFBOX-5225.pdf-5.png
[INFO] Tests run: 13, Failures: 0, Errors: 0, Skipped: 0, Time elapsed: 15.71 s -- in org.apache.pdfbox.pdmodel.interactive.form.PDAcroFormFlattenTest
[INFO] Tests run: 5, Failures: 0, Errors: 0, Skipped: 0, Time elapsed: 20.36 s -- in org.apache.pdfbox.text.TestTextStripper
[INFO] Tests run: 5, Failures: 0, Errors: 0, Skipped: 0, Time elapsed: 22.37 s -- in org.apache.pdfbox.filter.TestFilters
26.07.2026 17:47:11 WARN  pdmodel.PDDocument:985 - You are overwriting the existing file Acroform-PDFBOX-2333.pdf-Simple-128-bit-RC4-decrypted.pdf, this will produce a corrupted file if you're also reading from it
[INFO] Tests run: 30, Failures: 0, Errors: 0, Skipped: 0, Time elapsed: 23.56 s -- in org.apache.pdfbox.multipdf.PDFMergerUtilityTest
26.07.2026 17:47:12 WARN  pdmodel.PDDocument:985 - You are overwriting the existing file Wing.pdf, this will produce a corrupted file if you're also reading from it
26.07.2026 17:47:12 WARN  pdmodel.PDDocument:1318 - do not call setAllSecurityToBeRemoved(true) before calling protect(), as protect() implies setAllSecurityToBeRemoved(false)
26.07.2026 17:47:12 WARN  pdmodel.PDDocument:985 - You are overwriting the existing file Acroform-PDFBOX-2333.pdf-Simple-128-bit-AES-encrypted.pdf, this will produce a corrupted file if you're also reading from it
[INFO] Tests run: 10, Failures: 0, Errors: 0, Skipped: 0, Time elapsed: 21.53 s -- in org.apache.pdfbox.pdmodel.graphics.image.CCITTFactoryTest
26.07.2026 17:47:13 WARN  pdmodel.PDDocument:985 - You are overwriting the existing file Acroform-PDFBOX-2333.pdf-Simple-128-bit-AES-decrypted.pdf, this will produce a corrupted file if you're also reading from it
26.07.2026 17:47:15 WARN  pdmodel.PDDocument:1318 - do not call setAllSecurityToBeRemoved(true) before calling protect(), as protect() implies setAllSecurityToBeRemoved(false)
26.07.2026 17:47:15 WARN  pdmodel.PDDocument:985 - You are overwriting the existing file Acroform-PDFBOX-2333.pdf-Simple-256-bit-AES-encrypted.pdf, this will produce a corrupted file if you're also reading from it
26.07.2026 17:47:16 WARN  pdmodel.PDDocument:985 - You are overwriting the existing file Acroform-PDFBOX-2333.pdf-Simple-256-bit-AES-decrypted.pdf, this will produce a corrupted file if you're also reading from it
[INFO] Tests run: 7, Failures: 0, Errors: 0, Skipped: 0, Time elapsed: 28.03 s -- in org.apache.pdfbox.encryption.TestSymmetricKeyEncryption
[INFO] Running org.apache.pdfbox.util.TestDateUtil
[INFO] Tests run: 6, Failures: 0, Errors: 0, Skipped: 0, Time elapsed: 0.118 s -- in org.apache.pdfbox.util.TestDateUtil
[INFO] 
[INFO] Results:
[INFO] 
[INFO] Tests run: 782, Failures: 0, Errors: 0, Skipped: 2
[INFO] 
[JENKINS] Recording test results
[INFO] 
[INFO] --- jacoco:0.8.15:report (report) @ pdfbox ---
[INFO] Loading execution data file <https://ci-builds.apache.org/job/PDFBox/job/PDFBox-sonar2/ws/pdfbox/target/jacoco.exec>
[INFO] Analyzed bundle 'Apache PDFBox' with 701 classes
[INFO] 
[INFO] --- bundle:5.1.9:bundle (default-bundle) @ pdfbox ---
[INFO] Building bundle: <https://ci-builds.apache.org/job/PDFBox/job/PDFBox-sonar2/ws/pdfbox/target/pdfbox-4.0.0-SNAPSHOT.jar>
[INFO] Writing manifest: <https://ci-builds.apache.org/job/PDFBox/job/PDFBox-sonar2/ws/pdfbox/target/classes/META-INF/MANIFEST.MF>
[INFO] 
[INFO] --- source:3.4.0:jar-no-fork (attach-sources) @ pdfbox ---
[INFO] Building jar: <https://ci-builds.apache.org/job/PDFBox/job/PDFBox-sonar2/ws/pdfbox/target/pdfbox-4.0.0-SNAPSHOT-sources.jar>
[INFO] 
[INFO] ----------------< org.apache.pdfbox:pdfbox-layout-awt >-----------------
[INFO] Building Apache PDFBox Layout awt 4.0.0-SNAPSHOT                  [6/12]
[INFO]   from pdfbox-layout-awt/pom.xml
[INFO] -------------------------------[ bundle ]-------------------------------
[INFO] 
[INFO] --- enforcer:3.6.3:enforce (default) @ pdfbox-layout-awt ---
[INFO] 
[INFO] --- enforcer:3.6.3:enforce (enforce-maven-version) @ pdfbox-layout-awt ---
[INFO] 
[INFO] --- enforcer:3.6.3:enforce (enforce-java-version) @ pdfbox-layout-awt ---
[INFO] 
[INFO] --- checkstyle:3.6.0:check (check) @ pdfbox-layout-awt ---
[INFO] Starting audit...
Audit done.
[INFO] You have 0 Checkstyle violations.
[INFO] 
[INFO] --- jacoco:0.8.15:prepare-agent (default) @ pdfbox-layout-awt ---
[INFO] surefireArgLine set to -javaagent:/home/jenkins/.m2/repository/org/jacoco/org.jacoco.agent/0.8.15/org.jacoco.agent-0.8.15-runtime.jar=destfile=<https://ci-builds.apache.org/job/PDFBox/job/PDFBox-sonar2/ws/pdfbox-layout-awt/target/jacoco.exec>
[INFO] 
[INFO] --- remote-resources:3.3.0:process (process-resource-bundles) @ pdfbox-layout-awt ---
[INFO] Preparing remote bundle org.apache.apache.resources:apache-jar-resource-bundle:1.8
[INFO] Copying 3 resources from 1 bundle.
[INFO] 
[INFO] --- resources:3.5.0:resources (default-resources) @ pdfbox-layout-awt ---
[INFO] skip non existing resourceDirectory <https://ci-builds.apache.org/job/PDFBox/job/PDFBox-sonar2/ws/pdfbox-layout-awt/src/main/resources>
[INFO] Copying 3 resources from target/maven-shared-archive-resources to target/classes
[INFO] 
[INFO] --- compiler:3.15.0:compile (default-compile) @ pdfbox-layout-awt ---
[INFO] Recompiling the module because of changed dependency.
[INFO] Compiling 3 source files with javac [debug deprecation release 11] to target/classes
[INFO] 
[INFO] --- resources:3.5.0:testResources (default-testResources) @ pdfbox-layout-awt ---
[INFO] Copying 16 resources from src/test/resources to target/test-classes
[INFO] Copying 3 resources from target/maven-shared-archive-resources to target/test-classes
[INFO] 
[INFO] --- compiler:3.15.0:testCompile (default-testCompile) @ pdfbox-layout-awt ---
[INFO] Recompiling the module because of changed dependency.
[INFO] Compiling 7 source files with javac [debug deprecation release 11] to target/test-classes
[INFO] 
[INFO] --- surefire:3.5.6:test (default-test) @ pdfbox-layout-awt ---
[INFO] Using auto detected provider org.apache.maven.surefire.junitplatform.JUnitPlatformProvider
[INFO] 
[INFO] -------------------------------------------------------
[INFO]  T E S T S
[INFO] -------------------------------------------------------
[INFO] Running org.apache.pdfbox.glyphlayout.awt.GlyphLayoutSMPTest
26.07.2026 17:47:36 WARN  ttf.CmapSubtable:359 - Format 14 cmap table is not supported and will be ignored
26.07.2026 17:47:36 WARN  pdmodel.PDDocument:985 - You are overwriting the existing file GlyphLayoutSMP.pdf, this will produce a corrupted file if you're also reading from it
[INFO] Tests run: 1, Failures: 0, Errors: 0, Skipped: 0, Time elapsed: 3.056 s -- in org.apache.pdfbox.glyphlayout.awt.GlyphLayoutSMPTest
[INFO] Running org.apache.pdfbox.glyphlayout.awt.GlyphLayoutLigaturesAndKerningTest
26.07.2026 17:47:37 WARN  pdmodel.PDDocument:985 - You are overwriting the existing file GlyphLayoutLigaturesAndKerning.pdf, this will produce a corrupted file if you're also reading from it
26.07.2026 17:47:38 WARN  pdmodel.PDAbstractContentStream:1705 - You did not call endText(), some viewers won't display your text
[INFO] Tests run: 2, Failures: 0, Errors: 0, Skipped: 0, Time elapsed: 0.586 s -- in org.apache.pdfbox.glyphlayout.awt.GlyphLayoutLigaturesAndKerningTest
[INFO] Running org.apache.pdfbox.glyphlayout.awt.GlyphLayoutDin91379FormTest
26.07.2026 17:47:38 WARN  ttf.PostScriptTable:75 - No PostScript name data is provided for the font NotoSans-Regular
26.07.2026 17:47:38 INFO  pdmodel.PDAbstractContentStream:237 - No GSUB data found in font Arimo-Regular
26.07.2026 17:47:38 WARN  ttf.PostScriptTable:75 - No PostScript name data is provided for the font NotoSans-Regular
26.07.2026 17:47:38 INFO  pdmodel.PDAbstractContentStream:237 - No GSUB data found in font Arimo-Regular
26.07.2026 17:47:39 WARN  pdmodel.PDDocument:985 - You are overwriting the existing file GlyphLayoutDIN91379Form.pdf, this will produce a corrupted file if you're also reading from it
26.07.2026 17:47:39 WARN  ttf.PostScriptTable:75 - No PostScript name data is provided for the font NotoSans-Regular
26.07.2026 17:47:39 WARN  ttf.PostScriptTable:75 - No PostScript name data is provided for the font NotoSans-Regular
[INFO] Tests run: 1, Failures: 0, Errors: 0, Skipped: 0, Time elapsed: 1.562 s -- in org.apache.pdfbox.glyphlayout.awt.GlyphLayoutDin91379FormTest
[INFO] Running org.apache.pdfbox.glyphlayout.awt.GlyphLayoutHelloWorldAWTTest
26.07.2026 17:47:39 WARN  pdmodel.PDDocument:985 - You are overwriting the existing file HelloWorld.pdf, this will produce a corrupted file if you're also reading from it
target/HelloWorld.pdf created!
[INFO] Tests run: 1, Failures: 0, Errors: 0, Skipped: 0, Time elapsed: 0.042 s -- in org.apache.pdfbox.glyphlayout.awt.GlyphLayoutHelloWorldAWTTest
[INFO] Running org.apache.pdfbox.glyphlayout.awt.GlyphLayoutBidiTest
26.07.2026 17:47:39 WARN  pdmodel.PDDocument:985 - You are overwriting the existing file GlyphLayoutBidi.pdf, this will produce a corrupted file if you're also reading from it
[INFO] Tests run: 1, Failures: 0, Errors: 0, Skipped: 0, Time elapsed: 0.131 s -- in org.apache.pdfbox.glyphlayout.awt.GlyphLayoutBidiTest
[INFO] Running org.apache.pdfbox.glyphlayout.awt.GlyphLayoutDin91379Test
26.07.2026 17:47:40 WARN  pdmodel.PDDocument:985 - You are overwriting the existing file GlyphLayoutDIN91379.pdf, this will produce a corrupted file if you're also reading from it
[INFO] Tests run: 1, Failures: 0, Errors: 0, Skipped: 0, Time elapsed: 0.585 s -- in org.apache.pdfbox.glyphlayout.awt.GlyphLayoutDin91379Test
[INFO] 
[INFO] Results:
[INFO] 
[INFO] Tests run: 7, Failures: 0, Errors: 0, Skipped: 0
[INFO] 
[JENKINS] Recording test results
[INFO] 
[INFO] --- jacoco:0.8.15:report (report) @ pdfbox-layout-awt ---
[INFO] Loading execution data file <https://ci-builds.apache.org/job/PDFBox/job/PDFBox-sonar2/ws/pdfbox-layout-awt/target/jacoco.exec>
[INFO] Analyzed bundle 'Apache PDFBox Layout awt' with 4 classes
[INFO] 
[INFO] --- bundle:5.1.9:bundle (default-bundle) @ pdfbox-layout-awt ---
[INFO] Building bundle: <https://ci-builds.apache.org/job/PDFBox/job/PDFBox-sonar2/ws/pdfbox-layout-awt/target/pdfbox-layout-awt-4.0.0-SNAPSHOT.jar>
[INFO] Writing manifest: <https://ci-builds.apache.org/job/PDFBox/job/PDFBox-sonar2/ws/pdfbox-layout-awt/target/classes/META-INF/MANIFEST.MF>
[INFO] 
[INFO] --- source:3.4.0:jar-no-fork (attach-sources) @ pdfbox-layout-awt ---
[INFO] Building jar: <https://ci-builds.apache.org/job/PDFBox/job/PDFBox-sonar2/ws/pdfbox-layout-awt/target/pdfbox-layout-awt-4.0.0-SNAPSHOT-sources.jar>
[INFO] 
[INFO] -----------------< org.apache.pdfbox:pdfbox-debugger >------------------
[INFO] Building Apache PDFBox Debugger 4.0.0-SNAPSHOT                    [7/12]
[INFO]   from debugger/pom.xml
[INFO] --------------------------------[ jar ]---------------------------------
[INFO] 
[INFO] --- enforcer:3.6.3:enforce (default) @ pdfbox-debugger ---
[INFO] 
[INFO] --- enforcer:3.6.3:enforce (enforce-maven-version) @ pdfbox-debugger ---
[INFO] 
[INFO] --- enforcer:3.6.3:enforce (enforce-java-version) @ pdfbox-debugger ---
[INFO] 
[INFO] --- checkstyle:3.6.0:check (check) @ pdfbox-debugger ---
[INFO] Starting audit...
Audit done.
[INFO] You have 0 Checkstyle violations.
[INFO] 
[INFO] --- jacoco:0.8.15:prepare-agent (default) @ pdfbox-debugger ---
[INFO] surefireArgLine set to -javaagent:/home/jenkins/.m2/repository/org/jacoco/org.jacoco.agent/0.8.15/org.jacoco.agent-0.8.15-runtime.jar=destfile=<https://ci-builds.apache.org/job/PDFBox/job/PDFBox-sonar2/ws/debugger/target/jacoco.exec>
[INFO] 
[INFO] --- remote-resources:3.3.0:process (process-resource-bundles) @ pdfbox-debugger ---
[INFO] Preparing remote bundle org.apache.apache.resources:apache-jar-resource-bundle:1.8
[INFO] Copying 3 resources from 1 bundle.
[INFO] 
[INFO] --- resources:3.5.0:resources (default-resources) @ pdfbox-debugger ---
[INFO] Copying 15 resources from src/main/resources to target/classes
[INFO] Copying 3 resources from target/maven-shared-archive-resources to target/classes
[INFO] 
[INFO] --- compiler:3.15.0:compile (default-compile) @ pdfbox-debugger ---
[INFO] Recompiling the module because of changed dependency.
[INFO] Compiling 91 source files with javac [debug deprecation release 11] to target/classes
[INFO] PluginProcessor: writing plugin descriptor for 1 Log4j Plugins to `META-INF/org/apache/logging/log4j/core/config/plugins/Log4j2Plugins.dat`.
[INFO] GraalVmProcessor: writing GraalVM metadata for 1 Java classes to `META-INF/native-image/log4j-generated/org.apache.pdfbox/pdfbox-debugger/reflect-config.json`.
[INFO] -------------------------------------------------------------
[WARNING] COMPILATION WARNING : 
[INFO] -------------------------------------------------------------
[WARNING] <https://ci-builds.apache.org/job/PDFBox/job/PDFBox-sonar2/ws/debugger/src/main/java/org/apache/pdfbox/debugger/fontencodingpane/Type3Font.java>:[190,19] appendRawCommands(byte[]) in org.apache.pdfbox.pdmodel.PDPageContentStream has been deprecated
[INFO] 1 warning
[INFO] -------------------------------------------------------------
[INFO] -------------------------------------------------------------
[ERROR] COMPILATION ERROR : 
[INFO] -------------------------------------------------------------
[ERROR] <https://ci-builds.apache.org/job/PDFBox/job/PDFBox-sonar2/ws/debugger/src/main/java/org/apache/pdfbox/debugger/fontencodingpane/Type0Font.java>:[56,46] cannot find symbol
  symbol:   method getName()
  location: variable descendantFont of type org.apache.pdfbox.pdmodel.font.PDCIDFont
[INFO] 1 error
[INFO] -------------------------------------------------------------
[INFO] 
[INFO] ------------------------------------------------------------------------
[INFO] Skipping pdfbox-reactor
[INFO] This project has been banned from the build due to previous failures.
[INFO] ------------------------------------------------------------------------
[INFO] ------------------------------------------------------------------------
[INFO] Reactor Summary for pdfbox-reactor 4.0.0-SNAPSHOT:
[INFO] 
[INFO] Apache PDFBox parent ............................... SUCCESS [ 12.103 s]
[INFO] Apache PDFBox io ................................... SUCCESS [ 39.026 s]
[INFO] Apache FontBox ..................................... SUCCESS [ 34.237 s]
[INFO] Apache XmpBox ...................................... SUCCESS [ 13.466 s]
[INFO] Apache PDFBox ...................................... SUCCESS [01:22 min]
[INFO] Apache PDFBox Layout awt ........................... SUCCESS [ 17.330 s]
[INFO] Apache PDFBox Debugger ............................. FAILURE [  9.140 s]
[INFO] Apache PDFBox tools ................................ SKIPPED
[INFO] Apache PDFBox application .......................... SKIPPED
[INFO] Apache PDFBox Debugger application ................. SKIPPED
[INFO] Apache PDFBox examples ............................. SKIPPED
[INFO] pdfbox-reactor ..................................... SKIPPED
[INFO] ------------------------------------------------------------------------
[INFO] BUILD FAILURE
[INFO] ------------------------------------------------------------------------
[INFO] Total time:  04:15 min
[INFO] Finished at: 2026-07-26T17:48:23Z
[INFO] ------------------------------------------------------------------------
Waiting for Jenkins to finish collecting data
[ERROR] Failed to execute goal org.apache.maven.plugins:maven-compiler-plugin:3.15.0:compile (default-compile) on project pdfbox-debugger: Compilation failure
[ERROR] <https://ci-builds.apache.org/job/PDFBox/job/PDFBox-sonar2/ws/debugger/src/main/java/org/apache/pdfbox/debugger/fontencodingpane/Type0Font.java>:[56,46] cannot find symbol
[ERROR] symbol:   method getName()
[ERROR] location: variable descendantFont of type org.apache.pdfbox.pdmodel.font.PDCIDFont
[ERROR] -> [Help 1]
[ERROR] 
[ERROR] To see the full stack trace of the errors, re-run Maven with the -e switch.
[ERROR] Re-run Maven using the -X switch to enable full debug logging.
[ERROR] 
[ERROR] For more information about the errors and possible solutions, please read the following articles:
[ERROR] [Help 1] http://cwiki.apache.org/confluence/display/MAVEN/MojoFailureException
[ERROR] 
[ERROR] After correcting the problems, you can resume the build with the command
[ERROR]   mvn <goals> -rf :pdfbox-debugger
[JENKINS] Archiving <https://ci-builds.apache.org/job/PDFBox/job/PDFBox-sonar2/ws/xmpbox/pom.xml> to org.apache.pdfbox/xmpbox/4.0.0-SNAPSHOT/xmpbox-4.0.0-SNAPSHOT.pom
[JENKINS] Archiving <https://ci-builds.apache.org/job/PDFBox/job/PDFBox-sonar2/ws/xmpbox/target/xmpbox-4.0.0-SNAPSHOT.jar> to org.apache.pdfbox/xmpbox/4.0.0-SNAPSHOT/xmpbox-4.0.0-SNAPSHOT.jar
[JENKINS] Archiving <https://ci-builds.apache.org/job/PDFBox/job/PDFBox-sonar2/ws/xmpbox/target/xmpbox-4.0.0-SNAPSHOT-sources.jar> to org.apache.pdfbox/xmpbox/4.0.0-SNAPSHOT/xmpbox-4.0.0-SNAPSHOT-sources.jar
[JENKINS] Archiving <https://ci-builds.apache.org/job/PDFBox/job/PDFBox-sonar2/ws/tools/pom.xml> to org.apache.pdfbox/pdfbox-tools/4.0.0-SNAPSHOT/pdfbox-tools-4.0.0-SNAPSHOT.pom
[JENKINS] Archiving <https://ci-builds.apache.org/job/PDFBox/job/PDFBox-sonar2/ws/debugger/pom.xml> to org.apache.pdfbox/pdfbox-debugger/4.0.0-SNAPSHOT/pdfbox-debugger-4.0.0-SNAPSHOT.pom
[JENKINS] Archiving <https://ci-builds.apache.org/job/PDFBox/job/PDFBox-sonar2/ws/app/pom.xml> to org.apache.pdfbox/pdfbox-app/4.0.0-SNAPSHOT/pdfbox-app-4.0.0-SNAPSHOT.pom
[JENKINS] Archiving <https://ci-builds.apache.org/job/PDFBox/job/PDFBox-sonar2/ws/examples/pom.xml> to org.apache.pdfbox/pdfbox-examples/4.0.0-SNAPSHOT/pdfbox-examples-4.0.0-SNAPSHOT.pom
[JENKINS] Archiving <https://ci-builds.apache.org/job/PDFBox/job/PDFBox-sonar2/ws/pom.xml> to org.apache.pdfbox/pdfbox-reactor/4.0.0-SNAPSHOT/pdfbox-reactor-4.0.0-SNAPSHOT.pom
[JENKINS] Archiving <https://ci-builds.apache.org/job/PDFBox/job/PDFBox-sonar2/ws/parent/pom.xml> to org.apache.pdfbox/pdfbox-parent/4.0.0-SNAPSHOT/pdfbox-parent-4.0.0-SNAPSHOT.pom
[JENKINS] Archiving <https://ci-builds.apache.org/job/PDFBox/job/PDFBox-sonar2/ws/pdfbox-layout-awt/pom.xml> to org.apache.pdfbox/pdfbox-layout-awt/4.0.0-SNAPSHOT/pdfbox-layout-awt-4.0.0-SNAPSHOT.pom
[JENKINS] Archiving <https://ci-builds.apache.org/job/PDFBox/job/PDFBox-sonar2/ws/pdfbox-layout-awt/target/pdfbox-layout-awt-4.0.0-SNAPSHOT.jar> to org.apache.pdfbox/pdfbox-layout-awt/4.0.0-SNAPSHOT/pdfbox-layout-awt-4.0.0-SNAPSHOT.jar
[JENKINS] Archiving <https://ci-builds.apache.org/job/PDFBox/job/PDFBox-sonar2/ws/pdfbox-layout-awt/target/pdfbox-layout-awt-4.0.0-SNAPSHOT-sources.jar> to org.apache.pdfbox/pdfbox-layout-awt/4.0.0-SNAPSHOT/pdfbox-layout-awt-4.0.0-SNAPSHOT-sources.jar
[JENKINS] Archiving <https://ci-builds.apache.org/job/PDFBox/job/PDFBox-sonar2/ws/pdfbox/pom.xml> to org.apache.pdfbox/pdfbox/4.0.0-SNAPSHOT/pdfbox-4.0.0-SNAPSHOT.pom
[JENKINS] Archiving <https://ci-builds.apache.org/job/PDFBox/job/PDFBox-sonar2/ws/pdfbox/target/pdfbox-4.0.0-SNAPSHOT.jar> to org.apache.pdfbox/pdfbox/4.0.0-SNAPSHOT/pdfbox-4.0.0-SNAPSHOT.jar
[JENKINS] Archiving <https://ci-builds.apache.org/job/PDFBox/job/PDFBox-sonar2/ws/pdfbox/target/pdfbox-4.0.0-SNAPSHOT-sources.jar> to org.apache.pdfbox/pdfbox/4.0.0-SNAPSHOT/pdfbox-4.0.0-SNAPSHOT-sources.jar
[JENKINS] Archiving <https://ci-builds.apache.org/job/PDFBox/job/PDFBox-sonar2/ws/debugger-app/pom.xml> to org.apache.pdfbox/debugger-app/4.0.0-SNAPSHOT/debugger-app-4.0.0-SNAPSHOT.pom
[JENKINS] Archiving <https://ci-builds.apache.org/job/PDFBox/job/PDFBox-sonar2/ws/io/pom.xml> to org.apache.pdfbox/pdfbox-io/4.0.0-SNAPSHOT/pdfbox-io-4.0.0-SNAPSHOT.pom
[JENKINS] Archiving <https://ci-builds.apache.org/job/PDFBox/job/PDFBox-sonar2/ws/io/target/pdfbox-io-4.0.0-SNAPSHOT.jar> to org.apache.pdfbox/pdfbox-io/4.0.0-SNAPSHOT/pdfbox-io-4.0.0-SNAPSHOT.jar
[JENKINS] Archiving <https://ci-builds.apache.org/job/PDFBox/job/PDFBox-sonar2/ws/io/target/pdfbox-io-4.0.0-SNAPSHOT-sources.jar> to org.apache.pdfbox/pdfbox-io/4.0.0-SNAPSHOT/pdfbox-io-4.0.0-SNAPSHOT-sources.jar
[JENKINS] Archiving <https://ci-builds.apache.org/job/PDFBox/job/PDFBox-sonar2/ws/fontbox/pom.xml> to org.apache.pdfbox/fontbox/4.0.0-SNAPSHOT/fontbox-4.0.0-SNAPSHOT.pom
[JENKINS] Archiving <https://ci-builds.apache.org/job/PDFBox/job/PDFBox-sonar2/ws/fontbox/target/fontbox-4.0.0-SNAPSHOT.jar> to org.apache.pdfbox/fontbox/4.0.0-SNAPSHOT/fontbox-4.0.0-SNAPSHOT.jar
[JENKINS] Archiving <https://ci-builds.apache.org/job/PDFBox/job/PDFBox-sonar2/ws/fontbox/target/fontbox-4.0.0-SNAPSHOT-sources.jar> to org.apache.pdfbox/fontbox/4.0.0-SNAPSHOT/fontbox-4.0.0-SNAPSHOT-sources.jar
No mail will be sent out, as 'PDFBox » PDFBox-sonar2 » Apache PDFBox examples #2205' does not have a result yet. Please make sure you set a proper result in case of pipeline/build scripts.
No mail will be sent out, as 'PDFBox » PDFBox-sonar2 » Apache PDFBox Debugger application #2205' does not have a result yet. Please make sure you set a proper result in case of pipeline/build scripts.
No mail will be sent out, as 'PDFBox » PDFBox-sonar2 » Apache PDFBox tools #2205' does not have a result yet. Please make sure you set a proper result in case of pipeline/build scripts.
Sending e-mails to: dev@pdfbox.apache.org
No mail will be sent out, as 'PDFBox » PDFBox-sonar2 » Apache PDFBox application #2205' does not have a result yet. Please make sure you set a proper result in case of pipeline/build scripts.
No mail will be sent out, as 'PDFBox » PDFBox-sonar2 » pdfbox-reactor #2205' does not have a result yet. Please make sure you set a proper result in case of pipeline/build scripts.
channel stopped

---------------------------------------------------------------------
To unsubscribe, e-mail: dev-unsubscribe@pdfbox.apache.org
For additional commands, e-mail: dev-help@pdfbox.apache.org