You are viewing a plain text version of this content. The canonical link for it is here.
Posted to dev@pdfbox.apache.org by Apache Jenkins Server <je...@builds.apache.org> on 2026/07/25 15:50:18 UTC
Build failed in Jenkins: PDFBox » PDFBox-2.0.x #2044
See <https://ci-builds.apache.org/job/PDFBox/job/PDFBox-2.0.x/2044/display/redirect>
Changes:
------------------------------------------
[...truncated 123.20 KiB...]
[INFO] Tests run: 1, Failures: 0, Errors: 0, Skipped: 0, Time elapsed: 0.025 s - in org.apache.pdfbox.text.PDFTextStripperByAreaTest
[INFO] Running org.apache.pdfbox.text.BidiTest
[INFO] Tests run: 2, Failures: 0, Errors: 0, Skipped: 0, Time elapsed: 0.029 s - in org.apache.pdfbox.text.BidiTest
[INFO] Running org.apache.pdfbox.text.TestTextStripper
[INFO] Tests run: 5, Failures: 0, Errors: 0, Skipped: 0, Time elapsed: 2.091 s - in org.apache.pdfbox.text.TestTextStripper
[INFO]
[INFO] Results:
[INFO]
[WARNING] Tests run: 709, Failures: 0, Errors: 0, Skipped: 2
[INFO]
[JENKINS] Recording test results
[INFO]
[INFO] --- animal-sniffer:1.17:check (check-java-version) @ pdfbox ---
[INFO] Checking unresolved references to org.codehaus.mojo.signature:java16:1.0
[INFO]
[INFO] --- bundle:3.5.1:bundle (default-bundle) @ pdfbox ---
[INFO]
[INFO] --- site:3.7:attach-descriptor (attach-descriptor) @ pdfbox ---
[INFO] Skipping because packaging 'bundle' is not pom.
[INFO]
[INFO] --- source:3.0.1:jar-no-fork (attach-sources) @ pdfbox ---
[INFO] Skipping source per configuration.
[INFO]
[INFO] --- apache-rat:0.17:check (default) @ pdfbox ---
[WARNING] Basedir is : <https://ci-builds.apache.org/job/PDFBox/job/PDFBox-2.0.x/ws/pdfbox>
[INFO] Excluding patterns: src/main/resources/org/apache/pdfbox/resources/afm/*, src/main/resources/org/apache/pdfbox/resources/icc/*, src/main/resources/org/apache/pdfbox/resources/glyphlist/glyphlist.txt, src/main/resources/org/apache/pdfbox/resources/glyphlist/zapfdingbats.txt, src/main/resources/org/apache/pdfbox/resources/text/BidiMirroring.txt, src/main/resources/META-INF/services/*, src/test/resources/input/rendering/*.ai, src/test/resources/input/*.txt, src/test/resources/input/**/*.pdf, src/test/resources/input/**/*.png, src/test/resources/input/*.pdf, src/test/resources/org/apache/**/*.pdf, src/test/resources/output/*, src/test/resources/org/apache/pdfbox/pdmodel/sRGB.*, src/test/resources/org/apache/pdfbox/pdfparser/*.fdf, release.properties, src/test/resources/org/apache/pdfbox/encryption/*.der, src/test/resources/org/apache/pdfbox/encryption/*.pfx, src/test/resources/org/apache/pdfbox/encryption/*.p12, src/test/resources/org/apache/pdfbox/filter/*.bin, src/test/resources/org/apache/pdfbox/text/*.txt, src/main/java/org/apache/pdfbox/filter/CCITTFaxDecoderStream.java, src/main/java/org/apache/pdfbox/filter/CCITTFaxEncoderStream.java, src/main/java/org/apache/pdfbox/filter/TIFFExtension.java, nb-configuration.xml
[INFO] Excluding MAVEN collection.
[INFO] Excluding ECLIPSE collection.
[INFO] Excluding IDEA collection.
[INFO] Processing exclude file from STANDARD_SCMS.
[INFO] Excluding STANDARD_SCMS collection.
[INFO] Excluding MISC collection.
[INFO] Excluding HIDDEN_DIR collection.
[INFO] RAT summary:
[INFO] Approved: 787
[INFO] Archives: 0
[INFO] Binaries: 37
[INFO] Document types: 4
[INFO] Ignored: 260
[INFO] License categories: 1
[INFO] License names: 1
[INFO] Notices: 2
[INFO] Standards: 787
[INFO] Unapproved: 0
[INFO] Unknown: 0
[INFO]
[INFO] --- dependency-check:10.0.4:check (default) @ pdfbox ---
[INFO] Skipping dependency-check
[INFO]
[INFO] --- install:2.5.2:install (default-install) @ pdfbox ---
[INFO] Installing <https://ci-builds.apache.org/job/PDFBox/job/PDFBox-2.0.x/ws/pdfbox/target/pdfbox-2.0.38-SNAPSHOT.jar> to /home/jenkins/.m2/repository/org/apache/pdfbox/pdfbox/2.0.38-SNAPSHOT/pdfbox-2.0.38-SNAPSHOT.jar
[INFO] Installing <https://ci-builds.apache.org/job/PDFBox/job/PDFBox-2.0.x/ws/pdfbox/pom.xml> to /home/jenkins/.m2/repository/org/apache/pdfbox/pdfbox/2.0.38-SNAPSHOT/pdfbox-2.0.38-SNAPSHOT.pom
[INFO]
[INFO] --- bundle:3.5.1:install (default-install) @ pdfbox ---
[INFO] Installing org/apache/pdfbox/pdfbox/2.0.38-SNAPSHOT/pdfbox-2.0.38-SNAPSHOT.jar
[INFO] Writing OBR metadata
[INFO]
[INFO] --- deploy:2.8.2:deploy (default-deploy) @ pdfbox ---
[INFO] Downloading from apache.snapshots.https: https://repository.apache.org/content/repositories/snapshots/org/apache/pdfbox/pdfbox/2.0.38-SNAPSHOT/maven-metadata.xml
[INFO] Downloaded from apache.snapshots.https: https://repository.apache.org/content/repositories/snapshots/org/apache/pdfbox/pdfbox/2.0.38-SNAPSHOT/maven-metadata.xml (779 B at 1.4 kB/s)
[INFO] Uploading to apache.snapshots.https: https://repository.apache.org/content/repositories/snapshots/org/apache/pdfbox/pdfbox/2.0.38-SNAPSHOT/pdfbox-2.0.38-20260725.154235-23.jar
[INFO] Uploaded to apache.snapshots.https: https://repository.apache.org/content/repositories/snapshots/org/apache/pdfbox/pdfbox/2.0.38-SNAPSHOT/pdfbox-2.0.38-20260725.154235-23.jar (2.8 MB at 1.2 MB/s)
[INFO] Uploading to apache.snapshots.https: https://repository.apache.org/content/repositories/snapshots/org/apache/pdfbox/pdfbox/2.0.38-SNAPSHOT/pdfbox-2.0.38-20260725.154235-23.pom
[INFO] Uploaded to apache.snapshots.https: https://repository.apache.org/content/repositories/snapshots/org/apache/pdfbox/pdfbox/2.0.38-SNAPSHOT/pdfbox-2.0.38-20260725.154235-23.pom (56 kB at 52 kB/s)
[INFO] Downloading from apache.snapshots.https: https://repository.apache.org/content/repositories/snapshots/org/apache/pdfbox/pdfbox/maven-metadata.xml
[INFO] Downloaded from apache.snapshots.https: https://repository.apache.org/content/repositories/snapshots/org/apache/pdfbox/pdfbox/maven-metadata.xml (465 B at 2.6 kB/s)
[INFO] Uploading to apache.snapshots.https: https://repository.apache.org/content/repositories/snapshots/org/apache/pdfbox/pdfbox/2.0.38-SNAPSHOT/maven-metadata.xml
[INFO] Uploaded to apache.snapshots.https: https://repository.apache.org/content/repositories/snapshots/org/apache/pdfbox/pdfbox/2.0.38-SNAPSHOT/maven-metadata.xml (779 B at 728 B/s)
[INFO] Uploading to apache.snapshots.https: https://repository.apache.org/content/repositories/snapshots/org/apache/pdfbox/pdfbox/maven-metadata.xml
[INFO] Uploaded to apache.snapshots.https: https://repository.apache.org/content/repositories/snapshots/org/apache/pdfbox/pdfbox/maven-metadata.xml (465 B at 434 B/s)
[INFO]
[INFO] --- bundle:3.5.1:deploy (default-deploy) @ pdfbox ---
[INFO] Remote OBR update disabled (enable with -DremoteOBR)
[INFO]
[INFO] --------------------< org.apache.pdfbox:preflight >---------------------
[INFO] Building Apache Preflight 2.0.38-SNAPSHOT [5/12]
[INFO] from preflight/pom.xml
[INFO] -------------------------------[ bundle ]-------------------------------
[INFO]
[INFO] --- clean:3.0.0:clean (default-clean) @ preflight ---
[INFO]
[INFO] --- enforcer:1.4.1:enforce (default) @ preflight ---
[INFO]
[INFO] --- enforcer:1.4.1:enforce (enforce-maven-version) @ preflight ---
[INFO]
[INFO] --- checkstyle:3.6.0:check (check) @ preflight ---
[INFO] Starting audit...
Audit done.
[INFO] You have 0 Checkstyle violations.
[INFO]
[INFO] --- remote-resources:1.5:process (process-resource-bundles) @ preflight ---
[INFO]
[INFO] --- resources:3.0.2:resources (default-resources) @ preflight ---
[INFO] Using 'UTF-8' encoding to copy filtered resources.
[INFO] Copying 0 resource
[INFO] Copying 3 resources
[INFO]
[INFO] --- compiler:3.15.0:compile (default-compile) @ preflight ---
[INFO] Recompiling the module because of changed dependency.
[INFO] Compiling 112 source files with javac [forked debug deprecation release 6] to target/classes
[WARNING] [options] source value 6 is obsolete and will be removed in a future release
[WARNING] [options] target value 1.6 is obsolete and will be removed in a future release
[WARNING] [options] To suppress warnings about obsolete options, use -Xlint:-options.
[INFO]
[INFO] --- download:1.5.1:wget (get-isartor) @ preflight ---
[WARNING] Invalid cookie header: "set-cookie: __cf_bm=QleJziB6blUGNsV86NNjFVyV5tNK1L44ic1cKAZDmHk-1784994577.4276037-1.0.1.1-U8g9HkVai..dNLPEe4dzzj6ayjnDgh718xFeaIisN2TDgNkB1T58bL1xW.nMPT6ntP.hEOeBdk1DMVGNDHV2JjFqMXjlbhY56wENMorNbeipL5I8IxiUiv6fRGZSHXVH; HttpOnly; SameSite=None; Secure; Path=/; Domain=www.pdfa.org; Expires=Sat, 25 Jul 2026 16:19:37 GMT". Invalid 'expires' attribute: Sat, 25 Jul 2026 16:19:37 GMT
[WARNING] Could not get content
org.apache.maven.plugin.MojoFailureException: Not same digest as expected: expected <66bf4ad470b36079c1e0ceca4438053f32649f964fb1de5cd88babce36c5afc0ba6fa7880bc1c9aac791df872cdfc8dc9851bfd3c75ae96786edd8fac61193ae> was <67a1773a9bfe1cee193bc1095d384c8c0c298be5a7cf1ccf3bdc2a51700c81af24b3175d96e7845650f84a6799225ee0d0ecc0624bffdd95cbfd2571fb198dfc>
at com.googlecode.download.maven.plugin.internal.SignatureUtils.verifySignature (SignatureUtils.java:35)
at com.googlecode.download.maven.plugin.internal.WGet.execute (WGet.java:378)
at org.apache.maven.plugin.DefaultBuildPluginManager.executeMojo (DefaultBuildPluginManager.java:126)
at org.apache.maven.lifecycle.internal.MojoExecutor.doExecute2 (MojoExecutor.java:328)
at org.apache.maven.lifecycle.internal.MojoExecutor.doExecute (MojoExecutor.java:316)
at org.apache.maven.lifecycle.internal.MojoExecutor.execute (MojoExecutor.java:212)
at org.apache.maven.lifecycle.internal.MojoExecutor.execute (MojoExecutor.java:174)
at org.apache.maven.lifecycle.internal.MojoExecutor.access$000 (MojoExecutor.java:75)
at org.apache.maven.lifecycle.internal.MojoExecutor$1.run (MojoExecutor.java:162)
at org.apache.maven.plugin.DefaultMojosExecutionStrategy.execute (DefaultMojosExecutionStrategy.java:39)
at org.apache.maven.lifecycle.internal.MojoExecutor.execute (MojoExecutor.java:159)
at org.apache.maven.lifecycle.internal.LifecycleModuleBuilder.buildProject (LifecycleModuleBuilder.java:105)
at org.apache.maven.lifecycle.internal.LifecycleModuleBuilder.buildProject (LifecycleModuleBuilder.java:73)
at org.apache.maven.lifecycle.internal.builder.singlethreaded.SingleThreadedBuilder.build (SingleThreadedBuilder.java:53)
at org.apache.maven.lifecycle.internal.LifecycleStarter.execute (LifecycleStarter.java:118)
at org.apache.maven.DefaultMaven.doExecute (DefaultMaven.java:261)
at org.apache.maven.DefaultMaven.doExecute (DefaultMaven.java:173)
at org.apache.maven.DefaultMaven.execute (DefaultMaven.java:101)
at org.jvnet.hudson.maven3.launcher.Maven35Launcher.main (Maven35Launcher.java:138)
at jdk.internal.reflect.NativeMethodAccessorImpl.invoke0 (Native Method)
at jdk.internal.reflect.NativeMethodAccessorImpl.invoke (NativeMethodAccessorImpl.java:77)
at jdk.internal.reflect.DelegatingMethodAccessorImpl.invoke (DelegatingMethodAccessorImpl.java:43)
at java.lang.reflect.Method.invoke (Method.java:569)
at org.codehaus.plexus.classworlds.launcher.Launcher.launchEnhanced (Launcher.java:255)
at org.codehaus.plexus.classworlds.launcher.Launcher.launch (Launcher.java:201)
at jenkins.maven3.agent.Maven35Main.launch (Maven35Main.java:179)
at jdk.internal.reflect.NativeMethodAccessorImpl.invoke0 (Native Method)
at jdk.internal.reflect.NativeMethodAccessorImpl.invoke (NativeMethodAccessorImpl.java:77)
at jdk.internal.reflect.DelegatingMethodAccessorImpl.invoke (DelegatingMethodAccessorImpl.java:43)
at java.lang.reflect.Method.invoke (Method.java:569)
at hudson.maven.Maven3Builder.call (Maven3Builder.java:140)
at hudson.maven.Maven3Builder.call (Maven3Builder.java:71)
at hudson.remoting.UserRequest.perform (UserRequest.java:225)
at hudson.remoting.UserRequest.perform (UserRequest.java:50)
at hudson.remoting.Request$2.run (Request.java:391)
at hudson.remoting.InterceptingExecutorService.lambda$wrap$0 (InterceptingExecutorService.java:81)
at java.util.concurrent.FutureTask.run (FutureTask.java:264)
at java.util.concurrent.ThreadPoolExecutor.runWorker (ThreadPoolExecutor.java:1136)
at java.util.concurrent.ThreadPoolExecutor$Worker.run (ThreadPoolExecutor.java:635)
at java.lang.Thread.run (Thread.java:840)
[WARNING] Retrying (1 more)
[WARNING] Invalid cookie header: "set-cookie: __cf_bm=6ZPe3JIA_37a2vakVUDxTOg0VR4Zr8J.2jceVmNh_DI-1784994577.6423757-1.0.1.1-BP99QZ06Si3cL9fDq3SDQgqg4BlnXRMHffgTZr33XNs3_bJxB2vwZSH39xOcPQjnTc3gsrnoFt.zjNwiesdm42C_._KXmtElJrE.4tcVIUT0IRxWZ8igWgecPgoOdrXx; HttpOnly; SameSite=None; Secure; Path=/; Domain=www.pdfa.org; Expires=Sat, 25 Jul 2026 16:19:37 GMT". Invalid 'expires' attribute: Sat, 25 Jul 2026 16:19:37 GMT
[WARNING] Could not get content
org.apache.maven.plugin.MojoFailureException: Not same digest as expected: expected <66bf4ad470b36079c1e0ceca4438053f32649f964fb1de5cd88babce36c5afc0ba6fa7880bc1c9aac791df872cdfc8dc9851bfd3c75ae96786edd8fac61193ae> was <67a1773a9bfe1cee193bc1095d384c8c0c298be5a7cf1ccf3bdc2a51700c81af24b3175d96e7845650f84a6799225ee0d0ecc0624bffdd95cbfd2571fb198dfc>
at com.googlecode.download.maven.plugin.internal.SignatureUtils.verifySignature (SignatureUtils.java:35)
at com.googlecode.download.maven.plugin.internal.WGet.execute (WGet.java:378)
at org.apache.maven.plugin.DefaultBuildPluginManager.executeMojo (DefaultBuildPluginManager.java:126)
at org.apache.maven.lifecycle.internal.MojoExecutor.doExecute2 (MojoExecutor.java:328)
at org.apache.maven.lifecycle.internal.MojoExecutor.doExecute (MojoExecutor.java:316)
at org.apache.maven.lifecycle.internal.MojoExecutor.execute (MojoExecutor.java:212)
at org.apache.maven.lifecycle.internal.MojoExecutor.execute (MojoExecutor.java:174)
at org.apache.maven.lifecycle.internal.MojoExecutor.access$000 (MojoExecutor.java:75)
at org.apache.maven.lifecycle.internal.MojoExecutor$1.run (MojoExecutor.java:162)
at org.apache.maven.plugin.DefaultMojosExecutionStrategy.execute (DefaultMojosExecutionStrategy.java:39)
at org.apache.maven.lifecycle.internal.MojoExecutor.execute (MojoExecutor.java:159)
at org.apache.maven.lifecycle.internal.LifecycleModuleBuilder.buildProject (LifecycleModuleBuilder.java:105)
at org.apache.maven.lifecycle.internal.LifecycleModuleBuilder.buildProject (LifecycleModuleBuilder.java:73)
at org.apache.maven.lifecycle.internal.builder.singlethreaded.SingleThreadedBuilder.build (SingleThreadedBuilder.java:53)
at org.apache.maven.lifecycle.internal.LifecycleStarter.execute (LifecycleStarter.java:118)
at org.apache.maven.DefaultMaven.doExecute (DefaultMaven.java:261)
at org.apache.maven.DefaultMaven.doExecute (DefaultMaven.java:173)
at org.apache.maven.DefaultMaven.execute (DefaultMaven.java:101)
at org.jvnet.hudson.maven3.launcher.Maven35Launcher.main (Maven35Launcher.java:138)
at jdk.internal.reflect.NativeMethodAccessorImpl.invoke0 (Native Method)
at jdk.internal.reflect.NativeMethodAccessorImpl.invoke (NativeMethodAccessorImpl.java:77)
at jdk.internal.reflect.DelegatingMethodAccessorImpl.invoke (DelegatingMethodAccessorImpl.java:43)
at java.lang.reflect.Method.invoke (Method.java:569)
at org.codehaus.plexus.classworlds.launcher.Launcher.launchEnhanced (Launcher.java:255)
at org.codehaus.plexus.classworlds.launcher.Launcher.launch (Launcher.java:201)
at jenkins.maven3.agent.Maven35Main.launch (Maven35Main.java:179)
at jdk.internal.reflect.NativeMethodAccessorImpl.invoke0 (Native Method)
at jdk.internal.reflect.NativeMethodAccessorImpl.invoke (NativeMethodAccessorImpl.java:77)
at jdk.internal.reflect.DelegatingMethodAccessorImpl.invoke (DelegatingMethodAccessorImpl.java:43)
at java.lang.reflect.Method.invoke (Method.java:569)
at hudson.maven.Maven3Builder.call (Maven3Builder.java:140)
at hudson.maven.Maven3Builder.call (Maven3Builder.java:71)
at hudson.remoting.UserRequest.perform (UserRequest.java:225)
at hudson.remoting.UserRequest.perform (UserRequest.java:50)
at hudson.remoting.Request$2.run (Request.java:391)
at hudson.remoting.InterceptingExecutorService.lambda$wrap$0 (InterceptingExecutorService.java:81)
at java.util.concurrent.FutureTask.run (FutureTask.java:264)
at java.util.concurrent.ThreadPoolExecutor.runWorker (ThreadPoolExecutor.java:1136)
at java.util.concurrent.ThreadPoolExecutor$Worker.run (ThreadPoolExecutor.java:635)
at java.lang.Thread.run (Thread.java:840)
[INFO] ------------------------------------------------------------------------
[INFO] Reactor Summary for pdfbox-reactor 2.0.38-SNAPSHOT:
[INFO]
[INFO] Apache PDFBox parent ............................... SUCCESS [ 28.061 s]
[INFO] Apache FontBox ..................................... SUCCESS [01:23 min]
[INFO] Apache XmpBox ...................................... SUCCESS [ 31.889 s]
[INFO] Apache PDFBox ...................................... SUCCESS [04:11 min]
[INFO] Apache Preflight ................................... FAILURE [ 10.523 s]
[INFO] Apache Preflight application ....................... SKIPPED
[INFO] Apache PDFBox Debugger ............................. SKIPPED
[INFO] Apache PDFBox tools ................................ SKIPPED
[INFO] Apache PDFBox application .......................... SKIPPED
[INFO] Apache PDFBox Debugger application ................. SKIPPED
[INFO] Apache PDFBox examples ............................. SKIPPED
[INFO] pdfbox-reactor ..................................... SKIPPED
[INFO] ------------------------------------------------------------------------
[INFO] BUILD FAILURE
[INFO] ------------------------------------------------------------------------
[INFO] Total time: 07:19 min
[INFO] Finished at: 2026-07-25T15:49:54Z
[INFO] ------------------------------------------------------------------------
Waiting for Jenkins to finish collecting data
[ERROR] Failed to execute goal com.googlecode.maven-download-plugin:download-maven-plugin:1.5.1:wget (get-isartor) on project preflight: IO Error: Could not get content -> [Help 1]
[ERROR]
[ERROR] To see the full stack trace of the errors, re-run Maven with the -e switch.
[ERROR] Re-run Maven using the -X switch to enable full debug logging.
[ERROR]
[ERROR] For more information about the errors and possible solutions, please read the following articles:
[ERROR] [Help 1] http://cwiki.apache.org/confluence/display/MAVEN/MojoExecutionException
[ERROR]
[ERROR] After correcting the problems, you can resume the build with the command
[ERROR] mvn <goals> -rf :preflight
[JENKINS] Archiving <https://ci-builds.apache.org/job/PDFBox/job/PDFBox-2.0.x/ws/xmpbox/pom.xml> to org.apache.pdfbox/xmpbox/2.0.38-SNAPSHOT/xmpbox-2.0.38-SNAPSHOT.pom
[JENKINS] Archiving <https://ci-builds.apache.org/job/PDFBox/job/PDFBox-2.0.x/ws/xmpbox/target/xmpbox-2.0.38-SNAPSHOT.jar> to org.apache.pdfbox/xmpbox/2.0.38-20260725.154235-23/xmpbox-2.0.38-20260725.154235-23.jar
[JENKINS] Archiving <https://ci-builds.apache.org/job/PDFBox/job/PDFBox-2.0.x/ws/tools/pom.xml> to org.apache.pdfbox/pdfbox-tools/2.0.38-SNAPSHOT/pdfbox-tools-2.0.38-SNAPSHOT.pom
[JENKINS] Archiving <https://ci-builds.apache.org/job/PDFBox/job/PDFBox-2.0.x/ws/debugger/pom.xml> to org.apache.pdfbox/pdfbox-debugger/2.0.38-SNAPSHOT/pdfbox-debugger-2.0.38-SNAPSHOT.pom
[JENKINS] Archiving <https://ci-builds.apache.org/job/PDFBox/job/PDFBox-2.0.x/ws/preflight-app/pom.xml> to org.apache.pdfbox/preflight-app/2.0.38-SNAPSHOT/preflight-app-2.0.38-SNAPSHOT.pom
[JENKINS] Archiving <https://ci-builds.apache.org/job/PDFBox/job/PDFBox-2.0.x/ws/app/pom.xml> to org.apache.pdfbox/pdfbox-app/2.0.38-SNAPSHOT/pdfbox-app-2.0.38-SNAPSHOT.pom
[JENKINS] Archiving <https://ci-builds.apache.org/job/PDFBox/job/PDFBox-2.0.x/ws/examples/pom.xml> to org.apache.pdfbox/pdfbox-examples/2.0.38-SNAPSHOT/pdfbox-examples-2.0.38-SNAPSHOT.pom
[JENKINS] Archiving <https://ci-builds.apache.org/job/PDFBox/job/PDFBox-2.0.x/ws/preflight/pom.xml> to org.apache.pdfbox/preflight/2.0.38-SNAPSHOT/preflight-2.0.38-SNAPSHOT.pom
[JENKINS] Archiving <https://ci-builds.apache.org/job/PDFBox/job/PDFBox-2.0.x/ws/pom.xml> to org.apache.pdfbox/pdfbox-reactor/2.0.38-SNAPSHOT/pdfbox-reactor-2.0.38-SNAPSHOT.pom
[JENKINS] Archiving <https://ci-builds.apache.org/job/PDFBox/job/PDFBox-2.0.x/ws/parent/pom.xml> to org.apache.pdfbox/pdfbox-parent/2.0.38-SNAPSHOT/pdfbox-parent-2.0.38-SNAPSHOT.pom
[JENKINS] Archiving <https://ci-builds.apache.org/job/PDFBox/job/PDFBox-2.0.x/ws/pdfbox/pom.xml> to org.apache.pdfbox/pdfbox/2.0.38-SNAPSHOT/pdfbox-2.0.38-SNAPSHOT.pom
[JENKINS] Archiving <https://ci-builds.apache.org/job/PDFBox/job/PDFBox-2.0.x/ws/pdfbox/target/pdfbox-2.0.38-SNAPSHOT.jar> to org.apache.pdfbox/pdfbox/2.0.38-20260725.154235-23/pdfbox-2.0.38-20260725.154235-23.jar
[JENKINS] Archiving <https://ci-builds.apache.org/job/PDFBox/job/PDFBox-2.0.x/ws/debugger-app/pom.xml> to org.apache.pdfbox/debugger-app/2.0.38-SNAPSHOT/debugger-app-2.0.38-SNAPSHOT.pom
[JENKINS] Archiving <https://ci-builds.apache.org/job/PDFBox/job/PDFBox-2.0.x/ws/fontbox/pom.xml> to org.apache.pdfbox/fontbox/2.0.38-SNAPSHOT/fontbox-2.0.38-SNAPSHOT.pom
[JENKINS] Archiving <https://ci-builds.apache.org/job/PDFBox/job/PDFBox-2.0.x/ws/fontbox/target/fontbox-2.0.38-SNAPSHOT.jar> to org.apache.pdfbox/fontbox/2.0.38-20260725.154235-23/fontbox-2.0.38-20260725.154235-23.jar
No mail will be sent out, as 'PDFBox » PDFBox-2.0.x » Apache PDFBox examples #2044' does not have a result yet. Please make sure you set a proper result in case of pipeline/build scripts.
No mail will be sent out, as 'PDFBox » PDFBox-2.0.x » Apache PDFBox Debugger application #2044' does not have a result yet. Please make sure you set a proper result in case of pipeline/build scripts.
No mail will be sent out, as 'PDFBox » PDFBox-2.0.x » Apache PDFBox tools #2044' does not have a result yet. Please make sure you set a proper result in case of pipeline/build scripts.
No mail will be sent out, as 'PDFBox » PDFBox-2.0.x » Apache PDFBox Debugger #2044' does not have a result yet. Please make sure you set a proper result in case of pipeline/build scripts.
No mail will be sent out, as 'PDFBox » PDFBox-2.0.x » Apache Preflight application #2044' does not have a result yet. Please make sure you set a proper result in case of pipeline/build scripts.
No mail will be sent out, as 'PDFBox » PDFBox-2.0.x » Apache PDFBox application #2044' does not have a result yet. Please make sure you set a proper result in case of pipeline/build scripts.
Sending e-mails to: dev@pdfbox.apache.org
No mail will be sent out, as 'PDFBox » PDFBox-2.0.x » pdfbox-reactor #2044' does not have a result yet. Please make sure you set a proper result in case of pipeline/build scripts.
channel stopped
Archiving artifacts
---------------------------------------------------------------------
To unsubscribe, e-mail: dev-unsubscribe@pdfbox.apache.org
For additional commands, e-mail: dev-help@pdfbox.apache.org
Jenkins build is back to normal : PDFBox » PDFBox-2.0.x #2049
Posted by Apache Jenkins Server <je...@builds.apache.org>.
See <https://ci-builds.apache.org/job/PDFBox/job/PDFBox-2.0.x/2049/display/redirect>
---------------------------------------------------------------------
To unsubscribe, e-mail: dev-unsubscribe@pdfbox.apache.org
For additional commands, e-mail: dev-help@pdfbox.apache.org
Build failed in Jenkins: PDFBox » PDFBox-2.0.x #2048
Posted by Apache Jenkins Server <je...@builds.apache.org>.
See <https://ci-builds.apache.org/job/PDFBox/job/PDFBox-2.0.x/2048/display/redirect>
Changes:
------------------------------------------
[...truncated 241.10 KiB...]
27.07.2026 03:18:31 INFO text.TestTextStripper:250 - Preparing to parse rotation.pdf for standard test
27.07.2026 03:18:31 WARN font.PDTrueTypeFont:225 - Using fallback font LiberationSerif for TimesNewRomanPSMT
27.07.2026 03:18:31 INFO text.TestTextStripper:246 - Preparing to parse rotation.pdf for sorted test
27.07.2026 03:18:31 WARN font.PDTrueTypeFont:225 - Using fallback font LiberationSerif for TimesNewRomanPSMT
[INFO] Tests run: 5, Failures: 0, Errors: 0, Skipped: 0, Time elapsed: 2.096 s - in org.apache.pdfbox.text.TestTextStripper
[INFO]
[INFO] Results:
[INFO]
[WARNING] Tests run: 709, Failures: 0, Errors: 0, Skipped: 2
[INFO]
[JENKINS] Recording test results
[INFO]
[INFO] --- animal-sniffer:1.17:check (check-java-version) @ pdfbox ---
[INFO] Checking unresolved references to org.codehaus.mojo.signature:java16:1.0
[INFO]
[INFO] --- bundle:3.5.1:bundle (default-bundle) @ pdfbox ---
[INFO]
[INFO] --- site:3.7:attach-descriptor (attach-descriptor) @ pdfbox ---
[INFO] Skipping because packaging 'bundle' is not pom.
[INFO]
[INFO] --- source:3.0.1:jar-no-fork (attach-sources) @ pdfbox ---
[INFO] Skipping source per configuration.
[INFO]
[INFO] --- apache-rat:0.17:check (default) @ pdfbox ---
[WARNING] Basedir is : <https://ci-builds.apache.org/job/PDFBox/job/PDFBox-2.0.x/ws/pdfbox>
[INFO] Excluding patterns: src/main/resources/org/apache/pdfbox/resources/afm/*, src/main/resources/org/apache/pdfbox/resources/icc/*, src/main/resources/org/apache/pdfbox/resources/glyphlist/glyphlist.txt, src/main/resources/org/apache/pdfbox/resources/glyphlist/zapfdingbats.txt, src/main/resources/org/apache/pdfbox/resources/text/BidiMirroring.txt, src/main/resources/META-INF/services/*, src/test/resources/input/rendering/*.ai, src/test/resources/input/*.txt, src/test/resources/input/**/*.pdf, src/test/resources/input/**/*.png, src/test/resources/input/*.pdf, src/test/resources/org/apache/**/*.pdf, src/test/resources/output/*, src/test/resources/org/apache/pdfbox/pdmodel/sRGB.*, src/test/resources/org/apache/pdfbox/pdfparser/*.fdf, release.properties, src/test/resources/org/apache/pdfbox/encryption/*.der, src/test/resources/org/apache/pdfbox/encryption/*.pfx, src/test/resources/org/apache/pdfbox/encryption/*.p12, src/test/resources/org/apache/pdfbox/filter/*.bin, src/test/resources/org/apache/pdfbox/text/*.txt, src/main/java/org/apache/pdfbox/filter/CCITTFaxDecoderStream.java, src/main/java/org/apache/pdfbox/filter/CCITTFaxEncoderStream.java, src/main/java/org/apache/pdfbox/filter/TIFFExtension.java, nb-configuration.xml
[INFO] Excluding MAVEN collection.
[INFO] Excluding ECLIPSE collection.
[INFO] Excluding IDEA collection.
[INFO] Processing exclude file from STANDARD_SCMS.
[INFO] Excluding STANDARD_SCMS collection.
[INFO] Excluding MISC collection.
[INFO] Excluding HIDDEN_DIR collection.
[INFO] RAT summary:
[INFO] Approved: 788
[INFO] Archives: 0
[INFO] Binaries: 37
[INFO] Document types: 4
[INFO] Ignored: 260
[INFO] License categories: 1
[INFO] License names: 1
[INFO] Notices: 2
[INFO] Standards: 788
[INFO] Unapproved: 0
[INFO] Unknown: 0
[INFO]
[INFO] --- dependency-check:10.0.4:check (default) @ pdfbox ---
[INFO] Skipping dependency-check
[INFO]
[INFO] --- install:2.5.2:install (default-install) @ pdfbox ---
[INFO] Installing <https://ci-builds.apache.org/job/PDFBox/job/PDFBox-2.0.x/ws/pdfbox/target/pdfbox-2.0.38-SNAPSHOT.jar> to /home/jenkins/.m2/repository/org/apache/pdfbox/pdfbox/2.0.38-SNAPSHOT/pdfbox-2.0.38-SNAPSHOT.jar
[INFO] Installing <https://ci-builds.apache.org/job/PDFBox/job/PDFBox-2.0.x/ws/pdfbox/pom.xml> to /home/jenkins/.m2/repository/org/apache/pdfbox/pdfbox/2.0.38-SNAPSHOT/pdfbox-2.0.38-SNAPSHOT.pom
[INFO]
[INFO] --- bundle:3.5.1:install (default-install) @ pdfbox ---
[INFO] Installing org/apache/pdfbox/pdfbox/2.0.38-SNAPSHOT/pdfbox-2.0.38-SNAPSHOT.jar
[INFO] Writing OBR metadata
[INFO]
[INFO] --- deploy:2.8.2:deploy (default-deploy) @ pdfbox ---
[INFO] Downloading from apache.snapshots.https: https://repository.apache.org/content/repositories/snapshots/org/apache/pdfbox/pdfbox/2.0.38-SNAPSHOT/maven-metadata.xml
[INFO] Downloaded from apache.snapshots.https: https://repository.apache.org/content/repositories/snapshots/org/apache/pdfbox/pdfbox/2.0.38-SNAPSHOT/maven-metadata.xml (779 B at 1.4 kB/s)
[INFO] Uploading to apache.snapshots.https: https://repository.apache.org/content/repositories/snapshots/org/apache/pdfbox/pdfbox/2.0.38-SNAPSHOT/pdfbox-2.0.38-20260727.031310-27.jar
[INFO] Uploaded to apache.snapshots.https: https://repository.apache.org/content/repositories/snapshots/org/apache/pdfbox/pdfbox/2.0.38-SNAPSHOT/pdfbox-2.0.38-20260727.031310-27.jar (2.8 MB at 1.2 MB/s)
[INFO] Uploading to apache.snapshots.https: https://repository.apache.org/content/repositories/snapshots/org/apache/pdfbox/pdfbox/2.0.38-SNAPSHOT/pdfbox-2.0.38-20260727.031310-27.pom
[INFO] Uploaded to apache.snapshots.https: https://repository.apache.org/content/repositories/snapshots/org/apache/pdfbox/pdfbox/2.0.38-SNAPSHOT/pdfbox-2.0.38-20260727.031310-27.pom (56 kB at 53 kB/s)
[INFO] Downloading from apache.snapshots.https: https://repository.apache.org/content/repositories/snapshots/org/apache/pdfbox/pdfbox/maven-metadata.xml
[INFO] Downloaded from apache.snapshots.https: https://repository.apache.org/content/repositories/snapshots/org/apache/pdfbox/pdfbox/maven-metadata.xml (465 B at 2.6 kB/s)
[INFO] Uploading to apache.snapshots.https: https://repository.apache.org/content/repositories/snapshots/org/apache/pdfbox/pdfbox/2.0.38-SNAPSHOT/maven-metadata.xml
[INFO] Uploaded to apache.snapshots.https: https://repository.apache.org/content/repositories/snapshots/org/apache/pdfbox/pdfbox/2.0.38-SNAPSHOT/maven-metadata.xml (779 B at 742 B/s)
[INFO] Uploading to apache.snapshots.https: https://repository.apache.org/content/repositories/snapshots/org/apache/pdfbox/pdfbox/maven-metadata.xml
[INFO] Uploaded to apache.snapshots.https: https://repository.apache.org/content/repositories/snapshots/org/apache/pdfbox/pdfbox/maven-metadata.xml (465 B at 443 B/s)
[INFO]
[INFO] --- bundle:3.5.1:deploy (default-deploy) @ pdfbox ---
[INFO] Remote OBR update disabled (enable with -DremoteOBR)
[INFO]
[INFO] --------------------< org.apache.pdfbox:preflight >---------------------
[INFO] Building Apache Preflight 2.0.38-SNAPSHOT [5/12]
[INFO] from preflight/pom.xml
[INFO] -------------------------------[ bundle ]-------------------------------
[INFO]
[INFO] --- clean:3.0.0:clean (default-clean) @ preflight ---
[INFO]
[INFO] --- enforcer:1.4.1:enforce (default) @ preflight ---
[INFO]
[INFO] --- enforcer:1.4.1:enforce (enforce-maven-version) @ preflight ---
[INFO]
[INFO] --- checkstyle:3.6.0:check (check) @ preflight ---
[INFO] Starting audit...
Audit done.
[INFO] You have 0 Checkstyle violations.
[INFO]
[INFO] --- remote-resources:1.5:process (process-resource-bundles) @ preflight ---
[INFO]
[INFO] --- resources:3.0.2:resources (default-resources) @ preflight ---
[INFO] Using 'UTF-8' encoding to copy filtered resources.
[INFO] Copying 0 resource
[INFO] Copying 3 resources
[INFO]
[INFO] --- compiler:3.15.0:compile (default-compile) @ preflight ---
[INFO] Recompiling the module because of changed dependency.
[INFO] Compiling 112 source files with javac [forked debug deprecation release 6] to target/classes
[WARNING] [options] source value 6 is obsolete and will be removed in a future release
[WARNING] [options] target value 1.6 is obsolete and will be removed in a future release
[WARNING] [options] To suppress warnings about obsolete options, use -Xlint:-options.
[INFO]
[INFO] --- download:1.5.1:wget (get-isartor) @ preflight ---
[WARNING] Invalid cookie header: "set-cookie: __cf_bm=nyj07JYfwepRJpYWPE6XDqV0jAPCtVyId98pNui_P7Y-1785122362.558872-1.0.1.1-ImUS4WxH.J_.07K06ikSsvkZf.Mf57QQQ3HAb6aIMgHmM5KrOuTrXVvyJLtbjfzVycZPfyFkMXEgeBcnHtkj_JFRmU7kEbQelSiX05bHmJ7COGQelJ6yRtlv3ectUXsE; HttpOnly; SameSite=None; Secure; Path=/; Domain=www.pdfa.org; Expires=Mon, 27 Jul 2026 03:49:22 GMT". Invalid 'expires' attribute: Mon, 27 Jul 2026 03:49:22 GMT
[WARNING] Could not get content
org.apache.maven.plugin.MojoFailureException: Not same digest as expected: expected <66bf4ad470b36079c1e0ceca4438053f32649f964fb1de5cd88babce36c5afc0ba6fa7880bc1c9aac791df872cdfc8dc9851bfd3c75ae96786edd8fac61193ae> was <67a1773a9bfe1cee193bc1095d384c8c0c298be5a7cf1ccf3bdc2a51700c81af24b3175d96e7845650f84a6799225ee0d0ecc0624bffdd95cbfd2571fb198dfc>
at com.googlecode.download.maven.plugin.internal.SignatureUtils.verifySignature (SignatureUtils.java:35)
at com.googlecode.download.maven.plugin.internal.WGet.execute (WGet.java:378)
at org.apache.maven.plugin.DefaultBuildPluginManager.executeMojo (DefaultBuildPluginManager.java:126)
at org.apache.maven.lifecycle.internal.MojoExecutor.doExecute2 (MojoExecutor.java:328)
at org.apache.maven.lifecycle.internal.MojoExecutor.doExecute (MojoExecutor.java:316)
at org.apache.maven.lifecycle.internal.MojoExecutor.execute (MojoExecutor.java:212)
at org.apache.maven.lifecycle.internal.MojoExecutor.execute (MojoExecutor.java:174)
at org.apache.maven.lifecycle.internal.MojoExecutor.access$000 (MojoExecutor.java:75)
at org.apache.maven.lifecycle.internal.MojoExecutor$1.run (MojoExecutor.java:162)
at org.apache.maven.plugin.DefaultMojosExecutionStrategy.execute (DefaultMojosExecutionStrategy.java:39)
at org.apache.maven.lifecycle.internal.MojoExecutor.execute (MojoExecutor.java:159)
at org.apache.maven.lifecycle.internal.LifecycleModuleBuilder.buildProject (LifecycleModuleBuilder.java:105)
at org.apache.maven.lifecycle.internal.LifecycleModuleBuilder.buildProject (LifecycleModuleBuilder.java:73)
at org.apache.maven.lifecycle.internal.builder.singlethreaded.SingleThreadedBuilder.build (SingleThreadedBuilder.java:53)
at org.apache.maven.lifecycle.internal.LifecycleStarter.execute (LifecycleStarter.java:118)
at org.apache.maven.DefaultMaven.doExecute (DefaultMaven.java:261)
at org.apache.maven.DefaultMaven.doExecute (DefaultMaven.java:173)
at org.apache.maven.DefaultMaven.execute (DefaultMaven.java:101)
at org.jvnet.hudson.maven3.launcher.Maven35Launcher.main (Maven35Launcher.java:138)
at jdk.internal.reflect.NativeMethodAccessorImpl.invoke0 (Native Method)
at jdk.internal.reflect.NativeMethodAccessorImpl.invoke (NativeMethodAccessorImpl.java:77)
at jdk.internal.reflect.DelegatingMethodAccessorImpl.invoke (DelegatingMethodAccessorImpl.java:43)
at java.lang.reflect.Method.invoke (Method.java:569)
at org.codehaus.plexus.classworlds.launcher.Launcher.launchEnhanced (Launcher.java:255)
at org.codehaus.plexus.classworlds.launcher.Launcher.launch (Launcher.java:201)
at jenkins.maven3.agent.Maven35Main.launch (Maven35Main.java:179)
at jdk.internal.reflect.NativeMethodAccessorImpl.invoke0 (Native Method)
at jdk.internal.reflect.NativeMethodAccessorImpl.invoke (NativeMethodAccessorImpl.java:77)
at jdk.internal.reflect.DelegatingMethodAccessorImpl.invoke (DelegatingMethodAccessorImpl.java:43)
at java.lang.reflect.Method.invoke (Method.java:569)
at hudson.maven.Maven3Builder.call (Maven3Builder.java:140)
at hudson.maven.Maven3Builder.call (Maven3Builder.java:71)
at hudson.remoting.UserRequest.perform (UserRequest.java:225)
at hudson.remoting.UserRequest.perform (UserRequest.java:50)
at hudson.remoting.Request$2.run (Request.java:391)
at hudson.remoting.InterceptingExecutorService.lambda$wrap$0 (InterceptingExecutorService.java:81)
at java.util.concurrent.FutureTask.run (FutureTask.java:264)
at java.util.concurrent.ThreadPoolExecutor.runWorker (ThreadPoolExecutor.java:1136)
at java.util.concurrent.ThreadPoolExecutor$Worker.run (ThreadPoolExecutor.java:635)
at java.lang.Thread.run (Thread.java:840)
[WARNING] Retrying (1 more)
[WARNING] Invalid cookie header: "set-cookie: __cf_bm=htSzWV2KVwXQEcRqH0HUKg8qklow_OewcNHJPbFSL6o-1785122362.724365-1.0.1.1-0COPQe6fntYlEegXNK.xgDX.nM3TNGQNcbpfe3XMa9Y3qVeFYEUBlfb_78cfWBsf2YkS2H78zyPnYWILeBk7EoOosEBkS9YBWOMyO9hBIEZ8awcDqo7GQ9ZI9hjL.8oh; HttpOnly; SameSite=None; Secure; Path=/; Domain=www.pdfa.org; Expires=Mon, 27 Jul 2026 03:49:22 GMT". Invalid 'expires' attribute: Mon, 27 Jul 2026 03:49:22 GMT
[WARNING] Could not get content
org.apache.maven.plugin.MojoFailureException: Not same digest as expected: expected <66bf4ad470b36079c1e0ceca4438053f32649f964fb1de5cd88babce36c5afc0ba6fa7880bc1c9aac791df872cdfc8dc9851bfd3c75ae96786edd8fac61193ae> was <67a1773a9bfe1cee193bc1095d384c8c0c298be5a7cf1ccf3bdc2a51700c81af24b3175d96e7845650f84a6799225ee0d0ecc0624bffdd95cbfd2571fb198dfc>
at com.googlecode.download.maven.plugin.internal.SignatureUtils.verifySignature (SignatureUtils.java:35)
at com.googlecode.download.maven.plugin.internal.WGet.execute (WGet.java:378)
at org.apache.maven.plugin.DefaultBuildPluginManager.executeMojo (DefaultBuildPluginManager.java:126)
at org.apache.maven.lifecycle.internal.MojoExecutor.doExecute2 (MojoExecutor.java:328)
at org.apache.maven.lifecycle.internal.MojoExecutor.doExecute (MojoExecutor.java:316)
at org.apache.maven.lifecycle.internal.MojoExecutor.execute (MojoExecutor.java:212)
at org.apache.maven.lifecycle.internal.MojoExecutor.execute (MojoExecutor.java:174)
at org.apache.maven.lifecycle.internal.MojoExecutor.access$000 (MojoExecutor.java:75)
at org.apache.maven.lifecycle.internal.MojoExecutor$1.run (MojoExecutor.java:162)
at org.apache.maven.plugin.DefaultMojosExecutionStrategy.execute (DefaultMojosExecutionStrategy.java:39)
at org.apache.maven.lifecycle.internal.MojoExecutor.execute (MojoExecutor.java:159)
at org.apache.maven.lifecycle.internal.LifecycleModuleBuilder.buildProject (LifecycleModuleBuilder.java:105)
at org.apache.maven.lifecycle.internal.LifecycleModuleBuilder.buildProject (LifecycleModuleBuilder.java:73)
at org.apache.maven.lifecycle.internal.builder.singlethreaded.SingleThreadedBuilder.build (SingleThreadedBuilder.java:53)
at org.apache.maven.lifecycle.internal.LifecycleStarter.execute (LifecycleStarter.java:118)
at org.apache.maven.DefaultMaven.doExecute (DefaultMaven.java:261)
at org.apache.maven.DefaultMaven.doExecute (DefaultMaven.java:173)
at org.apache.maven.DefaultMaven.execute (DefaultMaven.java:101)
at org.jvnet.hudson.maven3.launcher.Maven35Launcher.main (Maven35Launcher.java:138)
at jdk.internal.reflect.NativeMethodAccessorImpl.invoke0 (Native Method)
at jdk.internal.reflect.NativeMethodAccessorImpl.invoke (NativeMethodAccessorImpl.java:77)
at jdk.internal.reflect.DelegatingMethodAccessorImpl.invoke (DelegatingMethodAccessorImpl.java:43)
at java.lang.reflect.Method.invoke (Method.java:569)
at org.codehaus.plexus.classworlds.launcher.Launcher.launchEnhanced (Launcher.java:255)
at org.codehaus.plexus.classworlds.launcher.Launcher.launch (Launcher.java:201)
at jenkins.maven3.agent.Maven35Main.launch (Maven35Main.java:179)
at jdk.internal.reflect.NativeMethodAccessorImpl.invoke0 (Native Method)
at jdk.internal.reflect.NativeMethodAccessorImpl.invoke (NativeMethodAccessorImpl.java:77)
at jdk.internal.reflect.DelegatingMethodAccessorImpl.invoke (DelegatingMethodAccessorImpl.java:43)
at java.lang.reflect.Method.invoke (Method.java:569)
at hudson.maven.Maven3Builder.call (Maven3Builder.java:140)
at hudson.maven.Maven3Builder.call (Maven3Builder.java:71)
at hudson.remoting.UserRequest.perform (UserRequest.java:225)
at hudson.remoting.UserRequest.perform (UserRequest.java:50)
at hudson.remoting.Request$2.run (Request.java:391)
at hudson.remoting.InterceptingExecutorService.lambda$wrap$0 (InterceptingExecutorService.java:81)
at java.util.concurrent.FutureTask.run (FutureTask.java:264)
at java.util.concurrent.ThreadPoolExecutor.runWorker (ThreadPoolExecutor.java:1136)
at java.util.concurrent.ThreadPoolExecutor$Worker.run (ThreadPoolExecutor.java:635)
at java.lang.Thread.run (Thread.java:840)
[INFO] ------------------------------------------------------------------------
[INFO] Reactor Summary for pdfbox-reactor 2.0.38-SNAPSHOT:
[INFO]
[INFO] Apache PDFBox parent ............................... SUCCESS [ 23.456 s]
[INFO] Apache FontBox ..................................... SUCCESS [01:12 min]
[INFO] Apache XmpBox ...................................... SUCCESS [ 31.804 s]
[INFO] Apache PDFBox ...................................... SUCCESS [03:38 min]
[INFO] Apache Preflight ................................... FAILURE [ 10.945 s]
[INFO] Apache Preflight application ....................... SKIPPED
[INFO] Apache PDFBox Debugger ............................. SKIPPED
[INFO] Apache PDFBox tools ................................ SKIPPED
[INFO] Apache PDFBox application .......................... SKIPPED
[INFO] Apache PDFBox Debugger application ................. SKIPPED
[INFO] Apache PDFBox examples ............................. SKIPPED
[INFO] pdfbox-reactor ..................................... SKIPPED
[INFO] ------------------------------------------------------------------------
[INFO] BUILD FAILURE
[INFO] ------------------------------------------------------------------------
[INFO] Total time: 06:27 min
[INFO] Finished at: 2026-07-27T03:19:38Z
[INFO] ------------------------------------------------------------------------
Waiting for Jenkins to finish collecting data
[ERROR] Failed to execute goal com.googlecode.maven-download-plugin:download-maven-plugin:1.5.1:wget (get-isartor) on project preflight: IO Error: Could not get content -> [Help 1]
[ERROR]
[ERROR] To see the full stack trace of the errors, re-run Maven with the -e switch.
[ERROR] Re-run Maven using the -X switch to enable full debug logging.
[ERROR]
[ERROR] For more information about the errors and possible solutions, please read the following articles:
[ERROR] [Help 1] http://cwiki.apache.org/confluence/display/MAVEN/MojoExecutionException
[ERROR]
[ERROR] After correcting the problems, you can resume the build with the command
[ERROR] mvn <goals> -rf :preflight
[JENKINS] Archiving <https://ci-builds.apache.org/job/PDFBox/job/PDFBox-2.0.x/ws/xmpbox/pom.xml> to org.apache.pdfbox/xmpbox/2.0.38-SNAPSHOT/xmpbox-2.0.38-SNAPSHOT.pom
[JENKINS] Archiving <https://ci-builds.apache.org/job/PDFBox/job/PDFBox-2.0.x/ws/xmpbox/target/xmpbox-2.0.38-SNAPSHOT.jar> to org.apache.pdfbox/xmpbox/2.0.38-20260727.031310-27/xmpbox-2.0.38-20260727.031310-27.jar
[JENKINS] Archiving <https://ci-builds.apache.org/job/PDFBox/job/PDFBox-2.0.x/ws/tools/pom.xml> to org.apache.pdfbox/pdfbox-tools/2.0.38-SNAPSHOT/pdfbox-tools-2.0.38-SNAPSHOT.pom
[JENKINS] Archiving <https://ci-builds.apache.org/job/PDFBox/job/PDFBox-2.0.x/ws/debugger/pom.xml> to org.apache.pdfbox/pdfbox-debugger/2.0.38-SNAPSHOT/pdfbox-debugger-2.0.38-SNAPSHOT.pom
[JENKINS] Archiving <https://ci-builds.apache.org/job/PDFBox/job/PDFBox-2.0.x/ws/preflight-app/pom.xml> to org.apache.pdfbox/preflight-app/2.0.38-SNAPSHOT/preflight-app-2.0.38-SNAPSHOT.pom
[JENKINS] Archiving <https://ci-builds.apache.org/job/PDFBox/job/PDFBox-2.0.x/ws/app/pom.xml> to org.apache.pdfbox/pdfbox-app/2.0.38-SNAPSHOT/pdfbox-app-2.0.38-SNAPSHOT.pom
[JENKINS] Archiving <https://ci-builds.apache.org/job/PDFBox/job/PDFBox-2.0.x/ws/examples/pom.xml> to org.apache.pdfbox/pdfbox-examples/2.0.38-SNAPSHOT/pdfbox-examples-2.0.38-SNAPSHOT.pom
[JENKINS] Archiving <https://ci-builds.apache.org/job/PDFBox/job/PDFBox-2.0.x/ws/preflight/pom.xml> to org.apache.pdfbox/preflight/2.0.38-SNAPSHOT/preflight-2.0.38-SNAPSHOT.pom
[JENKINS] Archiving <https://ci-builds.apache.org/job/PDFBox/job/PDFBox-2.0.x/ws/pom.xml> to org.apache.pdfbox/pdfbox-reactor/2.0.38-SNAPSHOT/pdfbox-reactor-2.0.38-SNAPSHOT.pom
[JENKINS] Archiving <https://ci-builds.apache.org/job/PDFBox/job/PDFBox-2.0.x/ws/parent/pom.xml> to org.apache.pdfbox/pdfbox-parent/2.0.38-SNAPSHOT/pdfbox-parent-2.0.38-SNAPSHOT.pom
[JENKINS] Archiving <https://ci-builds.apache.org/job/PDFBox/job/PDFBox-2.0.x/ws/pdfbox/pom.xml> to org.apache.pdfbox/pdfbox/2.0.38-SNAPSHOT/pdfbox-2.0.38-SNAPSHOT.pom
[JENKINS] Archiving <https://ci-builds.apache.org/job/PDFBox/job/PDFBox-2.0.x/ws/pdfbox/target/pdfbox-2.0.38-SNAPSHOT.jar> to org.apache.pdfbox/pdfbox/2.0.38-20260727.031310-27/pdfbox-2.0.38-20260727.031310-27.jar
[JENKINS] Archiving <https://ci-builds.apache.org/job/PDFBox/job/PDFBox-2.0.x/ws/debugger-app/pom.xml> to org.apache.pdfbox/debugger-app/2.0.38-SNAPSHOT/debugger-app-2.0.38-SNAPSHOT.pom
[JENKINS] Archiving <https://ci-builds.apache.org/job/PDFBox/job/PDFBox-2.0.x/ws/fontbox/pom.xml> to org.apache.pdfbox/fontbox/2.0.38-SNAPSHOT/fontbox-2.0.38-SNAPSHOT.pom
[JENKINS] Archiving <https://ci-builds.apache.org/job/PDFBox/job/PDFBox-2.0.x/ws/fontbox/target/fontbox-2.0.38-SNAPSHOT.jar> to org.apache.pdfbox/fontbox/2.0.38-20260727.031310-27/fontbox-2.0.38-20260727.031310-27.jar
No mail will be sent out, as 'PDFBox » PDFBox-2.0.x » Apache PDFBox examples #2048' does not have a result yet. Please make sure you set a proper result in case of pipeline/build scripts.
No mail will be sent out, as 'PDFBox » PDFBox-2.0.x » Apache PDFBox Debugger application #2048' does not have a result yet. Please make sure you set a proper result in case of pipeline/build scripts.
No mail will be sent out, as 'PDFBox » PDFBox-2.0.x » Apache PDFBox tools #2048' does not have a result yet. Please make sure you set a proper result in case of pipeline/build scripts.
No mail will be sent out, as 'PDFBox » PDFBox-2.0.x » Apache PDFBox Debugger #2048' does not have a result yet. Please make sure you set a proper result in case of pipeline/build scripts.
No mail will be sent out, as 'PDFBox » PDFBox-2.0.x » Apache Preflight application #2048' does not have a result yet. Please make sure you set a proper result in case of pipeline/build scripts.
No mail will be sent out, as 'PDFBox » PDFBox-2.0.x » Apache PDFBox application #2048' does not have a result yet. Please make sure you set a proper result in case of pipeline/build scripts.
Sending e-mails to: dev@pdfbox.apache.org
No mail will be sent out, as 'PDFBox » PDFBox-2.0.x » pdfbox-reactor #2048' does not have a result yet. Please make sure you set a proper result in case of pipeline/build scripts.
channel stopped
Archiving artifacts
---------------------------------------------------------------------
To unsubscribe, e-mail: dev-unsubscribe@pdfbox.apache.org
For additional commands, e-mail: dev-help@pdfbox.apache.org
Build failed in Jenkins: PDFBox » PDFBox-2.0.x #2047
Posted by Apache Jenkins Server <je...@builds.apache.org>.
See <https://ci-builds.apache.org/job/PDFBox/job/PDFBox-2.0.x/2047/display/redirect>
Changes:
------------------------------------------
[...truncated 241.09 KiB...]
26.07.2026 04:18:38 INFO text.TestTextStripper:250 - Preparing to parse rotation.pdf for standard test
26.07.2026 04:18:38 WARN font.PDTrueTypeFont:225 - Using fallback font LiberationSerif for TimesNewRomanPSMT
26.07.2026 04:18:38 INFO text.TestTextStripper:246 - Preparing to parse rotation.pdf for sorted test
26.07.2026 04:18:38 WARN font.PDTrueTypeFont:225 - Using fallback font LiberationSerif for TimesNewRomanPSMT
[INFO] Tests run: 5, Failures: 0, Errors: 0, Skipped: 0, Time elapsed: 2.165 s - in org.apache.pdfbox.text.TestTextStripper
[INFO]
[INFO] Results:
[INFO]
[WARNING] Tests run: 709, Failures: 0, Errors: 0, Skipped: 2
[INFO]
[JENKINS] Recording test results
[INFO]
[INFO] --- animal-sniffer:1.17:check (check-java-version) @ pdfbox ---
[INFO] Checking unresolved references to org.codehaus.mojo.signature:java16:1.0
[INFO]
[INFO] --- bundle:3.5.1:bundle (default-bundle) @ pdfbox ---
[INFO]
[INFO] --- site:3.7:attach-descriptor (attach-descriptor) @ pdfbox ---
[INFO] Skipping because packaging 'bundle' is not pom.
[INFO]
[INFO] --- source:3.0.1:jar-no-fork (attach-sources) @ pdfbox ---
[INFO] Skipping source per configuration.
[INFO]
[INFO] --- apache-rat:0.17:check (default) @ pdfbox ---
[WARNING] Basedir is : <https://ci-builds.apache.org/job/PDFBox/job/PDFBox-2.0.x/ws/pdfbox>
[INFO] Excluding patterns: src/main/resources/org/apache/pdfbox/resources/afm/*, src/main/resources/org/apache/pdfbox/resources/icc/*, src/main/resources/org/apache/pdfbox/resources/glyphlist/glyphlist.txt, src/main/resources/org/apache/pdfbox/resources/glyphlist/zapfdingbats.txt, src/main/resources/org/apache/pdfbox/resources/text/BidiMirroring.txt, src/main/resources/META-INF/services/*, src/test/resources/input/rendering/*.ai, src/test/resources/input/*.txt, src/test/resources/input/**/*.pdf, src/test/resources/input/**/*.png, src/test/resources/input/*.pdf, src/test/resources/org/apache/**/*.pdf, src/test/resources/output/*, src/test/resources/org/apache/pdfbox/pdmodel/sRGB.*, src/test/resources/org/apache/pdfbox/pdfparser/*.fdf, release.properties, src/test/resources/org/apache/pdfbox/encryption/*.der, src/test/resources/org/apache/pdfbox/encryption/*.pfx, src/test/resources/org/apache/pdfbox/encryption/*.p12, src/test/resources/org/apache/pdfbox/filter/*.bin, src/test/resources/org/apache/pdfbox/text/*.txt, src/main/java/org/apache/pdfbox/filter/CCITTFaxDecoderStream.java, src/main/java/org/apache/pdfbox/filter/CCITTFaxEncoderStream.java, src/main/java/org/apache/pdfbox/filter/TIFFExtension.java, nb-configuration.xml
[INFO] Excluding MAVEN collection.
[INFO] Excluding ECLIPSE collection.
[INFO] Excluding IDEA collection.
[INFO] Processing exclude file from STANDARD_SCMS.
[INFO] Excluding STANDARD_SCMS collection.
[INFO] Excluding MISC collection.
[INFO] Excluding HIDDEN_DIR collection.
[INFO] RAT summary:
[INFO] Approved: 788
[INFO] Archives: 0
[INFO] Binaries: 37
[INFO] Document types: 4
[INFO] Ignored: 260
[INFO] License categories: 1
[INFO] License names: 1
[INFO] Notices: 2
[INFO] Standards: 788
[INFO] Unapproved: 0
[INFO] Unknown: 0
[INFO]
[INFO] --- dependency-check:10.0.4:check (default) @ pdfbox ---
[INFO] Skipping dependency-check
[INFO]
[INFO] --- install:2.5.2:install (default-install) @ pdfbox ---
[INFO] Installing <https://ci-builds.apache.org/job/PDFBox/job/PDFBox-2.0.x/ws/pdfbox/target/pdfbox-2.0.38-SNAPSHOT.jar> to /home/jenkins/.m2/repository/org/apache/pdfbox/pdfbox/2.0.38-SNAPSHOT/pdfbox-2.0.38-SNAPSHOT.jar
[INFO] Installing <https://ci-builds.apache.org/job/PDFBox/job/PDFBox-2.0.x/ws/pdfbox/pom.xml> to /home/jenkins/.m2/repository/org/apache/pdfbox/pdfbox/2.0.38-SNAPSHOT/pdfbox-2.0.38-SNAPSHOT.pom
[INFO]
[INFO] --- bundle:3.5.1:install (default-install) @ pdfbox ---
[INFO] Installing org/apache/pdfbox/pdfbox/2.0.38-SNAPSHOT/pdfbox-2.0.38-SNAPSHOT.jar
[INFO] Writing OBR metadata
[INFO]
[INFO] --- deploy:2.8.2:deploy (default-deploy) @ pdfbox ---
[INFO] Downloading from apache.snapshots.https: https://repository.apache.org/content/repositories/snapshots/org/apache/pdfbox/pdfbox/2.0.38-SNAPSHOT/maven-metadata.xml
[INFO] Downloaded from apache.snapshots.https: https://repository.apache.org/content/repositories/snapshots/org/apache/pdfbox/pdfbox/2.0.38-SNAPSHOT/maven-metadata.xml (779 B at 1.4 kB/s)
[INFO] Uploading to apache.snapshots.https: https://repository.apache.org/content/repositories/snapshots/org/apache/pdfbox/pdfbox/2.0.38-SNAPSHOT/pdfbox-2.0.38-20260726.041314-26.jar
[INFO] Uploaded to apache.snapshots.https: https://repository.apache.org/content/repositories/snapshots/org/apache/pdfbox/pdfbox/2.0.38-SNAPSHOT/pdfbox-2.0.38-20260726.041314-26.jar (2.8 MB at 1.2 MB/s)
[INFO] Uploading to apache.snapshots.https: https://repository.apache.org/content/repositories/snapshots/org/apache/pdfbox/pdfbox/2.0.38-SNAPSHOT/pdfbox-2.0.38-20260726.041314-26.pom
[INFO] Uploaded to apache.snapshots.https: https://repository.apache.org/content/repositories/snapshots/org/apache/pdfbox/pdfbox/2.0.38-SNAPSHOT/pdfbox-2.0.38-20260726.041314-26.pom (56 kB at 53 kB/s)
[INFO] Downloading from apache.snapshots.https: https://repository.apache.org/content/repositories/snapshots/org/apache/pdfbox/pdfbox/maven-metadata.xml
[INFO] Downloaded from apache.snapshots.https: https://repository.apache.org/content/repositories/snapshots/org/apache/pdfbox/pdfbox/maven-metadata.xml (465 B at 2.6 kB/s)
[INFO] Uploading to apache.snapshots.https: https://repository.apache.org/content/repositories/snapshots/org/apache/pdfbox/pdfbox/2.0.38-SNAPSHOT/maven-metadata.xml
[INFO] Uploaded to apache.snapshots.https: https://repository.apache.org/content/repositories/snapshots/org/apache/pdfbox/pdfbox/2.0.38-SNAPSHOT/maven-metadata.xml (779 B at 739 B/s)
[INFO] Uploading to apache.snapshots.https: https://repository.apache.org/content/repositories/snapshots/org/apache/pdfbox/pdfbox/maven-metadata.xml
[INFO] Uploaded to apache.snapshots.https: https://repository.apache.org/content/repositories/snapshots/org/apache/pdfbox/pdfbox/maven-metadata.xml (465 B at 441 B/s)
[INFO]
[INFO] --- bundle:3.5.1:deploy (default-deploy) @ pdfbox ---
[INFO] Remote OBR update disabled (enable with -DremoteOBR)
[INFO]
[INFO] --------------------< org.apache.pdfbox:preflight >---------------------
[INFO] Building Apache Preflight 2.0.38-SNAPSHOT [5/12]
[INFO] from preflight/pom.xml
[INFO] -------------------------------[ bundle ]-------------------------------
[INFO]
[INFO] --- clean:3.0.0:clean (default-clean) @ preflight ---
[INFO]
[INFO] --- enforcer:1.4.1:enforce (default) @ preflight ---
[INFO]
[INFO] --- enforcer:1.4.1:enforce (enforce-maven-version) @ preflight ---
[INFO]
[INFO] --- checkstyle:3.6.0:check (check) @ preflight ---
[INFO] Starting audit...
Audit done.
[INFO] You have 0 Checkstyle violations.
[INFO]
[INFO] --- remote-resources:1.5:process (process-resource-bundles) @ preflight ---
[INFO]
[INFO] --- resources:3.0.2:resources (default-resources) @ preflight ---
[INFO] Using 'UTF-8' encoding to copy filtered resources.
[INFO] Copying 0 resource
[INFO] Copying 3 resources
[INFO]
[INFO] --- compiler:3.15.0:compile (default-compile) @ preflight ---
[INFO] Recompiling the module because of changed dependency.
[INFO] Compiling 112 source files with javac [forked debug deprecation release 6] to target/classes
[WARNING] [options] source value 6 is obsolete and will be removed in a future release
[WARNING] [options] target value 1.6 is obsolete and will be removed in a future release
[WARNING] [options] To suppress warnings about obsolete options, use -Xlint:-options.
[INFO]
[INFO] --- download:1.5.1:wget (get-isartor) @ preflight ---
[WARNING] Invalid cookie header: "set-cookie: __cf_bm=ZIskZFPBgPI.94QZvfttzT8g4H7ITd34sSoyR_rY7BM-1785039570.6737669-1.0.1.1-KRDayY4ndph0rig.5uOoeT1B2NDrJDclfcdm13LSkdpQ.t0oAsG.Mbpjl90zyfxHieBz3wCtC.s7Tg.44VJ3qzmiykOliCpZRDIWhiKDgX0rWogghKlguhhZT0DmSghI; HttpOnly; SameSite=None; Secure; Path=/; Domain=www.pdfa.org; Expires=Sun, 26 Jul 2026 04:49:30 GMT". Invalid 'expires' attribute: Sun, 26 Jul 2026 04:49:30 GMT
[WARNING] Could not get content
org.apache.maven.plugin.MojoFailureException: Not same digest as expected: expected <66bf4ad470b36079c1e0ceca4438053f32649f964fb1de5cd88babce36c5afc0ba6fa7880bc1c9aac791df872cdfc8dc9851bfd3c75ae96786edd8fac61193ae> was <67a1773a9bfe1cee193bc1095d384c8c0c298be5a7cf1ccf3bdc2a51700c81af24b3175d96e7845650f84a6799225ee0d0ecc0624bffdd95cbfd2571fb198dfc>
at com.googlecode.download.maven.plugin.internal.SignatureUtils.verifySignature (SignatureUtils.java:35)
at com.googlecode.download.maven.plugin.internal.WGet.execute (WGet.java:378)
at org.apache.maven.plugin.DefaultBuildPluginManager.executeMojo (DefaultBuildPluginManager.java:126)
at org.apache.maven.lifecycle.internal.MojoExecutor.doExecute2 (MojoExecutor.java:328)
at org.apache.maven.lifecycle.internal.MojoExecutor.doExecute (MojoExecutor.java:316)
at org.apache.maven.lifecycle.internal.MojoExecutor.execute (MojoExecutor.java:212)
at org.apache.maven.lifecycle.internal.MojoExecutor.execute (MojoExecutor.java:174)
at org.apache.maven.lifecycle.internal.MojoExecutor.access$000 (MojoExecutor.java:75)
at org.apache.maven.lifecycle.internal.MojoExecutor$1.run (MojoExecutor.java:162)
at org.apache.maven.plugin.DefaultMojosExecutionStrategy.execute (DefaultMojosExecutionStrategy.java:39)
at org.apache.maven.lifecycle.internal.MojoExecutor.execute (MojoExecutor.java:159)
at org.apache.maven.lifecycle.internal.LifecycleModuleBuilder.buildProject (LifecycleModuleBuilder.java:105)
at org.apache.maven.lifecycle.internal.LifecycleModuleBuilder.buildProject (LifecycleModuleBuilder.java:73)
at org.apache.maven.lifecycle.internal.builder.singlethreaded.SingleThreadedBuilder.build (SingleThreadedBuilder.java:53)
at org.apache.maven.lifecycle.internal.LifecycleStarter.execute (LifecycleStarter.java:118)
at org.apache.maven.DefaultMaven.doExecute (DefaultMaven.java:261)
at org.apache.maven.DefaultMaven.doExecute (DefaultMaven.java:173)
at org.apache.maven.DefaultMaven.execute (DefaultMaven.java:101)
at org.jvnet.hudson.maven3.launcher.Maven35Launcher.main (Maven35Launcher.java:138)
at jdk.internal.reflect.NativeMethodAccessorImpl.invoke0 (Native Method)
at jdk.internal.reflect.NativeMethodAccessorImpl.invoke (NativeMethodAccessorImpl.java:77)
at jdk.internal.reflect.DelegatingMethodAccessorImpl.invoke (DelegatingMethodAccessorImpl.java:43)
at java.lang.reflect.Method.invoke (Method.java:569)
at org.codehaus.plexus.classworlds.launcher.Launcher.launchEnhanced (Launcher.java:255)
at org.codehaus.plexus.classworlds.launcher.Launcher.launch (Launcher.java:201)
at jenkins.maven3.agent.Maven35Main.launch (Maven35Main.java:179)
at jdk.internal.reflect.NativeMethodAccessorImpl.invoke0 (Native Method)
at jdk.internal.reflect.NativeMethodAccessorImpl.invoke (NativeMethodAccessorImpl.java:77)
at jdk.internal.reflect.DelegatingMethodAccessorImpl.invoke (DelegatingMethodAccessorImpl.java:43)
at java.lang.reflect.Method.invoke (Method.java:569)
at hudson.maven.Maven3Builder.call (Maven3Builder.java:140)
at hudson.maven.Maven3Builder.call (Maven3Builder.java:71)
at hudson.remoting.UserRequest.perform (UserRequest.java:225)
at hudson.remoting.UserRequest.perform (UserRequest.java:50)
at hudson.remoting.Request$2.run (Request.java:391)
at hudson.remoting.InterceptingExecutorService.lambda$wrap$0 (InterceptingExecutorService.java:81)
at java.util.concurrent.FutureTask.run (FutureTask.java:264)
at java.util.concurrent.ThreadPoolExecutor.runWorker (ThreadPoolExecutor.java:1136)
at java.util.concurrent.ThreadPoolExecutor$Worker.run (ThreadPoolExecutor.java:635)
at java.lang.Thread.run (Thread.java:840)
[WARNING] Retrying (1 more)
[WARNING] Invalid cookie header: "set-cookie: __cf_bm=Kd4QSyoL_Qyq_e_FzhOg6d79Mh_SI3eWdskkeW3Fwcw-1785039570.922704-1.0.1.1-ibXaUXp1ecsjVMWQg.48_hcHwcDA8MTylG7iZ_sjVv1El2XPyvTVbfYQCJx1_BHXbeFkUFA4UNYnmXjiYZPMK5vkHbnWsy4ZAbZAm3rU5K3NAoF_TgJWwvGQmmOIZcw4; HttpOnly; SameSite=None; Secure; Path=/; Domain=www.pdfa.org; Expires=Sun, 26 Jul 2026 04:49:30 GMT". Invalid 'expires' attribute: Sun, 26 Jul 2026 04:49:30 GMT
[WARNING] Could not get content
org.apache.maven.plugin.MojoFailureException: Not same digest as expected: expected <66bf4ad470b36079c1e0ceca4438053f32649f964fb1de5cd88babce36c5afc0ba6fa7880bc1c9aac791df872cdfc8dc9851bfd3c75ae96786edd8fac61193ae> was <67a1773a9bfe1cee193bc1095d384c8c0c298be5a7cf1ccf3bdc2a51700c81af24b3175d96e7845650f84a6799225ee0d0ecc0624bffdd95cbfd2571fb198dfc>
at com.googlecode.download.maven.plugin.internal.SignatureUtils.verifySignature (SignatureUtils.java:35)
at com.googlecode.download.maven.plugin.internal.WGet.execute (WGet.java:378)
at org.apache.maven.plugin.DefaultBuildPluginManager.executeMojo (DefaultBuildPluginManager.java:126)
at org.apache.maven.lifecycle.internal.MojoExecutor.doExecute2 (MojoExecutor.java:328)
at org.apache.maven.lifecycle.internal.MojoExecutor.doExecute (MojoExecutor.java:316)
at org.apache.maven.lifecycle.internal.MojoExecutor.execute (MojoExecutor.java:212)
at org.apache.maven.lifecycle.internal.MojoExecutor.execute (MojoExecutor.java:174)
at org.apache.maven.lifecycle.internal.MojoExecutor.access$000 (MojoExecutor.java:75)
at org.apache.maven.lifecycle.internal.MojoExecutor$1.run (MojoExecutor.java:162)
at org.apache.maven.plugin.DefaultMojosExecutionStrategy.execute (DefaultMojosExecutionStrategy.java:39)
at org.apache.maven.lifecycle.internal.MojoExecutor.execute (MojoExecutor.java:159)
at org.apache.maven.lifecycle.internal.LifecycleModuleBuilder.buildProject (LifecycleModuleBuilder.java:105)
at org.apache.maven.lifecycle.internal.LifecycleModuleBuilder.buildProject (LifecycleModuleBuilder.java:73)
at org.apache.maven.lifecycle.internal.builder.singlethreaded.SingleThreadedBuilder.build (SingleThreadedBuilder.java:53)
at org.apache.maven.lifecycle.internal.LifecycleStarter.execute (LifecycleStarter.java:118)
at org.apache.maven.DefaultMaven.doExecute (DefaultMaven.java:261)
at org.apache.maven.DefaultMaven.doExecute (DefaultMaven.java:173)
at org.apache.maven.DefaultMaven.execute (DefaultMaven.java:101)
at org.jvnet.hudson.maven3.launcher.Maven35Launcher.main (Maven35Launcher.java:138)
at jdk.internal.reflect.NativeMethodAccessorImpl.invoke0 (Native Method)
at jdk.internal.reflect.NativeMethodAccessorImpl.invoke (NativeMethodAccessorImpl.java:77)
at jdk.internal.reflect.DelegatingMethodAccessorImpl.invoke (DelegatingMethodAccessorImpl.java:43)
at java.lang.reflect.Method.invoke (Method.java:569)
at org.codehaus.plexus.classworlds.launcher.Launcher.launchEnhanced (Launcher.java:255)
at org.codehaus.plexus.classworlds.launcher.Launcher.launch (Launcher.java:201)
at jenkins.maven3.agent.Maven35Main.launch (Maven35Main.java:179)
at jdk.internal.reflect.NativeMethodAccessorImpl.invoke0 (Native Method)
at jdk.internal.reflect.NativeMethodAccessorImpl.invoke (NativeMethodAccessorImpl.java:77)
at jdk.internal.reflect.DelegatingMethodAccessorImpl.invoke (DelegatingMethodAccessorImpl.java:43)
at java.lang.reflect.Method.invoke (Method.java:569)
at hudson.maven.Maven3Builder.call (Maven3Builder.java:140)
at hudson.maven.Maven3Builder.call (Maven3Builder.java:71)
at hudson.remoting.UserRequest.perform (UserRequest.java:225)
at hudson.remoting.UserRequest.perform (UserRequest.java:50)
at hudson.remoting.Request$2.run (Request.java:391)
at hudson.remoting.InterceptingExecutorService.lambda$wrap$0 (InterceptingExecutorService.java:81)
at java.util.concurrent.FutureTask.run (FutureTask.java:264)
at java.util.concurrent.ThreadPoolExecutor.runWorker (ThreadPoolExecutor.java:1136)
at java.util.concurrent.ThreadPoolExecutor$Worker.run (ThreadPoolExecutor.java:635)
at java.lang.Thread.run (Thread.java:840)
[INFO] ------------------------------------------------------------------------
[INFO] Reactor Summary for pdfbox-reactor 2.0.38-SNAPSHOT:
[INFO]
[INFO] Apache PDFBox parent ............................... SUCCESS [ 22.903 s]
[INFO] Apache FontBox ..................................... SUCCESS [01:15 min]
[INFO] Apache XmpBox ...................................... SUCCESS [ 31.055 s]
[INFO] Apache PDFBox ...................................... SUCCESS [03:41 min]
[INFO] Apache Preflight ................................... FAILURE [ 10.958 s]
[INFO] Apache Preflight application ....................... SKIPPED
[INFO] Apache PDFBox Debugger ............................. SKIPPED
[INFO] Apache PDFBox tools ................................ SKIPPED
[INFO] Apache PDFBox application .......................... SKIPPED
[INFO] Apache PDFBox Debugger application ................. SKIPPED
[INFO] Apache PDFBox examples ............................. SKIPPED
[INFO] pdfbox-reactor ..................................... SKIPPED
[INFO] ------------------------------------------------------------------------
[INFO] BUILD FAILURE
[INFO] ------------------------------------------------------------------------
[INFO] Total time: 06:33 min
[INFO] Finished at: 2026-07-26T04:19:47Z
[INFO] ------------------------------------------------------------------------
Waiting for Jenkins to finish collecting data
[ERROR] Failed to execute goal com.googlecode.maven-download-plugin:download-maven-plugin:1.5.1:wget (get-isartor) on project preflight: IO Error: Could not get content -> [Help 1]
[ERROR]
[ERROR] To see the full stack trace of the errors, re-run Maven with the -e switch.
[ERROR] Re-run Maven using the -X switch to enable full debug logging.
[ERROR]
[ERROR] For more information about the errors and possible solutions, please read the following articles:
[ERROR] [Help 1] http://cwiki.apache.org/confluence/display/MAVEN/MojoExecutionException
[ERROR]
[ERROR] After correcting the problems, you can resume the build with the command
[ERROR] mvn <goals> -rf :preflight
[JENKINS] Archiving <https://ci-builds.apache.org/job/PDFBox/job/PDFBox-2.0.x/ws/xmpbox/pom.xml> to org.apache.pdfbox/xmpbox/2.0.38-SNAPSHOT/xmpbox-2.0.38-SNAPSHOT.pom
[JENKINS] Archiving <https://ci-builds.apache.org/job/PDFBox/job/PDFBox-2.0.x/ws/xmpbox/target/xmpbox-2.0.38-SNAPSHOT.jar> to org.apache.pdfbox/xmpbox/2.0.38-20260726.041314-26/xmpbox-2.0.38-20260726.041314-26.jar
[JENKINS] Archiving <https://ci-builds.apache.org/job/PDFBox/job/PDFBox-2.0.x/ws/tools/pom.xml> to org.apache.pdfbox/pdfbox-tools/2.0.38-SNAPSHOT/pdfbox-tools-2.0.38-SNAPSHOT.pom
[JENKINS] Archiving <https://ci-builds.apache.org/job/PDFBox/job/PDFBox-2.0.x/ws/debugger/pom.xml> to org.apache.pdfbox/pdfbox-debugger/2.0.38-SNAPSHOT/pdfbox-debugger-2.0.38-SNAPSHOT.pom
[JENKINS] Archiving <https://ci-builds.apache.org/job/PDFBox/job/PDFBox-2.0.x/ws/preflight-app/pom.xml> to org.apache.pdfbox/preflight-app/2.0.38-SNAPSHOT/preflight-app-2.0.38-SNAPSHOT.pom
[JENKINS] Archiving <https://ci-builds.apache.org/job/PDFBox/job/PDFBox-2.0.x/ws/app/pom.xml> to org.apache.pdfbox/pdfbox-app/2.0.38-SNAPSHOT/pdfbox-app-2.0.38-SNAPSHOT.pom
[JENKINS] Archiving <https://ci-builds.apache.org/job/PDFBox/job/PDFBox-2.0.x/ws/examples/pom.xml> to org.apache.pdfbox/pdfbox-examples/2.0.38-SNAPSHOT/pdfbox-examples-2.0.38-SNAPSHOT.pom
[JENKINS] Archiving <https://ci-builds.apache.org/job/PDFBox/job/PDFBox-2.0.x/ws/preflight/pom.xml> to org.apache.pdfbox/preflight/2.0.38-SNAPSHOT/preflight-2.0.38-SNAPSHOT.pom
[JENKINS] Archiving <https://ci-builds.apache.org/job/PDFBox/job/PDFBox-2.0.x/ws/pom.xml> to org.apache.pdfbox/pdfbox-reactor/2.0.38-SNAPSHOT/pdfbox-reactor-2.0.38-SNAPSHOT.pom
[JENKINS] Archiving <https://ci-builds.apache.org/job/PDFBox/job/PDFBox-2.0.x/ws/parent/pom.xml> to org.apache.pdfbox/pdfbox-parent/2.0.38-SNAPSHOT/pdfbox-parent-2.0.38-SNAPSHOT.pom
[JENKINS] Archiving <https://ci-builds.apache.org/job/PDFBox/job/PDFBox-2.0.x/ws/pdfbox/pom.xml> to org.apache.pdfbox/pdfbox/2.0.38-SNAPSHOT/pdfbox-2.0.38-SNAPSHOT.pom
[JENKINS] Archiving <https://ci-builds.apache.org/job/PDFBox/job/PDFBox-2.0.x/ws/pdfbox/target/pdfbox-2.0.38-SNAPSHOT.jar> to org.apache.pdfbox/pdfbox/2.0.38-20260726.041314-26/pdfbox-2.0.38-20260726.041314-26.jar
[JENKINS] Archiving <https://ci-builds.apache.org/job/PDFBox/job/PDFBox-2.0.x/ws/debugger-app/pom.xml> to org.apache.pdfbox/debugger-app/2.0.38-SNAPSHOT/debugger-app-2.0.38-SNAPSHOT.pom
[JENKINS] Archiving <https://ci-builds.apache.org/job/PDFBox/job/PDFBox-2.0.x/ws/fontbox/pom.xml> to org.apache.pdfbox/fontbox/2.0.38-SNAPSHOT/fontbox-2.0.38-SNAPSHOT.pom
[JENKINS] Archiving <https://ci-builds.apache.org/job/PDFBox/job/PDFBox-2.0.x/ws/fontbox/target/fontbox-2.0.38-SNAPSHOT.jar> to org.apache.pdfbox/fontbox/2.0.38-20260726.041314-26/fontbox-2.0.38-20260726.041314-26.jar
No mail will be sent out, as 'PDFBox » PDFBox-2.0.x » Apache PDFBox examples #2047' does not have a result yet. Please make sure you set a proper result in case of pipeline/build scripts.
No mail will be sent out, as 'PDFBox » PDFBox-2.0.x » Apache PDFBox Debugger application #2047' does not have a result yet. Please make sure you set a proper result in case of pipeline/build scripts.
No mail will be sent out, as 'PDFBox » PDFBox-2.0.x » Apache PDFBox tools #2047' does not have a result yet. Please make sure you set a proper result in case of pipeline/build scripts.
No mail will be sent out, as 'PDFBox » PDFBox-2.0.x » Apache PDFBox Debugger #2047' does not have a result yet. Please make sure you set a proper result in case of pipeline/build scripts.
No mail will be sent out, as 'PDFBox » PDFBox-2.0.x » Apache Preflight application #2047' does not have a result yet. Please make sure you set a proper result in case of pipeline/build scripts.
No mail will be sent out, as 'PDFBox » PDFBox-2.0.x » Apache PDFBox application #2047' does not have a result yet. Please make sure you set a proper result in case of pipeline/build scripts.
Sending e-mails to: dev@pdfbox.apache.org
No mail will be sent out, as 'PDFBox » PDFBox-2.0.x » pdfbox-reactor #2047' does not have a result yet. Please make sure you set a proper result in case of pipeline/build scripts.
channel stopped
Archiving artifacts
---------------------------------------------------------------------
To unsubscribe, e-mail: dev-unsubscribe@pdfbox.apache.org
For additional commands, e-mail: dev-help@pdfbox.apache.org
Build failed in Jenkins: PDFBox » PDFBox-2.0.x #2046
Posted by Apache Jenkins Server <je...@builds.apache.org>.
See <https://ci-builds.apache.org/job/PDFBox/job/PDFBox-2.0.x/2046/display/redirect>
Changes:
------------------------------------------
[...truncated 241.21 KiB...]
25.07.2026 18:46:33 WARN font.PDTrueTypeFont:225 - Using fallback font LiberationSerif for TimesNewRomanPSMT
25.07.2026 18:46:33 INFO text.TestTextStripper:246 - Preparing to parse rotation.pdf for sorted test
25.07.2026 18:46:33 WARN font.PDTrueTypeFont:225 - Using fallback font LiberationSerif for TimesNewRomanPSMT
[INFO] Tests run: 5, Failures: 0, Errors: 0, Skipped: 0, Time elapsed: 2.19 s - in org.apache.pdfbox.text.TestTextStripper
[INFO]
[INFO] Results:
[INFO]
[WARNING] Tests run: 709, Failures: 0, Errors: 0, Skipped: 2
[INFO]
[JENKINS] Recording test results
[INFO]
[INFO] --- animal-sniffer:1.17:check (check-java-version) @ pdfbox ---
[INFO] Checking unresolved references to org.codehaus.mojo.signature:java16:1.0
[INFO]
[INFO] --- bundle:3.5.1:bundle (default-bundle) @ pdfbox ---
[INFO]
[INFO] --- site:3.7:attach-descriptor (attach-descriptor) @ pdfbox ---
[INFO] Skipping because packaging 'bundle' is not pom.
[INFO]
[INFO] --- source:3.0.1:jar-no-fork (attach-sources) @ pdfbox ---
[INFO] Skipping source per configuration.
[INFO]
[INFO] --- apache-rat:0.17:check (default) @ pdfbox ---
[WARNING] Basedir is : <https://ci-builds.apache.org/job/PDFBox/job/PDFBox-2.0.x/ws/pdfbox>
[INFO] Excluding patterns: src/main/resources/org/apache/pdfbox/resources/afm/*, src/main/resources/org/apache/pdfbox/resources/icc/*, src/main/resources/org/apache/pdfbox/resources/glyphlist/glyphlist.txt, src/main/resources/org/apache/pdfbox/resources/glyphlist/zapfdingbats.txt, src/main/resources/org/apache/pdfbox/resources/text/BidiMirroring.txt, src/main/resources/META-INF/services/*, src/test/resources/input/rendering/*.ai, src/test/resources/input/*.txt, src/test/resources/input/**/*.pdf, src/test/resources/input/**/*.png, src/test/resources/input/*.pdf, src/test/resources/org/apache/**/*.pdf, src/test/resources/output/*, src/test/resources/org/apache/pdfbox/pdmodel/sRGB.*, src/test/resources/org/apache/pdfbox/pdfparser/*.fdf, release.properties, src/test/resources/org/apache/pdfbox/encryption/*.der, src/test/resources/org/apache/pdfbox/encryption/*.pfx, src/test/resources/org/apache/pdfbox/encryption/*.p12, src/test/resources/org/apache/pdfbox/filter/*.bin, src/test/resources/org/apache/pdfbox/text/*.txt, src/main/java/org/apache/pdfbox/filter/CCITTFaxDecoderStream.java, src/main/java/org/apache/pdfbox/filter/CCITTFaxEncoderStream.java, src/main/java/org/apache/pdfbox/filter/TIFFExtension.java, nb-configuration.xml
[INFO] Excluding MAVEN collection.
[INFO] Excluding ECLIPSE collection.
[INFO] Excluding IDEA collection.
[INFO] Processing exclude file from STANDARD_SCMS.
[INFO] Excluding STANDARD_SCMS collection.
[INFO] Excluding MISC collection.
[INFO] Excluding HIDDEN_DIR collection.
[INFO] RAT summary:
[INFO] Approved: 788
[INFO] Archives: 0
[INFO] Binaries: 37
[INFO] Document types: 4
[INFO] Ignored: 260
[INFO] License categories: 1
[INFO] License names: 1
[INFO] Notices: 2
[INFO] Standards: 788
[INFO] Unapproved: 0
[INFO] Unknown: 0
[INFO]
[INFO] --- dependency-check:10.0.4:check (default) @ pdfbox ---
[INFO] Skipping dependency-check
[INFO]
[INFO] --- install:2.5.2:install (default-install) @ pdfbox ---
[INFO] Installing <https://ci-builds.apache.org/job/PDFBox/job/PDFBox-2.0.x/ws/pdfbox/target/pdfbox-2.0.38-SNAPSHOT.jar> to /home/jenkins/.m2/repository/org/apache/pdfbox/pdfbox/2.0.38-SNAPSHOT/pdfbox-2.0.38-SNAPSHOT.jar
[INFO] Installing <https://ci-builds.apache.org/job/PDFBox/job/PDFBox-2.0.x/ws/pdfbox/pom.xml> to /home/jenkins/.m2/repository/org/apache/pdfbox/pdfbox/2.0.38-SNAPSHOT/pdfbox-2.0.38-SNAPSHOT.pom
[INFO]
[INFO] --- bundle:3.5.1:install (default-install) @ pdfbox ---
[INFO] Installing org/apache/pdfbox/pdfbox/2.0.38-SNAPSHOT/pdfbox-2.0.38-SNAPSHOT.jar
[INFO] Writing OBR metadata
[INFO]
[INFO] --- deploy:2.8.2:deploy (default-deploy) @ pdfbox ---
[INFO] Downloading from apache.snapshots.https: https://repository.apache.org/content/repositories/snapshots/org/apache/pdfbox/pdfbox/2.0.38-SNAPSHOT/maven-metadata.xml
[INFO] Downloaded from apache.snapshots.https: https://repository.apache.org/content/repositories/snapshots/org/apache/pdfbox/pdfbox/2.0.38-SNAPSHOT/maven-metadata.xml (779 B at 1.4 kB/s)
[INFO] Uploading to apache.snapshots.https: https://repository.apache.org/content/repositories/snapshots/org/apache/pdfbox/pdfbox/2.0.38-SNAPSHOT/pdfbox-2.0.38-20260725.184114-25.jar
[INFO] Uploaded to apache.snapshots.https: https://repository.apache.org/content/repositories/snapshots/org/apache/pdfbox/pdfbox/2.0.38-SNAPSHOT/pdfbox-2.0.38-20260725.184114-25.jar (2.8 MB at 1.2 MB/s)
[INFO] Uploading to apache.snapshots.https: https://repository.apache.org/content/repositories/snapshots/org/apache/pdfbox/pdfbox/2.0.38-SNAPSHOT/pdfbox-2.0.38-20260725.184114-25.pom
[INFO] Uploaded to apache.snapshots.https: https://repository.apache.org/content/repositories/snapshots/org/apache/pdfbox/pdfbox/2.0.38-SNAPSHOT/pdfbox-2.0.38-20260725.184114-25.pom (56 kB at 52 kB/s)
[INFO] Downloading from apache.snapshots.https: https://repository.apache.org/content/repositories/snapshots/org/apache/pdfbox/pdfbox/maven-metadata.xml
[INFO] Downloaded from apache.snapshots.https: https://repository.apache.org/content/repositories/snapshots/org/apache/pdfbox/pdfbox/maven-metadata.xml (465 B at 2.6 kB/s)
[INFO] Uploading to apache.snapshots.https: https://repository.apache.org/content/repositories/snapshots/org/apache/pdfbox/pdfbox/2.0.38-SNAPSHOT/maven-metadata.xml
[INFO] Uploaded to apache.snapshots.https: https://repository.apache.org/content/repositories/snapshots/org/apache/pdfbox/pdfbox/2.0.38-SNAPSHOT/maven-metadata.xml (779 B at 728 B/s)
[INFO] Uploading to apache.snapshots.https: https://repository.apache.org/content/repositories/snapshots/org/apache/pdfbox/pdfbox/maven-metadata.xml
[INFO] Uploaded to apache.snapshots.https: https://repository.apache.org/content/repositories/snapshots/org/apache/pdfbox/pdfbox/maven-metadata.xml (465 B at 433 B/s)
[INFO]
[INFO] --- bundle:3.5.1:deploy (default-deploy) @ pdfbox ---
[INFO] Remote OBR update disabled (enable with -DremoteOBR)
[INFO]
[INFO] --------------------< org.apache.pdfbox:preflight >---------------------
[INFO] Building Apache Preflight 2.0.38-SNAPSHOT [5/12]
[INFO] from preflight/pom.xml
[INFO] -------------------------------[ bundle ]-------------------------------
[INFO]
[INFO] --- clean:3.0.0:clean (default-clean) @ preflight ---
[INFO]
[INFO] --- enforcer:1.4.1:enforce (default) @ preflight ---
[INFO]
[INFO] --- enforcer:1.4.1:enforce (enforce-maven-version) @ preflight ---
[INFO]
[INFO] --- checkstyle:3.6.0:check (check) @ preflight ---
[INFO] Starting audit...
Audit done.
[INFO] You have 0 Checkstyle violations.
[INFO]
[INFO] --- remote-resources:1.5:process (process-resource-bundles) @ preflight ---
[INFO]
[INFO] --- resources:3.0.2:resources (default-resources) @ preflight ---
[INFO] Using 'UTF-8' encoding to copy filtered resources.
[INFO] Copying 0 resource
[INFO] Copying 3 resources
[INFO]
[INFO] --- compiler:3.15.0:compile (default-compile) @ preflight ---
[INFO] Recompiling the module because of changed dependency.
[INFO] Compiling 112 source files with javac [forked debug deprecation release 6] to target/classes
[WARNING] [options] source value 6 is obsolete and will be removed in a future release
[WARNING] [options] target value 1.6 is obsolete and will be removed in a future release
[WARNING] [options] To suppress warnings about obsolete options, use -Xlint:-options.
[INFO]
[INFO] --- download:1.5.1:wget (get-isartor) @ preflight ---
[WARNING] Invalid cookie header: "set-cookie: __cf_bm=3HnS0W1BEGc7lXMBiDqp1uuhn_9Q_OyUhpvL06a4YEw-1785005245.8546376-1.0.1.1-myfSNlpxRn1UBjds5u5bE.NpaM4iv7bTHiNqjzWDpLymctpID7VnkTzTNMZ9FomBf887ZEZVUCtfQ9Em1yJJZXNaW1Nv5oyi2PQ_VkyoJUTWdIO7_7CoIflGi67XGYKd; HttpOnly; SameSite=None; Secure; Path=/; Domain=www.pdfa.org; Expires=Sat, 25 Jul 2026 19:17:26 GMT". Invalid 'expires' attribute: Sat, 25 Jul 2026 19:17:26 GMT
[WARNING] Could not get content
org.apache.maven.plugin.MojoFailureException: Not same digest as expected: expected <66bf4ad470b36079c1e0ceca4438053f32649f964fb1de5cd88babce36c5afc0ba6fa7880bc1c9aac791df872cdfc8dc9851bfd3c75ae96786edd8fac61193ae> was <67a1773a9bfe1cee193bc1095d384c8c0c298be5a7cf1ccf3bdc2a51700c81af24b3175d96e7845650f84a6799225ee0d0ecc0624bffdd95cbfd2571fb198dfc>
at com.googlecode.download.maven.plugin.internal.SignatureUtils.verifySignature (SignatureUtils.java:35)
at com.googlecode.download.maven.plugin.internal.WGet.execute (WGet.java:378)
at org.apache.maven.plugin.DefaultBuildPluginManager.executeMojo (DefaultBuildPluginManager.java:126)
at org.apache.maven.lifecycle.internal.MojoExecutor.doExecute2 (MojoExecutor.java:328)
at org.apache.maven.lifecycle.internal.MojoExecutor.doExecute (MojoExecutor.java:316)
at org.apache.maven.lifecycle.internal.MojoExecutor.execute (MojoExecutor.java:212)
at org.apache.maven.lifecycle.internal.MojoExecutor.execute (MojoExecutor.java:174)
at org.apache.maven.lifecycle.internal.MojoExecutor.access$000 (MojoExecutor.java:75)
at org.apache.maven.lifecycle.internal.MojoExecutor$1.run (MojoExecutor.java:162)
at org.apache.maven.plugin.DefaultMojosExecutionStrategy.execute (DefaultMojosExecutionStrategy.java:39)
at org.apache.maven.lifecycle.internal.MojoExecutor.execute (MojoExecutor.java:159)
at org.apache.maven.lifecycle.internal.LifecycleModuleBuilder.buildProject (LifecycleModuleBuilder.java:105)
at org.apache.maven.lifecycle.internal.LifecycleModuleBuilder.buildProject (LifecycleModuleBuilder.java:73)
at org.apache.maven.lifecycle.internal.builder.singlethreaded.SingleThreadedBuilder.build (SingleThreadedBuilder.java:53)
at org.apache.maven.lifecycle.internal.LifecycleStarter.execute (LifecycleStarter.java:118)
at org.apache.maven.DefaultMaven.doExecute (DefaultMaven.java:261)
at org.apache.maven.DefaultMaven.doExecute (DefaultMaven.java:173)
at org.apache.maven.DefaultMaven.execute (DefaultMaven.java:101)
at org.jvnet.hudson.maven3.launcher.Maven35Launcher.main (Maven35Launcher.java:138)
at jdk.internal.reflect.NativeMethodAccessorImpl.invoke0 (Native Method)
at jdk.internal.reflect.NativeMethodAccessorImpl.invoke (NativeMethodAccessorImpl.java:77)
at jdk.internal.reflect.DelegatingMethodAccessorImpl.invoke (DelegatingMethodAccessorImpl.java:43)
at java.lang.reflect.Method.invoke (Method.java:569)
at org.codehaus.plexus.classworlds.launcher.Launcher.launchEnhanced (Launcher.java:255)
at org.codehaus.plexus.classworlds.launcher.Launcher.launch (Launcher.java:201)
at jenkins.maven3.agent.Maven35Main.launch (Maven35Main.java:179)
at jdk.internal.reflect.NativeMethodAccessorImpl.invoke0 (Native Method)
at jdk.internal.reflect.NativeMethodAccessorImpl.invoke (NativeMethodAccessorImpl.java:77)
at jdk.internal.reflect.DelegatingMethodAccessorImpl.invoke (DelegatingMethodAccessorImpl.java:43)
at java.lang.reflect.Method.invoke (Method.java:569)
at hudson.maven.Maven3Builder.call (Maven3Builder.java:140)
at hudson.maven.Maven3Builder.call (Maven3Builder.java:71)
at hudson.remoting.UserRequest.perform (UserRequest.java:225)
at hudson.remoting.UserRequest.perform (UserRequest.java:50)
at hudson.remoting.Request$2.run (Request.java:391)
at hudson.remoting.InterceptingExecutorService.lambda$wrap$0 (InterceptingExecutorService.java:81)
at java.util.concurrent.FutureTask.run (FutureTask.java:264)
at java.util.concurrent.ThreadPoolExecutor.runWorker (ThreadPoolExecutor.java:1136)
at java.util.concurrent.ThreadPoolExecutor$Worker.run (ThreadPoolExecutor.java:635)
at java.lang.Thread.run (Thread.java:840)
[WARNING] Retrying (1 more)
[WARNING] Invalid cookie header: "set-cookie: __cf_bm=OUelqgNsNiBaUzrQm4AOUABW2T8HqKmQJiZRMG.UmQ4-1785005246.1280947-1.0.1.1-0pM3abGOh.frbCMQfmsE06e3PR3MBYgajt7QPNl51pT0DSWtS_JSa2kt7IRtKtFvbb0XhC9MoBwoSwAUIxPstLMtPkOHOGxGA_92TARyt8NRorIqWYhYP5fb9QyvF5mP; HttpOnly; SameSite=None; Secure; Path=/; Domain=www.pdfa.org; Expires=Sat, 25 Jul 2026 19:17:26 GMT". Invalid 'expires' attribute: Sat, 25 Jul 2026 19:17:26 GMT
[WARNING] Could not get content
org.apache.maven.plugin.MojoFailureException: Not same digest as expected: expected <66bf4ad470b36079c1e0ceca4438053f32649f964fb1de5cd88babce36c5afc0ba6fa7880bc1c9aac791df872cdfc8dc9851bfd3c75ae96786edd8fac61193ae> was <67a1773a9bfe1cee193bc1095d384c8c0c298be5a7cf1ccf3bdc2a51700c81af24b3175d96e7845650f84a6799225ee0d0ecc0624bffdd95cbfd2571fb198dfc>
at com.googlecode.download.maven.plugin.internal.SignatureUtils.verifySignature (SignatureUtils.java:35)
at com.googlecode.download.maven.plugin.internal.WGet.execute (WGet.java:378)
at org.apache.maven.plugin.DefaultBuildPluginManager.executeMojo (DefaultBuildPluginManager.java:126)
at org.apache.maven.lifecycle.internal.MojoExecutor.doExecute2 (MojoExecutor.java:328)
at org.apache.maven.lifecycle.internal.MojoExecutor.doExecute (MojoExecutor.java:316)
at org.apache.maven.lifecycle.internal.MojoExecutor.execute (MojoExecutor.java:212)
at org.apache.maven.lifecycle.internal.MojoExecutor.execute (MojoExecutor.java:174)
at org.apache.maven.lifecycle.internal.MojoExecutor.access$000 (MojoExecutor.java:75)
at org.apache.maven.lifecycle.internal.MojoExecutor$1.run (MojoExecutor.java:162)
at org.apache.maven.plugin.DefaultMojosExecutionStrategy.execute (DefaultMojosExecutionStrategy.java:39)
at org.apache.maven.lifecycle.internal.MojoExecutor.execute (MojoExecutor.java:159)
at org.apache.maven.lifecycle.internal.LifecycleModuleBuilder.buildProject (LifecycleModuleBuilder.java:105)
at org.apache.maven.lifecycle.internal.LifecycleModuleBuilder.buildProject (LifecycleModuleBuilder.java:73)
at org.apache.maven.lifecycle.internal.builder.singlethreaded.SingleThreadedBuilder.build (SingleThreadedBuilder.java:53)
at org.apache.maven.lifecycle.internal.LifecycleStarter.execute (LifecycleStarter.java:118)
at org.apache.maven.DefaultMaven.doExecute (DefaultMaven.java:261)
at org.apache.maven.DefaultMaven.doExecute (DefaultMaven.java:173)
at org.apache.maven.DefaultMaven.execute (DefaultMaven.java:101)
at org.jvnet.hudson.maven3.launcher.Maven35Launcher.main (Maven35Launcher.java:138)
at jdk.internal.reflect.NativeMethodAccessorImpl.invoke0 (Native Method)
at jdk.internal.reflect.NativeMethodAccessorImpl.invoke (NativeMethodAccessorImpl.java:77)
at jdk.internal.reflect.DelegatingMethodAccessorImpl.invoke (DelegatingMethodAccessorImpl.java:43)
at java.lang.reflect.Method.invoke (Method.java:569)
at org.codehaus.plexus.classworlds.launcher.Launcher.launchEnhanced (Launcher.java:255)
at org.codehaus.plexus.classworlds.launcher.Launcher.launch (Launcher.java:201)
at jenkins.maven3.agent.Maven35Main.launch (Maven35Main.java:179)
at jdk.internal.reflect.NativeMethodAccessorImpl.invoke0 (Native Method)
at jdk.internal.reflect.NativeMethodAccessorImpl.invoke (NativeMethodAccessorImpl.java:77)
at jdk.internal.reflect.DelegatingMethodAccessorImpl.invoke (DelegatingMethodAccessorImpl.java:43)
at java.lang.reflect.Method.invoke (Method.java:569)
at hudson.maven.Maven3Builder.call (Maven3Builder.java:140)
at hudson.maven.Maven3Builder.call (Maven3Builder.java:71)
at hudson.remoting.UserRequest.perform (UserRequest.java:225)
at hudson.remoting.UserRequest.perform (UserRequest.java:50)
at hudson.remoting.Request$2.run (Request.java:391)
at hudson.remoting.InterceptingExecutorService.lambda$wrap$0 (InterceptingExecutorService.java:81)
at java.util.concurrent.FutureTask.run (FutureTask.java:264)
at java.util.concurrent.ThreadPoolExecutor.runWorker (ThreadPoolExecutor.java:1136)
at java.util.concurrent.ThreadPoolExecutor$Worker.run (ThreadPoolExecutor.java:635)
at java.lang.Thread.run (Thread.java:840)
[INFO] ------------------------------------------------------------------------
[INFO] Reactor Summary for pdfbox-reactor 2.0.38-SNAPSHOT:
[INFO]
[INFO] Apache PDFBox parent ............................... SUCCESS [ 23.609 s]
[INFO] Apache FontBox ..................................... SUCCESS [01:12 min]
[INFO] Apache XmpBox ...................................... SUCCESS [ 31.712 s]
[INFO] Apache PDFBox ...................................... SUCCESS [03:37 min]
[INFO] Apache Preflight ................................... FAILURE [ 10.347 s]
[INFO] Apache Preflight application ....................... SKIPPED
[INFO] Apache PDFBox Debugger ............................. SKIPPED
[INFO] Apache PDFBox tools ................................ SKIPPED
[INFO] Apache PDFBox application .......................... SKIPPED
[INFO] Apache PDFBox Debugger application ................. SKIPPED
[INFO] Apache PDFBox examples ............................. SKIPPED
[INFO] pdfbox-reactor ..................................... SKIPPED
[INFO] ------------------------------------------------------------------------
[INFO] BUILD FAILURE
[INFO] ------------------------------------------------------------------------
[INFO] Total time: 06:27 min
[INFO] Finished at: 2026-07-25T18:47:42Z
[INFO] ------------------------------------------------------------------------
Waiting for Jenkins to finish collecting data
[ERROR] Failed to execute goal com.googlecode.maven-download-plugin:download-maven-plugin:1.5.1:wget (get-isartor) on project preflight: IO Error: Could not get content -> [Help 1]
[ERROR]
[ERROR] To see the full stack trace of the errors, re-run Maven with the -e switch.
[ERROR] Re-run Maven using the -X switch to enable full debug logging.
[ERROR]
[ERROR] For more information about the errors and possible solutions, please read the following articles:
[ERROR] [Help 1] http://cwiki.apache.org/confluence/display/MAVEN/MojoExecutionException
[ERROR]
[ERROR] After correcting the problems, you can resume the build with the command
[ERROR] mvn <goals> -rf :preflight
[JENKINS] Archiving <https://ci-builds.apache.org/job/PDFBox/job/PDFBox-2.0.x/ws/xmpbox/pom.xml> to org.apache.pdfbox/xmpbox/2.0.38-SNAPSHOT/xmpbox-2.0.38-SNAPSHOT.pom
[JENKINS] Archiving <https://ci-builds.apache.org/job/PDFBox/job/PDFBox-2.0.x/ws/xmpbox/target/xmpbox-2.0.38-SNAPSHOT.jar> to org.apache.pdfbox/xmpbox/2.0.38-20260725.184114-25/xmpbox-2.0.38-20260725.184114-25.jar
[JENKINS] Archiving <https://ci-builds.apache.org/job/PDFBox/job/PDFBox-2.0.x/ws/tools/pom.xml> to org.apache.pdfbox/pdfbox-tools/2.0.38-SNAPSHOT/pdfbox-tools-2.0.38-SNAPSHOT.pom
[JENKINS] Archiving <https://ci-builds.apache.org/job/PDFBox/job/PDFBox-2.0.x/ws/debugger/pom.xml> to org.apache.pdfbox/pdfbox-debugger/2.0.38-SNAPSHOT/pdfbox-debugger-2.0.38-SNAPSHOT.pom
[JENKINS] Archiving <https://ci-builds.apache.org/job/PDFBox/job/PDFBox-2.0.x/ws/preflight-app/pom.xml> to org.apache.pdfbox/preflight-app/2.0.38-SNAPSHOT/preflight-app-2.0.38-SNAPSHOT.pom
[JENKINS] Archiving <https://ci-builds.apache.org/job/PDFBox/job/PDFBox-2.0.x/ws/app/pom.xml> to org.apache.pdfbox/pdfbox-app/2.0.38-SNAPSHOT/pdfbox-app-2.0.38-SNAPSHOT.pom
[JENKINS] Archiving <https://ci-builds.apache.org/job/PDFBox/job/PDFBox-2.0.x/ws/examples/pom.xml> to org.apache.pdfbox/pdfbox-examples/2.0.38-SNAPSHOT/pdfbox-examples-2.0.38-SNAPSHOT.pom
[JENKINS] Archiving <https://ci-builds.apache.org/job/PDFBox/job/PDFBox-2.0.x/ws/preflight/pom.xml> to org.apache.pdfbox/preflight/2.0.38-SNAPSHOT/preflight-2.0.38-SNAPSHOT.pom
[JENKINS] Archiving <https://ci-builds.apache.org/job/PDFBox/job/PDFBox-2.0.x/ws/pom.xml> to org.apache.pdfbox/pdfbox-reactor/2.0.38-SNAPSHOT/pdfbox-reactor-2.0.38-SNAPSHOT.pom
[JENKINS] Archiving <https://ci-builds.apache.org/job/PDFBox/job/PDFBox-2.0.x/ws/parent/pom.xml> to org.apache.pdfbox/pdfbox-parent/2.0.38-SNAPSHOT/pdfbox-parent-2.0.38-SNAPSHOT.pom
[JENKINS] Archiving <https://ci-builds.apache.org/job/PDFBox/job/PDFBox-2.0.x/ws/pdfbox/pom.xml> to org.apache.pdfbox/pdfbox/2.0.38-SNAPSHOT/pdfbox-2.0.38-SNAPSHOT.pom
[JENKINS] Archiving <https://ci-builds.apache.org/job/PDFBox/job/PDFBox-2.0.x/ws/pdfbox/target/pdfbox-2.0.38-SNAPSHOT.jar> to org.apache.pdfbox/pdfbox/2.0.38-20260725.184114-25/pdfbox-2.0.38-20260725.184114-25.jar
[JENKINS] Archiving <https://ci-builds.apache.org/job/PDFBox/job/PDFBox-2.0.x/ws/debugger-app/pom.xml> to org.apache.pdfbox/debugger-app/2.0.38-SNAPSHOT/debugger-app-2.0.38-SNAPSHOT.pom
[JENKINS] Archiving <https://ci-builds.apache.org/job/PDFBox/job/PDFBox-2.0.x/ws/fontbox/pom.xml> to org.apache.pdfbox/fontbox/2.0.38-SNAPSHOT/fontbox-2.0.38-SNAPSHOT.pom
[JENKINS] Archiving <https://ci-builds.apache.org/job/PDFBox/job/PDFBox-2.0.x/ws/fontbox/target/fontbox-2.0.38-SNAPSHOT.jar> to org.apache.pdfbox/fontbox/2.0.38-20260725.184114-25/fontbox-2.0.38-20260725.184114-25.jar
No mail will be sent out, as 'PDFBox » PDFBox-2.0.x » Apache PDFBox examples #2046' does not have a result yet. Please make sure you set a proper result in case of pipeline/build scripts.
Sending e-mails to: dev@pdfbox.apache.org
No mail will be sent out, as 'PDFBox » PDFBox-2.0.x » Apache PDFBox Debugger application #2046' does not have a result yet. Please make sure you set a proper result in case of pipeline/build scripts.
No mail will be sent out, as 'PDFBox » PDFBox-2.0.x » Apache PDFBox tools #2046' does not have a result yet. Please make sure you set a proper result in case of pipeline/build scripts.
No mail will be sent out, as 'PDFBox » PDFBox-2.0.x » Apache PDFBox Debugger #2046' does not have a result yet. Please make sure you set a proper result in case of pipeline/build scripts.
No mail will be sent out, as 'PDFBox » PDFBox-2.0.x » Apache Preflight application #2046' does not have a result yet. Please make sure you set a proper result in case of pipeline/build scripts.
No mail will be sent out, as 'PDFBox » PDFBox-2.0.x » Apache PDFBox application #2046' does not have a result yet. Please make sure you set a proper result in case of pipeline/build scripts.
Sending e-mails to: dev@pdfbox.apache.org
No mail will be sent out, as 'PDFBox » PDFBox-2.0.x » pdfbox-reactor #2046' does not have a result yet. Please make sure you set a proper result in case of pipeline/build scripts.
channel stopped
Archiving artifacts
---------------------------------------------------------------------
To unsubscribe, e-mail: dev-unsubscribe@pdfbox.apache.org
For additional commands, e-mail: dev-help@pdfbox.apache.org
Build failed in Jenkins: PDFBox » PDFBox-2.0.x #2045
Posted by Apache Jenkins Server <je...@builds.apache.org>.
See <https://ci-builds.apache.org/job/PDFBox/job/PDFBox-2.0.x/2045/display/redirect?page=changes>
Changes:
[Tilman Hausherr] PDFBOX-6225: add log4j for build tests
[Tilman Hausherr] PDFBOX-6225: add log4j for build tests
[Tilman Hausherr] PDFBOX-6225: add log4j for build tests
------------------------------------------
[...truncated 246.27 KiB...]
[ERROR] PDAcroFormFromAnnotsTest.testFromAnnots3891NullField:355 » Connect Connection ...
[ERROR] PDAcroFormFromAnnotsTest.testFromAnnots4985DefaultMode:78 » IO Server returned...
[INFO]
[ERROR] Tests run: 709, Failures: 0, Errors: 4, Skipped: 2
[INFO]
[ERROR] There are test failures.
Please refer to <https://ci-builds.apache.org/job/PDFBox/job/PDFBox-2.0.x/ws/pdfbox/target/surefire-reports> for the individual test results.
Please refer to dump files (if any exist) [date].dump, [date]-jvmRun[N].dump and [date].dumpstream.
[JENKINS] Recording test results
[INFO]
[INFO] --- animal-sniffer:1.17:check (check-java-version) @ pdfbox ---
[INFO] Checking unresolved references to org.codehaus.mojo.signature:java16:1.0
[INFO]
[INFO] --- bundle:3.5.1:bundle (default-bundle) @ pdfbox ---
[INFO]
[INFO] --- site:3.7:attach-descriptor (attach-descriptor) @ pdfbox ---
[INFO] Skipping because packaging 'bundle' is not pom.
[INFO]
[INFO] --- source:3.0.1:jar-no-fork (attach-sources) @ pdfbox ---
[INFO] Skipping source per configuration.
[INFO]
[INFO] --- apache-rat:0.17:check (default) @ pdfbox ---
[WARNING] Basedir is : <https://ci-builds.apache.org/job/PDFBox/job/PDFBox-2.0.x/ws/pdfbox>
[INFO] Excluding patterns: src/main/resources/org/apache/pdfbox/resources/afm/*, src/main/resources/org/apache/pdfbox/resources/icc/*, src/main/resources/org/apache/pdfbox/resources/glyphlist/glyphlist.txt, src/main/resources/org/apache/pdfbox/resources/glyphlist/zapfdingbats.txt, src/main/resources/org/apache/pdfbox/resources/text/BidiMirroring.txt, src/main/resources/META-INF/services/*, src/test/resources/input/rendering/*.ai, src/test/resources/input/*.txt, src/test/resources/input/**/*.pdf, src/test/resources/input/**/*.png, src/test/resources/input/*.pdf, src/test/resources/org/apache/**/*.pdf, src/test/resources/output/*, src/test/resources/org/apache/pdfbox/pdmodel/sRGB.*, src/test/resources/org/apache/pdfbox/pdfparser/*.fdf, release.properties, src/test/resources/org/apache/pdfbox/encryption/*.der, src/test/resources/org/apache/pdfbox/encryption/*.pfx, src/test/resources/org/apache/pdfbox/encryption/*.p12, src/test/resources/org/apache/pdfbox/filter/*.bin, src/test/resources/org/apache/pdfbox/text/*.txt, src/main/java/org/apache/pdfbox/filter/CCITTFaxDecoderStream.java, src/main/java/org/apache/pdfbox/filter/CCITTFaxEncoderStream.java, src/main/java/org/apache/pdfbox/filter/TIFFExtension.java, nb-configuration.xml
[INFO] Excluding MAVEN collection.
[INFO] Excluding ECLIPSE collection.
[INFO] Excluding IDEA collection.
[INFO] Processing exclude file from STANDARD_SCMS.
[INFO] Excluding STANDARD_SCMS collection.
[INFO] Excluding MISC collection.
[INFO] Excluding HIDDEN_DIR collection.
[INFO] RAT summary:
[INFO] Approved: 788
[INFO] Archives: 0
[INFO] Binaries: 37
[INFO] Document types: 4
[INFO] Ignored: 260
[INFO] License categories: 1
[INFO] License names: 1
[INFO] Notices: 2
[INFO] Standards: 788
[INFO] Unapproved: 0
[INFO] Unknown: 0
[INFO]
[INFO] --- dependency-check:10.0.4:check (default) @ pdfbox ---
[INFO] Skipping dependency-check
[INFO]
[INFO] --- install:2.5.2:install (default-install) @ pdfbox ---
[INFO] Installing <https://ci-builds.apache.org/job/PDFBox/job/PDFBox-2.0.x/ws/pdfbox/target/pdfbox-2.0.38-SNAPSHOT.jar> to /home/jenkins/.m2/repository/org/apache/pdfbox/pdfbox/2.0.38-SNAPSHOT/pdfbox-2.0.38-SNAPSHOT.jar
[INFO] Installing <https://ci-builds.apache.org/job/PDFBox/job/PDFBox-2.0.x/ws/pdfbox/pom.xml> to /home/jenkins/.m2/repository/org/apache/pdfbox/pdfbox/2.0.38-SNAPSHOT/pdfbox-2.0.38-SNAPSHOT.pom
[INFO]
[INFO] --- bundle:3.5.1:install (default-install) @ pdfbox ---
[INFO] Installing org/apache/pdfbox/pdfbox/2.0.38-SNAPSHOT/pdfbox-2.0.38-SNAPSHOT.jar
[INFO] Writing OBR metadata
[INFO]
[INFO] --- deploy:2.8.2:deploy (default-deploy) @ pdfbox ---
[INFO] Downloading from apache.snapshots.https: https://repository.apache.org/content/repositories/snapshots/org/apache/pdfbox/pdfbox/2.0.38-SNAPSHOT/maven-metadata.xml
[INFO] Downloaded from apache.snapshots.https: https://repository.apache.org/content/repositories/snapshots/org/apache/pdfbox/pdfbox/2.0.38-SNAPSHOT/maven-metadata.xml (779 B at 1.4 kB/s)
[INFO] Uploading to apache.snapshots.https: https://repository.apache.org/content/repositories/snapshots/org/apache/pdfbox/pdfbox/2.0.38-SNAPSHOT/pdfbox-2.0.38-20260725.165149-24.jar
[INFO] Uploaded to apache.snapshots.https: https://repository.apache.org/content/repositories/snapshots/org/apache/pdfbox/pdfbox/2.0.38-SNAPSHOT/pdfbox-2.0.38-20260725.165149-24.jar (2.8 MB at 1.2 MB/s)
[INFO] Uploading to apache.snapshots.https: https://repository.apache.org/content/repositories/snapshots/org/apache/pdfbox/pdfbox/2.0.38-SNAPSHOT/pdfbox-2.0.38-20260725.165149-24.pom
[INFO] Uploaded to apache.snapshots.https: https://repository.apache.org/content/repositories/snapshots/org/apache/pdfbox/pdfbox/2.0.38-SNAPSHOT/pdfbox-2.0.38-20260725.165149-24.pom (56 kB at 53 kB/s)
[INFO] Downloading from apache.snapshots.https: https://repository.apache.org/content/repositories/snapshots/org/apache/pdfbox/pdfbox/maven-metadata.xml
[INFO] Downloaded from apache.snapshots.https: https://repository.apache.org/content/repositories/snapshots/org/apache/pdfbox/pdfbox/maven-metadata.xml (465 B at 2.6 kB/s)
[INFO] Uploading to apache.snapshots.https: https://repository.apache.org/content/repositories/snapshots/org/apache/pdfbox/pdfbox/2.0.38-SNAPSHOT/maven-metadata.xml
[INFO] Uploaded to apache.snapshots.https: https://repository.apache.org/content/repositories/snapshots/org/apache/pdfbox/pdfbox/2.0.38-SNAPSHOT/maven-metadata.xml (779 B at 741 B/s)
[INFO] Uploading to apache.snapshots.https: https://repository.apache.org/content/repositories/snapshots/org/apache/pdfbox/pdfbox/maven-metadata.xml
[INFO] Uploaded to apache.snapshots.https: https://repository.apache.org/content/repositories/snapshots/org/apache/pdfbox/pdfbox/maven-metadata.xml (465 B at 444 B/s)
[INFO]
[INFO] --- bundle:3.5.1:deploy (default-deploy) @ pdfbox ---
[INFO] Remote OBR update disabled (enable with -DremoteOBR)
[INFO]
[INFO] --------------------< org.apache.pdfbox:preflight >---------------------
[INFO] Building Apache Preflight 2.0.38-SNAPSHOT [5/12]
[INFO] from preflight/pom.xml
[INFO] -------------------------------[ bundle ]-------------------------------
[INFO]
[INFO] --- clean:3.0.0:clean (default-clean) @ preflight ---
[INFO]
[INFO] --- enforcer:1.4.1:enforce (default) @ preflight ---
[INFO]
[INFO] --- enforcer:1.4.1:enforce (enforce-maven-version) @ preflight ---
[INFO]
[INFO] --- checkstyle:3.6.0:check (check) @ preflight ---
[INFO] Starting audit...
Audit done.
[INFO] You have 0 Checkstyle violations.
[INFO]
[INFO] --- remote-resources:1.5:process (process-resource-bundles) @ preflight ---
[INFO]
[INFO] --- resources:3.0.2:resources (default-resources) @ preflight ---
[INFO] Using 'UTF-8' encoding to copy filtered resources.
[INFO] Copying 0 resource
[INFO] Copying 3 resources
[INFO]
[INFO] --- compiler:3.15.0:compile (default-compile) @ preflight ---
[INFO] Recompiling the module because of changed dependency.
[INFO] Compiling 112 source files with javac [forked debug deprecation release 6] to target/classes
[WARNING] [options] source value 6 is obsolete and will be removed in a future release
[WARNING] [options] target value 1.6 is obsolete and will be removed in a future release
[WARNING] [options] To suppress warnings about obsolete options, use -Xlint:-options.
[INFO]
[INFO] --- download:1.5.1:wget (get-isartor) @ preflight ---
[WARNING] Invalid cookie header: "set-cookie: __cf_bm=UPw6ZcwD8yFZRIeM2fVhvK34tP3sdjiXIRL1ByPR_8g-1785001146.27866-1.0.1.1-f7cP2AW2TrZHUrcoblumNhMC8zwVTjYcLSpJ.5TcADqbZm8_3DQoJAo.T7oyhSmPe1Janho1tK8eR8Ow6UBMi5JMy.gZacUEjyhQUbKn1hFWmu5jHXrUcWUiLtexcw1G; HttpOnly; SameSite=None; Secure; Path=/; Domain=www.pdfa.org; Expires=Sat, 25 Jul 2026 18:09:06 GMT". Invalid 'expires' attribute: Sat, 25 Jul 2026 18:09:06 GMT
[WARNING] Could not get content
org.apache.maven.plugin.MojoFailureException: Not same digest as expected: expected <66bf4ad470b36079c1e0ceca4438053f32649f964fb1de5cd88babce36c5afc0ba6fa7880bc1c9aac791df872cdfc8dc9851bfd3c75ae96786edd8fac61193ae> was <67a1773a9bfe1cee193bc1095d384c8c0c298be5a7cf1ccf3bdc2a51700c81af24b3175d96e7845650f84a6799225ee0d0ecc0624bffdd95cbfd2571fb198dfc>
at com.googlecode.download.maven.plugin.internal.SignatureUtils.verifySignature (SignatureUtils.java:35)
at com.googlecode.download.maven.plugin.internal.WGet.execute (WGet.java:378)
at org.apache.maven.plugin.DefaultBuildPluginManager.executeMojo (DefaultBuildPluginManager.java:126)
at org.apache.maven.lifecycle.internal.MojoExecutor.doExecute2 (MojoExecutor.java:328)
at org.apache.maven.lifecycle.internal.MojoExecutor.doExecute (MojoExecutor.java:316)
at org.apache.maven.lifecycle.internal.MojoExecutor.execute (MojoExecutor.java:212)
at org.apache.maven.lifecycle.internal.MojoExecutor.execute (MojoExecutor.java:174)
at org.apache.maven.lifecycle.internal.MojoExecutor.access$000 (MojoExecutor.java:75)
at org.apache.maven.lifecycle.internal.MojoExecutor$1.run (MojoExecutor.java:162)
at org.apache.maven.plugin.DefaultMojosExecutionStrategy.execute (DefaultMojosExecutionStrategy.java:39)
at org.apache.maven.lifecycle.internal.MojoExecutor.execute (MojoExecutor.java:159)
at org.apache.maven.lifecycle.internal.LifecycleModuleBuilder.buildProject (LifecycleModuleBuilder.java:105)
at org.apache.maven.lifecycle.internal.LifecycleModuleBuilder.buildProject (LifecycleModuleBuilder.java:73)
at org.apache.maven.lifecycle.internal.builder.singlethreaded.SingleThreadedBuilder.build (SingleThreadedBuilder.java:53)
at org.apache.maven.lifecycle.internal.LifecycleStarter.execute (LifecycleStarter.java:118)
at org.apache.maven.DefaultMaven.doExecute (DefaultMaven.java:261)
at org.apache.maven.DefaultMaven.doExecute (DefaultMaven.java:173)
at org.apache.maven.DefaultMaven.execute (DefaultMaven.java:101)
at org.jvnet.hudson.maven3.launcher.Maven35Launcher.main (Maven35Launcher.java:138)
at jdk.internal.reflect.NativeMethodAccessorImpl.invoke0 (Native Method)
at jdk.internal.reflect.NativeMethodAccessorImpl.invoke (NativeMethodAccessorImpl.java:77)
at jdk.internal.reflect.DelegatingMethodAccessorImpl.invoke (DelegatingMethodAccessorImpl.java:43)
at java.lang.reflect.Method.invoke (Method.java:569)
at org.codehaus.plexus.classworlds.launcher.Launcher.launchEnhanced (Launcher.java:255)
at org.codehaus.plexus.classworlds.launcher.Launcher.launch (Launcher.java:201)
at jenkins.maven3.agent.Maven35Main.launch (Maven35Main.java:179)
at jdk.internal.reflect.NativeMethodAccessorImpl.invoke0 (Native Method)
at jdk.internal.reflect.NativeMethodAccessorImpl.invoke (NativeMethodAccessorImpl.java:77)
at jdk.internal.reflect.DelegatingMethodAccessorImpl.invoke (DelegatingMethodAccessorImpl.java:43)
at java.lang.reflect.Method.invoke (Method.java:569)
at hudson.maven.Maven3Builder.call (Maven3Builder.java:140)
at hudson.maven.Maven3Builder.call (Maven3Builder.java:71)
at hudson.remoting.UserRequest.perform (UserRequest.java:225)
at hudson.remoting.UserRequest.perform (UserRequest.java:50)
at hudson.remoting.Request$2.run (Request.java:391)
at hudson.remoting.InterceptingExecutorService.lambda$wrap$0 (InterceptingExecutorService.java:81)
at java.util.concurrent.FutureTask.run (FutureTask.java:264)
at java.util.concurrent.ThreadPoolExecutor.runWorker (ThreadPoolExecutor.java:1136)
at java.util.concurrent.ThreadPoolExecutor$Worker.run (ThreadPoolExecutor.java:635)
at java.lang.Thread.run (Thread.java:840)
[WARNING] Retrying (1 more)
[WARNING] Invalid cookie header: "set-cookie: __cf_bm=KusF_8TeEhFtCki0xyN0IE4bZ3WJw0.eT8vqmPmZ4AA-1785001146.3898637-1.0.1.1-jM3CGEVtRNN2X277U_jkX5_n8Twe3h7V_K4afKECEMooSiICEo1RX_by3S2mo61f2BIq.57n9eT4Amb968Rm8DjIcszdf_QsEpIxw_B57teqWN7kBn_JRi65yYY6OlMH; HttpOnly; SameSite=None; Secure; Path=/; Domain=www.pdfa.org; Expires=Sat, 25 Jul 2026 18:09:06 GMT". Invalid 'expires' attribute: Sat, 25 Jul 2026 18:09:06 GMT
[WARNING] Could not get content
org.apache.maven.plugin.MojoFailureException: Not same digest as expected: expected <66bf4ad470b36079c1e0ceca4438053f32649f964fb1de5cd88babce36c5afc0ba6fa7880bc1c9aac791df872cdfc8dc9851bfd3c75ae96786edd8fac61193ae> was <67a1773a9bfe1cee193bc1095d384c8c0c298be5a7cf1ccf3bdc2a51700c81af24b3175d96e7845650f84a6799225ee0d0ecc0624bffdd95cbfd2571fb198dfc>
at com.googlecode.download.maven.plugin.internal.SignatureUtils.verifySignature (SignatureUtils.java:35)
at com.googlecode.download.maven.plugin.internal.WGet.execute (WGet.java:378)
at org.apache.maven.plugin.DefaultBuildPluginManager.executeMojo (DefaultBuildPluginManager.java:126)
at org.apache.maven.lifecycle.internal.MojoExecutor.doExecute2 (MojoExecutor.java:328)
at org.apache.maven.lifecycle.internal.MojoExecutor.doExecute (MojoExecutor.java:316)
at org.apache.maven.lifecycle.internal.MojoExecutor.execute (MojoExecutor.java:212)
at org.apache.maven.lifecycle.internal.MojoExecutor.execute (MojoExecutor.java:174)
at org.apache.maven.lifecycle.internal.MojoExecutor.access$000 (MojoExecutor.java:75)
at org.apache.maven.lifecycle.internal.MojoExecutor$1.run (MojoExecutor.java:162)
at org.apache.maven.plugin.DefaultMojosExecutionStrategy.execute (DefaultMojosExecutionStrategy.java:39)
at org.apache.maven.lifecycle.internal.MojoExecutor.execute (MojoExecutor.java:159)
at org.apache.maven.lifecycle.internal.LifecycleModuleBuilder.buildProject (LifecycleModuleBuilder.java:105)
at org.apache.maven.lifecycle.internal.LifecycleModuleBuilder.buildProject (LifecycleModuleBuilder.java:73)
at org.apache.maven.lifecycle.internal.builder.singlethreaded.SingleThreadedBuilder.build (SingleThreadedBuilder.java:53)
at org.apache.maven.lifecycle.internal.LifecycleStarter.execute (LifecycleStarter.java:118)
at org.apache.maven.DefaultMaven.doExecute (DefaultMaven.java:261)
at org.apache.maven.DefaultMaven.doExecute (DefaultMaven.java:173)
at org.apache.maven.DefaultMaven.execute (DefaultMaven.java:101)
at org.jvnet.hudson.maven3.launcher.Maven35Launcher.main (Maven35Launcher.java:138)
at jdk.internal.reflect.NativeMethodAccessorImpl.invoke0 (Native Method)
at jdk.internal.reflect.NativeMethodAccessorImpl.invoke (NativeMethodAccessorImpl.java:77)
at jdk.internal.reflect.DelegatingMethodAccessorImpl.invoke (DelegatingMethodAccessorImpl.java:43)
at java.lang.reflect.Method.invoke (Method.java:569)
at org.codehaus.plexus.classworlds.launcher.Launcher.launchEnhanced (Launcher.java:255)
at org.codehaus.plexus.classworlds.launcher.Launcher.launch (Launcher.java:201)
at jenkins.maven3.agent.Maven35Main.launch (Maven35Main.java:179)
at jdk.internal.reflect.NativeMethodAccessorImpl.invoke0 (Native Method)
at jdk.internal.reflect.NativeMethodAccessorImpl.invoke (NativeMethodAccessorImpl.java:77)
at jdk.internal.reflect.DelegatingMethodAccessorImpl.invoke (DelegatingMethodAccessorImpl.java:43)
at java.lang.reflect.Method.invoke (Method.java:569)
at hudson.maven.Maven3Builder.call (Maven3Builder.java:140)
at hudson.maven.Maven3Builder.call (Maven3Builder.java:71)
at hudson.remoting.UserRequest.perform (UserRequest.java:225)
at hudson.remoting.UserRequest.perform (UserRequest.java:50)
at hudson.remoting.Request$2.run (Request.java:391)
at hudson.remoting.InterceptingExecutorService.lambda$wrap$0 (InterceptingExecutorService.java:81)
at java.util.concurrent.FutureTask.run (FutureTask.java:264)
at java.util.concurrent.ThreadPoolExecutor.runWorker (ThreadPoolExecutor.java:1136)
at java.util.concurrent.ThreadPoolExecutor$Worker.run (ThreadPoolExecutor.java:635)
at java.lang.Thread.run (Thread.java:840)
[INFO] ------------------------------------------------------------------------
[INFO] Reactor Summary for pdfbox-reactor 2.0.38-SNAPSHOT:
[INFO]
[INFO] Apache PDFBox parent ............................... SUCCESS [ 22.852 s]
[INFO] Apache FontBox ..................................... SUCCESS [01:15 min]
[INFO] Apache XmpBox ...................................... SUCCESS [ 31.843 s]
[INFO] Apache PDFBox ...................................... SUCCESS [44:40 min]
[INFO] Apache Preflight ................................... FAILURE [ 11.005 s]
[INFO] Apache Preflight application ....................... SKIPPED
[INFO] Apache PDFBox Debugger ............................. SKIPPED
[INFO] Apache PDFBox tools ................................ SKIPPED
[INFO] Apache PDFBox application .......................... SKIPPED
[INFO] Apache PDFBox Debugger application ................. SKIPPED
[INFO] Apache PDFBox examples ............................. SKIPPED
[INFO] pdfbox-reactor ..................................... SKIPPED
[INFO] ------------------------------------------------------------------------
[INFO] BUILD FAILURE
[INFO] ------------------------------------------------------------------------
[INFO] Total time: 47:31 min
[INFO] Finished at: 2026-07-25T17:39:21Z
[INFO] ------------------------------------------------------------------------
Waiting for Jenkins to finish collecting data
[ERROR] Failed to execute goal com.googlecode.maven-download-plugin:download-maven-plugin:1.5.1:wget (get-isartor) on project preflight: IO Error: Could not get content -> [Help 1]
[ERROR]
[ERROR] To see the full stack trace of the errors, re-run Maven with the -e switch.
[ERROR] Re-run Maven using the -X switch to enable full debug logging.
[ERROR]
[ERROR] For more information about the errors and possible solutions, please read the following articles:
[ERROR] [Help 1] http://cwiki.apache.org/confluence/display/MAVEN/MojoExecutionException
[ERROR]
[ERROR] After correcting the problems, you can resume the build with the command
[ERROR] mvn <goals> -rf :preflight
[JENKINS] Archiving <https://ci-builds.apache.org/job/PDFBox/job/PDFBox-2.0.x/ws/xmpbox/pom.xml> to org.apache.pdfbox/xmpbox/2.0.38-SNAPSHOT/xmpbox-2.0.38-SNAPSHOT.pom
[JENKINS] Archiving <https://ci-builds.apache.org/job/PDFBox/job/PDFBox-2.0.x/ws/xmpbox/target/xmpbox-2.0.38-SNAPSHOT.jar> to org.apache.pdfbox/xmpbox/2.0.38-20260725.165149-24/xmpbox-2.0.38-20260725.165149-24.jar
[JENKINS] Archiving <https://ci-builds.apache.org/job/PDFBox/job/PDFBox-2.0.x/ws/tools/pom.xml> to org.apache.pdfbox/pdfbox-tools/2.0.38-SNAPSHOT/pdfbox-tools-2.0.38-SNAPSHOT.pom
[JENKINS] Archiving <https://ci-builds.apache.org/job/PDFBox/job/PDFBox-2.0.x/ws/debugger/pom.xml> to org.apache.pdfbox/pdfbox-debugger/2.0.38-SNAPSHOT/pdfbox-debugger-2.0.38-SNAPSHOT.pom
[JENKINS] Archiving <https://ci-builds.apache.org/job/PDFBox/job/PDFBox-2.0.x/ws/preflight-app/pom.xml> to org.apache.pdfbox/preflight-app/2.0.38-SNAPSHOT/preflight-app-2.0.38-SNAPSHOT.pom
[JENKINS] Archiving <https://ci-builds.apache.org/job/PDFBox/job/PDFBox-2.0.x/ws/app/pom.xml> to org.apache.pdfbox/pdfbox-app/2.0.38-SNAPSHOT/pdfbox-app-2.0.38-SNAPSHOT.pom
[JENKINS] Archiving <https://ci-builds.apache.org/job/PDFBox/job/PDFBox-2.0.x/ws/examples/pom.xml> to org.apache.pdfbox/pdfbox-examples/2.0.38-SNAPSHOT/pdfbox-examples-2.0.38-SNAPSHOT.pom
[JENKINS] Archiving <https://ci-builds.apache.org/job/PDFBox/job/PDFBox-2.0.x/ws/preflight/pom.xml> to org.apache.pdfbox/preflight/2.0.38-SNAPSHOT/preflight-2.0.38-SNAPSHOT.pom
[JENKINS] Archiving <https://ci-builds.apache.org/job/PDFBox/job/PDFBox-2.0.x/ws/pom.xml> to org.apache.pdfbox/pdfbox-reactor/2.0.38-SNAPSHOT/pdfbox-reactor-2.0.38-SNAPSHOT.pom
[JENKINS] Archiving <https://ci-builds.apache.org/job/PDFBox/job/PDFBox-2.0.x/ws/parent/pom.xml> to org.apache.pdfbox/pdfbox-parent/2.0.38-SNAPSHOT/pdfbox-parent-2.0.38-SNAPSHOT.pom
[JENKINS] Archiving <https://ci-builds.apache.org/job/PDFBox/job/PDFBox-2.0.x/ws/pdfbox/pom.xml> to org.apache.pdfbox/pdfbox/2.0.38-SNAPSHOT/pdfbox-2.0.38-SNAPSHOT.pom
[JENKINS] Archiving <https://ci-builds.apache.org/job/PDFBox/job/PDFBox-2.0.x/ws/pdfbox/target/pdfbox-2.0.38-SNAPSHOT.jar> to org.apache.pdfbox/pdfbox/2.0.38-20260725.165149-24/pdfbox-2.0.38-20260725.165149-24.jar
[JENKINS] Archiving <https://ci-builds.apache.org/job/PDFBox/job/PDFBox-2.0.x/ws/debugger-app/pom.xml> to org.apache.pdfbox/debugger-app/2.0.38-SNAPSHOT/debugger-app-2.0.38-SNAPSHOT.pom
[JENKINS] Archiving <https://ci-builds.apache.org/job/PDFBox/job/PDFBox-2.0.x/ws/fontbox/pom.xml> to org.apache.pdfbox/fontbox/2.0.38-SNAPSHOT/fontbox-2.0.38-SNAPSHOT.pom
[JENKINS] Archiving <https://ci-builds.apache.org/job/PDFBox/job/PDFBox-2.0.x/ws/fontbox/target/fontbox-2.0.38-SNAPSHOT.jar> to org.apache.pdfbox/fontbox/2.0.38-20260725.165149-24/fontbox-2.0.38-20260725.165149-24.jar
No mail will be sent out, as 'PDFBox » PDFBox-2.0.x » Apache PDFBox examples #2045' does not have a result yet. Please make sure you set a proper result in case of pipeline/build scripts.
Sending e-mails to: dev@pdfbox.apache.org
No mail will be sent out, as 'PDFBox » PDFBox-2.0.x » Apache PDFBox Debugger application #2045' does not have a result yet. Please make sure you set a proper result in case of pipeline/build scripts.
No mail will be sent out, as 'PDFBox » PDFBox-2.0.x » Apache PDFBox tools #2045' does not have a result yet. Please make sure you set a proper result in case of pipeline/build scripts.
No mail will be sent out, as 'PDFBox » PDFBox-2.0.x » Apache PDFBox Debugger #2045' does not have a result yet. Please make sure you set a proper result in case of pipeline/build scripts.
No mail will be sent out, as 'PDFBox » PDFBox-2.0.x » Apache Preflight application #2045' does not have a result yet. Please make sure you set a proper result in case of pipeline/build scripts.
No mail will be sent out, as 'PDFBox » PDFBox-2.0.x » Apache PDFBox application #2045' does not have a result yet. Please make sure you set a proper result in case of pipeline/build scripts.
Sending e-mails to: dev@pdfbox.apache.org
No mail will be sent out, as 'PDFBox » PDFBox-2.0.x » pdfbox-reactor #2045' does not have a result yet. Please make sure you set a proper result in case of pipeline/build scripts.
channel stopped
Archiving artifacts
---------------------------------------------------------------------
To unsubscribe, e-mail: dev-unsubscribe@pdfbox.apache.org
For additional commands, e-mail: dev-help@pdfbox.apache.org