You are viewing a plain text version of this content. The canonical link for it is here.
- Hudson build became unstable: plugins-CI-with-maven-2.0.x » Maven Assembly Plugin #619 - posted by Hudson <Hu...@sonatype.org> on 2008/11/01 18:17:02 UTC, 0 replies.
- [continuum] BUILD ERROR: Maven Integration Testing - Maven Integration Test Plugin :: Loadable - default maven2 buildDefinition - posted by "Continuum@vmbuild.apache.org" <co...@apache.org> on 2008/11/01 19:23:10 UTC, 54 replies.
- Build failed in Hudson: plugins-IT-with-maven-2.0.x » Maven JAR Plugin #553 - posted by Hudson <Hu...@sonatype.org> on 2008/11/02 06:50:57 UTC, 0 replies.
- Build failed in Hudson: plugins-IT-with-maven-2.0.x » Maven AntRun Plugin #553 - posted by Hudson <Hu...@sonatype.org> on 2008/11/02 06:50:58 UTC, 0 replies.
- Build failed in Hudson: plugins-IT-with-maven-2.0.x » Maven Assembly Plugin #553 - posted by Hudson <Hu...@sonatype.org> on 2008/11/02 06:50:58 UTC, 0 replies.
- Build failed in Hudson: plugins-IT-with-maven-2.0.x » Maven WAR Plugin #553 - posted by Hudson <Hu...@sonatype.org> on 2008/11/02 06:50:58 UTC, 0 replies.
- Build failed in Hudson: plugins-IT-with-maven-2.0.x » Maven Resources Plugin #553 - posted by Hudson <Hu...@sonatype.org> on 2008/11/02 06:50:58 UTC, 0 replies.
- Build failed in Hudson: maven-core-integration-testing » 1.5,jeos1 #37 - posted by Hudson <Hu...@sonatype.org> on 2008/11/02 23:03:38 UTC, 0 replies.
- Build failed in Hudson: maven-core-integration-testing » 1.5,jeos1 #38 - posted by Hudson <Hu...@sonatype.org> on 2008/11/03 03:02:28 UTC, 0 replies.
- Build failed in Hudson: Maven-2.1.x-with-bootstrap #105 - posted by Apache Hudson Server <hu...@hudson.zones.apache.org> on 2008/11/03 07:02:25 UTC, 0 replies.
- Build failed in Hudson: plugins-IT-with-maven-2.0.x » Maven JAR Plugin #554 - posted by Hudson <Hu...@sonatype.org> on 2008/11/03 07:51:23 UTC, 0 replies.
- Build failed in Hudson: plugins-IT-with-maven-2.0.x » Maven Resources Plugin #554 - posted by Hudson <Hu...@sonatype.org> on 2008/11/03 07:51:23 UTC, 0 replies.
- Build failed in Hudson: plugins-IT-with-maven-2.0.x » Maven AntRun Plugin #554 - posted by Hudson <Hu...@sonatype.org> on 2008/11/03 07:51:23 UTC, 0 replies.
- Build failed in Hudson: plugins-IT-with-maven-2.0.x » Maven WAR Plugin #554 - posted by Hudson <Hu...@sonatype.org> on 2008/11/03 07:51:24 UTC, 0 replies.
- Build failed in Hudson: plugins-IT-with-maven-2.0.x » Maven Assembly Plugin #554 - posted by Hudson <Hu...@sonatype.org> on 2008/11/03 07:51:24 UTC, 0 replies.
- Build failed in Hudson: mercury #132 - posted by Hudson <Hu...@sonatype.org> on 2008/11/04 03:49:01 UTC, 0 replies.
- Build failed in Hudson: plugins-IT-with-maven-2.0.x » Maven Resources Plugin #555 - posted by Hudson <Hu...@sonatype.org> on 2008/11/04 07:52:49 UTC, 0 replies.
- Build failed in Hudson: plugins-IT-with-maven-2.0.x » Maven WAR Plugin #555 - posted by Hudson <Hu...@sonatype.org> on 2008/11/04 07:52:49 UTC, 0 replies.
- Build failed in Hudson: plugins-IT-with-maven-2.0.x » Maven JAR Plugin #555 - posted by Hudson <Hu...@sonatype.org> on 2008/11/04 07:52:49 UTC, 0 replies.
- Build failed in Hudson: plugins-IT-with-maven-2.0.x » Maven Assembly Plugin #555 - posted by Hudson <Hu...@sonatype.org> on 2008/11/04 07:52:49 UTC, 0 replies.
- Build failed in Hudson: plugins-IT-with-maven-2.0.x » Maven AntRun Plugin #555 - posted by Hudson <Hu...@sonatype.org> on 2008/11/04 07:52:49 UTC, 0 replies.
- Hudson build is back to normal: maven-core-integration-testing » 1.5,jeos1 #39 - posted by Hudson <Hu...@sonatype.org> on 2008/11/04 15:03:00 UTC, 0 replies.
- [continuum] BUILD FAILURE: Maven 2.0.x Branch - Integration Test Executor - default maven2 buildDefinition - posted by "Continuum@vmbuild.apache.org" <co...@apache.org> on 2008/11/04 16:35:30 UTC, 48 replies.
- [continuum] BUILD FAILURE: Maven Integration Testing - Maven Integration Tests - default maven2 buildDefinition - posted by "Continuum@vmbuild.apache.org" <co...@apache.org> on 2008/11/04 21:42:54 UTC, 1 replies.
- Build failed in Hudson: maven-core-integration-testing » 1.5,jeos1 #41 - posted by Hudson <Hu...@sonatype.org> on 2008/11/04 23:02:13 UTC, 0 replies.
- Hudson build is back to normal: mercury #133 - posted by Hudson <Hu...@sonatype.org> on 2008/11/04 23:49:27 UTC, 0 replies.
- [continuum] BUILD SUCCESSFUL: Maven Integration Testing - Maven Integration Tests - default maven2 buildDefinition - posted by "Continuum@vmbuild.apache.org" <co...@apache.org> on 2008/11/05 01:53:50 UTC, 0 replies.
- Build failed in Hudson: maven-core-integration-testing » 1.5,jeos1 #42 - posted by Hudson <Hu...@sonatype.org> on 2008/11/05 03:01:48 UTC, 0 replies.
- Hudson build is back to stable: plugins-CI-with-maven-2.0.x » Maven Javadoc Plugin #626 - posted by Hudson <Hu...@sonatype.org> on 2008/11/05 03:19:35 UTC, 0 replies.
- Hudson build became unstable: plugins-CI-with-maven-2.0.x » Maven Changes Report Plugin #626 - posted by Hudson <Hu...@sonatype.org> on 2008/11/05 03:19:35 UTC, 0 replies.
- Build failed in Hudson: mercury #135 - posted by Hudson <Hu...@sonatype.org> on 2008/11/05 07:48:38 UTC, 0 replies.
- Build failed in Hudson: plugins-IT-with-maven-2.0.x » Maven Resources Plugin #556 - posted by Hudson <Hu...@sonatype.org> on 2008/11/05 07:51:24 UTC, 0 replies.
- Build failed in Hudson: plugins-IT-with-maven-2.0.x » Maven WAR Plugin #556 - posted by Hudson <Hu...@sonatype.org> on 2008/11/05 07:51:24 UTC, 0 replies.
- Hudson build is back to stable: plugins-IT-with-maven-2.0.x » Maven Javadoc Plugin #556 - posted by Hudson <Hu...@sonatype.org> on 2008/11/05 07:51:24 UTC, 0 replies.
- Build failed in Hudson: plugins-IT-with-maven-2.0.x » Maven AntRun Plugin #556 - posted by Hudson <Hu...@sonatype.org> on 2008/11/05 07:51:24 UTC, 0 replies.
- Build failed in Hudson: plugins-IT-with-maven-2.0.x » Maven JAR Plugin #556 - posted by Hudson <Hu...@sonatype.org> on 2008/11/05 07:51:24 UTC, 0 replies.
- Build failed in Hudson: plugins-IT-with-maven-2.0.x » Maven Assembly Plugin #556 - posted by Hudson <Hu...@sonatype.org> on 2008/11/05 07:51:24 UTC, 0 replies.
- Hudson build is back to normal: maven-core-integration-testing » 1.5,jeos1 #43 - posted by Hudson <Hu...@sonatype.org> on 2008/11/05 23:07:41 UTC, 0 replies.
- Build failed in Hudson: Maven-2.1.x-with-bootstrap #106 - posted by Apache Hudson Server <hu...@hudson.zones.apache.org> on 2008/11/05 23:20:26 UTC, 0 replies.
- Build failed in Hudson: Maven-2.1.x-with-bootstrap #107 - posted by Apache Hudson Server <hu...@hudson.zones.apache.org> on 2008/11/06 01:22:06 UTC, 0 replies.
- Build failed in Hudson: mercury #136 - posted by Hudson <Hu...@sonatype.org> on 2008/11/06 03:48:02 UTC, 0 replies.
- Hudson build is back to normal: mercury #137 - posted by Hudson <Hu...@sonatype.org> on 2008/11/06 07:49:46 UTC, 0 replies.
- Build failed in Hudson: plugins-IT-with-maven-2.0.x » Maven AntRun Plugin #557 - posted by Hudson <Hu...@sonatype.org> on 2008/11/06 07:50:52 UTC, 0 replies.
- Build failed in Hudson: plugins-IT-with-maven-2.0.x » Maven Resources Plugin #557 - posted by Hudson <Hu...@sonatype.org> on 2008/11/06 07:50:52 UTC, 0 replies.
- Build failed in Hudson: plugins-IT-with-maven-2.0.x » Maven JAR Plugin #557 - posted by Hudson <Hu...@sonatype.org> on 2008/11/06 07:50:52 UTC, 0 replies.
- Build failed in Hudson: plugins-IT-with-maven-2.0.x » Maven Assembly Plugin #557 - posted by Hudson <Hu...@sonatype.org> on 2008/11/06 07:50:53 UTC, 0 replies.
- Build failed in Hudson: plugins-IT-with-maven-2.0.x » Maven WAR Plugin #557 - posted by Hudson <Hu...@sonatype.org> on 2008/11/06 07:50:53 UTC, 0 replies.
- Build failed in Hudson: Maven-2.1.x-with-bootstrap #108 - posted by Apache Hudson Server <hu...@hudson.zones.apache.org> on 2008/11/06 17:21:34 UTC, 0 replies.
- Build failed in Hudson: plugins-IT-with-maven-2.0.x » Maven JAR Plugin #558 - posted by Hudson <Hu...@sonatype.org> on 2008/11/07 07:55:01 UTC, 0 replies.
- Build failed in Hudson: plugins-IT-with-maven-2.0.x » Maven AntRun Plugin #558 - posted by Hudson <Hu...@sonatype.org> on 2008/11/07 07:55:01 UTC, 0 replies.
- Build failed in Hudson: plugins-IT-with-maven-2.0.x » Maven Resources Plugin #558 - posted by Hudson <Hu...@sonatype.org> on 2008/11/07 07:55:01 UTC, 0 replies.
- Build failed in Hudson: plugins-IT-with-maven-2.0.x » Maven Assembly Plugin #558 - posted by Hudson <Hu...@sonatype.org> on 2008/11/07 07:55:02 UTC, 0 replies.
- Build failed in Hudson: plugins-IT-with-maven-2.0.x » Maven WAR Plugin #558 - posted by Hudson <Hu...@sonatype.org> on 2008/11/07 07:55:02 UTC, 0 replies.
- Build failed in Hudson: maven-core-integration-testing » 1.5,jeos1 #45 - posted by Hudson <Hu...@sonatype.org> on 2008/11/07 19:10:53 UTC, 0 replies.
- Hudson build is back to normal: maven-core-integration-testing » 1.5,jeos1 #46 - posted by Hudson <Hu...@sonatype.org> on 2008/11/07 23:03:37 UTC, 0 replies.
- Build failed in Hudson: plugins-IT-with-maven-2.0.x » Maven JAR Plugin #559 - posted by Hudson <Hu...@sonatype.org> on 2008/11/08 07:49:52 UTC, 0 replies.
- Build failed in Hudson: plugins-IT-with-maven-2.0.x » Maven Resources Plugin #559 - posted by Hudson <Hu...@sonatype.org> on 2008/11/08 07:49:52 UTC, 0 replies.
- Build failed in Hudson: plugins-IT-with-maven-2.0.x » Maven AntRun Plugin #559 - posted by Hudson <Hu...@sonatype.org> on 2008/11/08 07:49:52 UTC, 0 replies.
- Build failed in Hudson: plugins-IT-with-maven-2.0.x » Maven WAR Plugin #559 - posted by Hudson <Hu...@sonatype.org> on 2008/11/08 07:49:53 UTC, 0 replies.
- Build failed in Hudson: plugins-IT-with-maven-2.0.x » Maven Assembly Plugin #559 - posted by Hudson <Hu...@sonatype.org> on 2008/11/08 07:49:53 UTC, 0 replies.
- Build failed in Hudson: plugins-IT-with-maven-2.0.x » Maven AntRun Plugin #560 - posted by Hudson <Hu...@sonatype.org> on 2008/11/10 07:50:53 UTC, 0 replies.
- Build failed in Hudson: plugins-IT-with-maven-2.0.x » Maven JAR Plugin #560 - posted by Hudson <Hu...@sonatype.org> on 2008/11/10 07:50:53 UTC, 0 replies.
- Build failed in Hudson: plugins-IT-with-maven-2.0.x » Maven Assembly Plugin #560 - posted by Hudson <Hu...@sonatype.org> on 2008/11/10 07:50:53 UTC, 0 replies.
- Build failed in Hudson: plugins-IT-with-maven-2.0.x » Maven Resources Plugin #560 - posted by Hudson <Hu...@sonatype.org> on 2008/11/10 07:50:53 UTC, 0 replies.
- Build failed in Hudson: plugins-IT-with-maven-2.0.x » Maven WAR Plugin #560 - posted by Hudson <Hu...@sonatype.org> on 2008/11/10 07:50:53 UTC, 0 replies.
- Build failed in Hudson: Maven-2.1.x-with-bootstrap #109 - posted by Apache Hudson Server <hu...@hudson.zones.apache.org> on 2008/11/10 08:21:34 UTC, 0 replies.
- Build failed in Hudson: Maven-2.1.x-with-bootstrap #110 - posted by Apache Hudson Server <hu...@hudson.zones.apache.org> on 2008/11/10 09:22:03 UTC, 0 replies.
- Build failed in Hudson: mercury #142 - posted by Hudson <Hu...@sonatype.org> on 2008/11/10 11:48:36 UTC, 0 replies.
- Build failed in Hudson: Maven-2.1.x-with-bootstrap #111 - posted by Apache Hudson Server <hu...@hudson.zones.apache.org> on 2008/11/10 17:20:38 UTC, 0 replies.
- Build failed in Hudson: scm » Maven SCM #177 - posted by Hudson <Hu...@sonatype.org> on 2008/11/11 03:38:10 UTC, 0 replies.
- Build failed in Hudson: Maven-2.1.x-with-bootstrap #112 - posted by Apache Hudson Server <hu...@hudson.zones.apache.org> on 2008/11/11 16:21:15 UTC, 0 replies.
- Build failed in Hudson: Maven-2.1.x-with-bootstrap #113 - posted by Apache Hudson Server <hu...@hudson.zones.apache.org> on 2008/11/11 22:27:26 UTC, 0 replies.
- Build failed in Hudson: Maven-2.1.x-with-bootstrap #114 - posted by Apache Hudson Server <hu...@hudson.zones.apache.org> on 2008/11/12 00:01:15 UTC, 0 replies.
- Build failed in Hudson: mercury #144 - posted by Hudson <Hu...@sonatype.org> on 2008/11/12 16:04:58 UTC, 0 replies.
- Build failed in Hudson: Maven-2.1.x-with-bootstrap #115 - posted by Apache Hudson Server <hu...@hudson.zones.apache.org> on 2008/11/12 20:52:47 UTC, 0 replies.
- Build failed in Hudson: mercury #145 - posted by Hudson <Hu...@sonatype.org> on 2008/11/12 23:47:25 UTC, 0 replies.
- Build failed in Hudson: Maven-2.1.x-with-bootstrap #116 - posted by Apache Hudson Server <hu...@hudson.zones.apache.org> on 2008/11/13 00:03:08 UTC, 0 replies.
- Build failed in Hudson: plugins-IT-with-maven-2.0.x » Maven AntRun Plugin #561 - posted by Hudson <Hu...@sonatype.org> on 2008/11/14 07:48:41 UTC, 0 replies.
- Build failed in Hudson: plugins-IT-with-maven-2.0.x » Maven Resources Plugin #561 - posted by Hudson <Hu...@sonatype.org> on 2008/11/14 07:48:41 UTC, 0 replies.
- Build failed in Hudson: plugins-IT-with-maven-2.0.x » Maven Assembly Plugin #561 - posted by Hudson <Hu...@sonatype.org> on 2008/11/14 07:48:41 UTC, 0 replies.
- Build failed in Hudson: plugins-IT-with-maven-2.0.x » Maven WAR Plugin #561 - posted by Hudson <Hu...@sonatype.org> on 2008/11/14 07:48:41 UTC, 0 replies.
- Build failed in Hudson: plugins-IT-with-maven-2.0.x » Maven JAR Plugin #561 - posted by Hudson <Hu...@sonatype.org> on 2008/11/14 07:48:41 UTC, 0 replies.
- Hudson build is back to normal: mercury #146 - posted by Hudson <Hu...@sonatype.org> on 2008/11/14 07:51:23 UTC, 0 replies.
- Build failed in Hudson: Maven-2.1.x-with-bootstrap #117 - posted by Apache Hudson Server <hu...@hudson.zones.apache.org> on 2008/11/14 18:21:53 UTC, 0 replies.
- Build failed in Hudson: Maven-2.1.x-with-bootstrap #118 - posted by Apache Hudson Server <hu...@hudson.zones.apache.org> on 2008/11/14 21:32:45 UTC, 0 replies.
- Hudson build is back to normal: plugins-IT-with-maven-2.0.x » Maven AntRun Plugin #562 - posted by Hudson <Hu...@sonatype.org> on 2008/11/15 07:52:04 UTC, 0 replies.
- Build failed in Hudson: plugins-IT-with-maven-2.0.x » Maven WAR Plugin #562 - posted by Hudson <Hu...@sonatype.org> on 2008/11/15 07:52:04 UTC, 0 replies.
- Build failed in Hudson: plugins-IT-with-maven-2.0.x » Maven Assembly Plugin #562 - posted by Hudson <Hu...@sonatype.org> on 2008/11/15 07:52:04 UTC, 0 replies.
- Build failed in Hudson: plugins-IT-with-maven-2.0.x » Maven Resources Plugin #562 - posted by Hudson <Hu...@sonatype.org> on 2008/11/15 07:52:04 UTC, 0 replies.
- Build failed in Hudson: plugins-IT-with-maven-2.0.x » Maven JAR Plugin #562 - posted by Hudson <Hu...@sonatype.org> on 2008/11/15 07:52:04 UTC, 0 replies.
- Build failed in Hudson: Maven-2.1.x-with-bootstrap #119 - posted by Apache Hudson Server <hu...@hudson.zones.apache.org> on 2008/11/16 00:29:27 UTC, 0 replies.
- Build failed in Hudson: plugins-IT-with-maven-2.0.x » Maven Assembly Plugin #563 - posted by Hudson <Hu...@sonatype.org> on 2008/11/16 07:53:14 UTC, 0 replies.
- Build failed in Hudson: plugins-IT-with-maven-2.0.x » Maven JAR Plugin #563 - posted by Hudson <Hu...@sonatype.org> on 2008/11/16 07:53:14 UTC, 0 replies.
- Build failed in Hudson: plugins-IT-with-maven-2.0.x » Maven WAR Plugin #563 - posted by Hudson <Hu...@sonatype.org> on 2008/11/16 07:53:14 UTC, 0 replies.
- Build failed in Hudson: plugins-IT-with-maven-2.0.x » Maven Resources Plugin #563 - posted by Hudson <Hu...@sonatype.org> on 2008/11/16 07:53:14 UTC, 0 replies.
- Build failed in Hudson: Maven-2.1.x-with-bootstrap #120 - posted by Apache Hudson Server <hu...@hudson.zones.apache.org> on 2008/11/16 21:32:06 UTC, 0 replies.
- Build failed in Hudson: Maven-2.1.x-with-bootstrap #121 - posted by Apache Hudson Server <hu...@hudson.zones.apache.org> on 2008/11/17 05:17:37 UTC, 0 replies.
- Build failed in Hudson: plugins-IT-with-maven-2.0.x » Maven WAR Plugin #564 - posted by Hudson <Hu...@sonatype.org> on 2008/11/17 07:55:07 UTC, 0 replies.
- Hudson build is back to normal: plugins-IT-with-maven-2.0.x » Maven Resources Plugin #564 - posted by Hudson <Hu...@sonatype.org> on 2008/11/17 07:55:07 UTC, 0 replies.
- Build failed in Hudson: plugins-IT-with-maven-2.0.x » Maven Assembly Plugin #564 - posted by Hudson <Hu...@sonatype.org> on 2008/11/17 07:55:07 UTC, 0 replies.
- Build failed in Hudson: plugins-IT-with-maven-2.0.x » Maven JAR Plugin #564 - posted by Hudson <Hu...@sonatype.org> on 2008/11/17 07:55:07 UTC, 0 replies.
- Build failed in Hudson: Maven-2.1.x-with-bootstrap #122 - posted by Apache Hudson Server <hu...@hudson.zones.apache.org> on 2008/11/17 08:23:26 UTC, 0 replies.
- Build failed in Hudson: Maven-2.1.x-with-bootstrap #123 - posted by Apache Hudson Server <hu...@hudson.zones.apache.org> on 2008/11/17 19:17:10 UTC, 0 replies.
- Build failed in Hudson: Maven-2.1.x-with-bootstrap #124 - posted by Apache Hudson Server <hu...@hudson.zones.apache.org> on 2008/11/17 22:23:03 UTC, 0 replies.
- Build failed in Hudson: Maven-2.1.x-with-bootstrap #125 - posted by Apache Hudson Server <hu...@hudson.zones.apache.org> on 2008/11/18 02:20:48 UTC, 0 replies.
- Build failed in Hudson: Maven-2.1.x-with-bootstrap #126 - posted by Apache Hudson Server <hu...@hudson.zones.apache.org> on 2008/11/18 04:17:09 UTC, 0 replies.
- Build failed in Hudson: Maven-2.1.x-with-bootstrap #127 - posted by Apache Hudson Server <hu...@hudson.zones.apache.org> on 2008/11/18 05:17:12 UTC, 0 replies.
- Build failed in Hudson: plugins-IT-with-maven-2.0.x » Maven WAR Plugin #565 - posted by Hudson <Hu...@sonatype.org> on 2008/11/18 07:54:39 UTC, 0 replies.
- Build failed in Hudson: plugins-IT-with-maven-2.0.x » Maven JAR Plugin #565 - posted by Hudson <Hu...@sonatype.org> on 2008/11/18 07:54:39 UTC, 0 replies.
- Build failed in Hudson: plugins-IT-with-maven-2.0.x » Maven Assembly Plugin #565 - posted by Hudson <Hu...@sonatype.org> on 2008/11/18 07:54:39 UTC, 0 replies.
- Build failed in Hudson: Maven-2.1.x-with-bootstrap #128 - posted by Apache Hudson Server <hu...@hudson.zones.apache.org> on 2008/11/18 19:18:02 UTC, 0 replies.
- [continuum] BUILD ERROR: Maven Integration Testing - Maven Integration Test Plugin :: Envar - default maven2 buildDefinition - posted by "Continuum@vmbuild.apache.org" <co...@apache.org> on 2008/11/19 02:26:24 UTC, 6 replies.
- Build failed in Hudson: Maven-2.1.x-with-bootstrap #129 - posted by Apache Hudson Server <hu...@hudson.zones.apache.org> on 2008/11/19 05:24:07 UTC, 0 replies.
- Build failed in Hudson: plugins-IT-with-maven-2.0.x » Maven Assembly Plugin #566 - posted by Hudson <Hu...@sonatype.org> on 2008/11/19 07:51:06 UTC, 0 replies.
- Build failed in Hudson: plugins-IT-with-maven-2.0.x » Maven WAR Plugin #566 - posted by Hudson <Hu...@sonatype.org> on 2008/11/19 07:51:06 UTC, 0 replies.
- Build failed in Hudson: plugins-IT-with-maven-2.0.x » Maven JAR Plugin #566 - posted by Hudson <Hu...@sonatype.org> on 2008/11/19 07:51:06 UTC, 0 replies.
- Build failed in Hudson: Maven-2.1.x-with-bootstrap #130 - posted by Apache Hudson Server <hu...@hudson.zones.apache.org> on 2008/11/20 02:42:42 UTC, 0 replies.
- Build failed in Hudson: plugins-IT-with-maven-2.0.x » Maven JAR Plugin #567 - posted by Hudson <Hu...@sonatype.org> on 2008/11/20 07:50:59 UTC, 0 replies.
- Build failed in Hudson: plugins-IT-with-maven-2.0.x » Maven WAR Plugin #567 - posted by Hudson <Hu...@sonatype.org> on 2008/11/20 07:51:00 UTC, 0 replies.
- Build failed in Hudson: plugins-IT-with-maven-2.0.x » Maven Assembly Plugin #567 - posted by Hudson <Hu...@sonatype.org> on 2008/11/20 07:51:00 UTC, 0 replies.
- Build failed in Hudson: Maven-2.1.x-with-bootstrap #131 - posted by Apache Hudson Server <hu...@hudson.zones.apache.org> on 2008/11/20 17:17:13 UTC, 0 replies.
- Build failed in Hudson: Maven-2.1.x-with-bootstrap #132 - posted by Apache Hudson Server <hu...@hudson.zones.apache.org> on 2008/11/20 19:53:35 UTC, 0 replies.
- Build failed in Hudson: Maven-2.1.x-with-bootstrap #133 - posted by Apache Hudson Server <hu...@hudson.zones.apache.org> on 2008/11/21 01:20:27 UTC, 0 replies.
- Build failed in Hudson: Maven-2.1.x-with-bootstrap #134 - posted by Apache Hudson Server <hu...@hudson.zones.apache.org> on 2008/11/21 06:32:29 UTC, 0 replies.
- Build failed in Hudson: plugins-IT-with-maven-2.0.x » Maven JAR Plugin #568 - posted by Hudson <Hu...@sonatype.org> on 2008/11/21 07:48:25 UTC, 0 replies.
- Build failed in Hudson: plugins-IT-with-maven-2.0.x » Maven Assembly Plugin #568 - posted by Hudson <Hu...@sonatype.org> on 2008/11/21 07:48:25 UTC, 0 replies.
- Build failed in Hudson: plugins-IT-with-maven-2.0.x » Maven WAR Plugin #568 - posted by Hudson <Hu...@sonatype.org> on 2008/11/21 07:48:25 UTC, 0 replies.
- Build failed in Hudson: Maven-2.1.x-with-bootstrap #135 - posted by Apache Hudson Server <hu...@hudson.zones.apache.org> on 2008/11/21 08:29:08 UTC, 0 replies.
- Build failed in Hudson: Maven-2.1.x-with-bootstrap #136 - posted by Apache Hudson Server <hu...@hudson.zones.apache.org> on 2008/11/21 22:17:43 UTC, 0 replies.
- Build failed in Hudson: Maven-2.1.x-with-bootstrap #137 - posted by Apache Hudson Server <hu...@hudson.zones.apache.org> on 2008/11/21 23:17:44 UTC, 0 replies.
- Build failed in Hudson: Maven-2.1.x-with-bootstrap #138 - posted by Apache Hudson Server <hu...@hudson.zones.apache.org> on 2008/11/22 02:17:28 UTC, 0 replies.
- Build failed in Hudson: Maven-2.1.x-with-bootstrap #139 - posted by Apache Hudson Server <hu...@hudson.zones.apache.org> on 2008/11/22 17:29:46 UTC, 0 replies.
- Build failed in Hudson: Maven-2.1.x-with-bootstrap #140 - posted by Apache Hudson Server <hu...@hudson.zones.apache.org> on 2008/11/22 23:17:55 UTC, 0 replies.
- Build failed in Hudson: Maven-2.1.x-with-bootstrap #141 - posted by Apache Hudson Server <hu...@hudson.zones.apache.org> on 2008/11/23 00:17:32 UTC, 0 replies.
- Build failed in Hudson: Maven-2.1.x-with-bootstrap #142 - posted by Apache Hudson Server <hu...@hudson.zones.apache.org> on 2008/11/23 20:25:02 UTC, 0 replies.
- Build failed in Hudson: Maven-2.1.x-with-bootstrap #143 - posted by Apache Hudson Server <hu...@hudson.zones.apache.org> on 2008/11/24 00:14:36 UTC, 0 replies.
- [continuum] BUILD FAILURE: Maven Plugins - Maven Changes Report Plugin - default maven2 buildDefinition - posted by "Continuum@vmbuild.apache.org" <co...@apache.org> on 2008/11/24 12:18:31 UTC, 0 replies.
- Build failed in Hudson: plugins-IT-with-maven-2.0.x » Maven JAR Plugin #569 - posted by Hudson <Hu...@sonatype.org> on 2008/11/25 07:48:42 UTC, 0 replies.
- Build failed in Hudson: plugins-IT-with-maven-2.0.x » Maven WAR Plugin #569 - posted by Hudson <Hu...@sonatype.org> on 2008/11/25 07:48:42 UTC, 0 replies.
- Build failed in Hudson: plugins-IT-with-maven-2.0.x » Maven Assembly Plugin #569 - posted by Hudson <Hu...@sonatype.org> on 2008/11/25 07:48:42 UTC, 0 replies.
- Build failed in Hudson: Maven-2.1.x-with-bootstrap #144 - posted by Apache Hudson Server <hu...@hudson.zones.apache.org> on 2008/11/25 15:39:12 UTC, 0 replies.
- [continuum] BUILD SUCCESSFUL: Maven 2.0.x Branch - Integration Test Executor - default maven2 buildDefinition - posted by "Continuum@vmbuild.apache.org" <co...@apache.org> on 2008/11/25 16:28:25 UTC, 0 replies.
- Build failed in Hudson: Maven-2.1.x-with-bootstrap #145 - posted by Apache Hudson Server <hu...@hudson.zones.apache.org> on 2008/11/25 17:18:42 UTC, 0 replies.
- Build failed in Hudson: Maven-2.1.x-with-bootstrap #146 - posted by Apache Hudson Server <hu...@hudson.zones.apache.org> on 2008/11/25 18:18:52 UTC, 0 replies.
- Build failed in Hudson: plugins-IT-with-maven-2.0.x » Maven Assembly Plugin #570 - posted by Hudson <Hu...@sonatype.org> on 2008/11/26 07:45:24 UTC, 0 replies.
- Build failed in Hudson: plugins-IT-with-maven-2.0.x » Maven WAR Plugin #570 - posted by Hudson <Hu...@sonatype.org> on 2008/11/26 07:45:24 UTC, 0 replies.
- Build failed in Hudson: plugins-IT-with-maven-2.0.x » Maven JAR Plugin #570 - posted by Hudson <Hu...@sonatype.org> on 2008/11/26 07:45:24 UTC, 0 replies.
- Build failed in Hudson: Maven-2.1.x-with-bootstrap #147 - posted by Apache Hudson Server <hu...@hudson.zones.apache.org> on 2008/11/27 03:39:17 UTC, 0 replies.
- Build failed in Hudson: Maven-2.1.x-with-bootstrap #148 - posted by Apache Hudson Server <hu...@hudson.zones.apache.org> on 2008/11/27 06:17:26 UTC, 0 replies.
- Build failed in Hudson: Maven-2.1.x-with-bootstrap #149 - posted by Apache Hudson Server <hu...@hudson.zones.apache.org> on 2008/11/27 07:17:34 UTC, 0 replies.
- Build failed in Hudson: Maven-2.1.x-with-bootstrap #150 - posted by Apache Hudson Server <hu...@hudson.zones.apache.org> on 2008/11/27 08:37:24 UTC, 0 replies.
- Build failed in Hudson: Maven-2.1.x-with-bootstrap #151 - posted by Apache Hudson Server <hu...@hudson.zones.apache.org> on 2008/11/27 10:35:54 UTC, 0 replies.
- Build failed in Hudson: Maven-2.1.x-with-bootstrap #152 - posted by Apache Hudson Server <hu...@hudson.zones.apache.org> on 2008/11/27 19:17:27 UTC, 0 replies.
- Build failed in Hudson: Maven-2.1.x-with-bootstrap #153 - posted by Apache Hudson Server <hu...@hudson.zones.apache.org> on 2008/11/27 20:32:55 UTC, 0 replies.
- Build failed in Hudson: Maven-2.1.x-with-bootstrap #154 - posted by Apache Hudson Server <hu...@hudson.zones.apache.org> on 2008/11/27 22:18:02 UTC, 0 replies.
- Build failed in Hudson: Maven-2.1.x-with-bootstrap #155 - posted by Apache Hudson Server <hu...@hudson.zones.apache.org> on 2008/11/28 00:19:21 UTC, 0 replies.
- Build failed in Hudson: Maven-2.1.x-with-bootstrap #156 - posted by Apache Hudson Server <hu...@hudson.zones.apache.org> on 2008/11/28 05:17:40 UTC, 0 replies.
- Build failed in Hudson: Maven-2.1.x-with-bootstrap #157 - posted by Apache Hudson Server <hu...@hudson.zones.apache.org> on 2008/11/28 06:18:12 UTC, 0 replies.
- Build failed in Hudson: Maven-2.1.x-with-bootstrap #158 - posted by Apache Hudson Server <hu...@hudson.zones.apache.org> on 2008/11/28 07:17:44 UTC, 0 replies.
- Build failed in Hudson: plugins-IT-with-maven-2.0.x » Maven Assembly Plugin #571 - posted by Hudson <Hu...@sonatype.org> on 2008/11/28 07:45:19 UTC, 0 replies.
- Build failed in Hudson: plugins-IT-with-maven-2.0.x » Maven WAR Plugin #571 - posted by Hudson <Hu...@sonatype.org> on 2008/11/28 07:45:19 UTC, 0 replies.
- Build failed in Hudson: plugins-IT-with-maven-2.0.x » Maven JAR Plugin #571 - posted by Hudson <Hu...@sonatype.org> on 2008/11/28 07:45:19 UTC, 0 replies.
- Build failed in Hudson: Maven-2.1.x-with-bootstrap #159 - posted by Apache Hudson Server <hu...@hudson.zones.apache.org> on 2008/11/28 23:17:31 UTC, 0 replies.
- [continuum] BUILD ERROR: Maven Integration Testing - Maven Integration Test Plugin :: Interpolated POM Configuration - default maven2 buildDefinition - posted by "Continuum@vmbuild.apache.org" <co...@apache.org> on 2008/11/29 00:00:12 UTC, 0 replies.
- Build failed in Hudson: Maven-2.1.x-with-bootstrap #160 - posted by Apache Hudson Server <hu...@hudson.zones.apache.org> on 2008/11/29 03:28:01 UTC, 0 replies.
- Build failed in Hudson: Maven-2.1.x-with-bootstrap #161 - posted by Apache Hudson Server <hu...@hudson.zones.apache.org> on 2008/11/29 04:17:56 UTC, 0 replies.
- Build failed in Hudson: Maven-2.1.x-with-bootstrap #162 - posted by Apache Hudson Server <hu...@hudson.zones.apache.org> on 2008/11/29 06:17:50 UTC, 0 replies.
- Build failed in Hudson: Maven-2.1.x-with-bootstrap #163 - posted by Apache Hudson Server <hu...@hudson.zones.apache.org> on 2008/11/29 07:52:36 UTC, 0 replies.
- Build failed in Hudson: Maven-2.1.x-with-bootstrap #164 - posted by Apache Hudson Server <hu...@hudson.zones.apache.org> on 2008/11/29 20:03:42 UTC, 0 replies.
- Build failed in Hudson: Maven-2.1.x-with-bootstrap #165 - posted by Apache Hudson Server <hu...@hudson.zones.apache.org> on 2008/11/29 21:17:13 UTC, 0 replies.
- Build failed in Hudson: Maven-2.1.x-with-bootstrap #166 - posted by Apache Hudson Server <hu...@hudson.zones.apache.org> on 2008/11/29 22:17:40 UTC, 0 replies.
- Build failed in Hudson: Maven-2.1.x-with-bootstrap #167 - posted by Apache Hudson Server <hu...@hudson.zones.apache.org> on 2008/11/29 23:19:29 UTC, 0 replies.
- Build failed in Hudson: Maven-2.1.x-with-bootstrap #168 - posted by Apache Hudson Server <hu...@hudson.zones.apache.org> on 2008/11/30 01:23:34 UTC, 0 replies.
- Build failed in Hudson: Maven-2.1.x-with-bootstrap #169 - posted by Apache Hudson Server <hu...@hudson.zones.apache.org> on 2008/11/30 03:20:36 UTC, 0 replies.
- Build failed in Hudson: Maven-2.1.x-with-bootstrap #170 - posted by Apache Hudson Server <hu...@hudson.zones.apache.org> on 2008/11/30 07:51:34 UTC, 0 replies.
- Build failed in Hudson: Maven-2.1.x-with-bootstrap #171 - posted by Apache Hudson Server <hu...@hudson.zones.apache.org> on 2008/11/30 18:17:21 UTC, 0 replies.
- Build failed in Hudson: Maven-2.1.x-with-bootstrap #172 - posted by Apache Hudson Server <hu...@hudson.zones.apache.org> on 2008/11/30 21:17:16 UTC, 0 replies.
- Build failed in Hudson: Maven-2.1.x-with-bootstrap #173 - posted by Apache Hudson Server <hu...@hudson.zones.apache.org> on 2008/11/30 22:17:16 UTC, 0 replies.
- Build failed in Hudson: Maven-2.1.x-with-bootstrap #174 - posted by Apache Hudson Server <hu...@hudson.zones.apache.org> on 2008/11/30 23:17:13 UTC, 0 replies.