You are viewing a plain text version of this content. The canonical link for it is here.
Posted to notifications@maven.apache.org by Hudson <Hu...@sonatype.org> on 2008/11/14 07:48:41 UTC

Build failed in Hudson: plugins-IT-with-maven-2.0.x » Maven Resources Plugin #561

See http://ci.sonatype.org/job/plugins-IT-with-maven-2.0.x/org.apache.maven.plugins$maven-resources-plugin/561/changes

------------------------------------------
[INFO] ------------------------------------------------------------------------
[INFO] SKIPPING Maven Repository Plugin
[INFO]    task-segment: [clean, deploy]
[INFO] This project has been banned from further executions due to previous failures.
[INFO] ------------------------------------------------------------------------
[INFO] ------------------------------------------------------------------------
[INFO] Building Maven Resources Plugin
[INFO]    task-segment: [clean, deploy]
[INFO] ------------------------------------------------------------------------
[INFO] [clean:clean]
[INFO] Deleting directory http://ci.sonatype.org/job/plugins-IT-with-maven-2.0.x/org.apache.maven.plugins$maven-resources-plugin/ws/target 
Downloading: http://localhost:8081/content/groups/public/org/apache/maven/shared/maven-filtering/1.0-beta-2/maven-filtering-1.0-beta-2.pom
3K downloaded
Downloading: http://localhost:8081/content/groups/public/org/apache/maven/shared/maven-filtering/1.0-beta-2/maven-filtering-1.0-beta-2.jar
32K downloaded
[INFO] [enforcer:enforce {execution: ensure-no-container-api}]
[INFO] [plugin:helpmojo {execution: generated-helpmojo}]
[INFO] Using 2 extractors.
[INFO] Applying extractor for language: java
[INFO] Extractor for language: java found 3 mojo descriptors.
[INFO] Applying extractor for language: bsh
[INFO] Extractor for language: bsh found 0 mojo descriptors.
[INFO] [plugin:descriptor]
[INFO] Using 2 extractors.
[INFO] Applying extractor for language: java
[INFO] Extractor for language: java found 4 mojo descriptors.
[INFO] Applying extractor for language: bsh
[INFO] Extractor for language: bsh found 0 mojo descriptors.
[INFO] [remote-resources:process {execution: default}]
[INFO] [resources:resources]
[INFO] Using encoding: 'UTF-8' to copy filtered resources.
[INFO] [compiler:compile]
[INFO] Compiling 7 source files to http://ci.sonatype.org/job/plugins-IT-with-maven-2.0.x/org.apache.maven.plugins$maven-resources-plugin/ws/target/classes 
[INFO] [resources:testResources]
[INFO] Using encoding: 'UTF-8' to copy filtered resources.
[INFO] [compiler:testCompile]
[INFO] Compiling 11 source files to http://ci.sonatype.org/job/plugins-IT-with-maven-2.0.x/org.apache.maven.plugins$maven-resources-plugin/ws/target/test-classes 
[INFO] [surefire:test]
[INFO] Surefire report directory: http://ci.sonatype.org/job/plugins-IT-with-maven-2.0.x/org.apache.maven.plugins$maven-resources-plugin/ws/target/surefire-reports 

-------------------------------------------------------
 T E S T S
-------------------------------------------------------
Running org.apache.maven.plugin.resources.CopyResourcesMojoTest
[WARNING] Using platform encoding (UTF-8 actually) to copy filtered resources, i.e. build is platform dependent!
[INFO] Copying 1 resource
Tests run: 1, Failures: 0, Errors: 0, Skipped: 0, Time elapsed: 0.631 sec
Running org.apache.maven.plugin.resources.TestResourcesTest
[WARNING] Using platform encoding (UTF-8 actually) to copy filtered resources, i.e. build is platform dependent!
[INFO] Copying 5 resources
Tests run: 2, Failures: 0, Errors: 0, Skipped: 0, Time elapsed: 0.198 sec
Running org.apache.maven.plugin.resources.AdvancePropertyUtilsTest
Tests run: 3, Failures: 0, Errors: 0, Skipped: 0, Time elapsed: 0.167 sec
Running org.apache.maven.plugin.resources.ReflectionPropertiesTest
Tests run: 2, Failures: 0, Errors: 0, Skipped: 0, Time elapsed: 0.145 sec
Running org.apache.maven.plugin.resources.ResourcesMojoTest
[WARNING] Using platform encoding (UTF-8 actually) to copy filtered resources, i.e. build is platform dependent!
[INFO] Copying 5 resources
[WARNING] Using platform encoding (UTF-8 actually) to copy filtered resources, i.e. build is platform dependent!
[INFO] Copying 5 resources
[INFO] Using 'UTF-8' encoding to copy filtered resources.
[INFO] Copying 1 resource
[WARNING] Using platform encoding (UTF-8 actually) to copy filtered resources, i.e. build is platform dependent!
[INFO] Copying 4 resources
[WARNING] Using platform encoding (UTF-8 actually) to copy filtered resources, i.e. build is platform dependent!
[INFO] Copying 8 resources
[WARNING] Using platform encoding (UTF-8 actually) to copy filtered resources, i.e. build is platform dependent!
[INFO] Copying 5 resources to org/apache/maven/plugin/test
[WARNING] File encoding has not been set, using platform encoding UTF-8, i.e. build is platform dependent!
[WARNING] Using platform encoding (UTF-8 actually) to copy filtered resources, i.e. build is platform dependent!
[INFO] Copying 1 resource
[WARNING] File encoding has not been set, using platform encoding UTF-8, i.e. build is platform dependent!
[WARNING] Using platform encoding (UTF-8 actually) to copy filtered resources, i.e. build is platform dependent!
[INFO] Copying 1 resource
[WARNING] File encoding has not been set, using platform encoding UTF-8, i.e. build is platform dependent!
[WARNING] Using platform encoding (UTF-8 actually) to copy filtered resources, i.e. build is platform dependent!
[INFO] Copying 1 resource
[WARNING] File encoding has not been set, using platform encoding UTF-8, i.e. build is platform dependent!
[WARNING] Using platform encoding (UTF-8 actually) to copy filtered resources, i.e. build is platform dependent!
[INFO] Copying 2 resources
[WARNING] File encoding has not been set, using platform encoding UTF-8, i.e. build is platform dependent!
[WARNING] Using platform encoding (UTF-8 actually) to copy filtered resources, i.e. build is platform dependent!
[INFO] Copying 2 resources
Tests run: 12, Failures: 0, Errors: 0, Skipped: 0, Time elapsed: 0.819 sec
Running org.apache.maven.plugin.resources.BasicPropertyUtilsTest
Tests run: 5, Failures: 0, Errors: 0, Skipped: 0, Time elapsed: 0.258 sec
Running org.apache.maven.plugin.resources.EnhancedPropertyUtilsTest
Tests run: 3, Failures: 0, Errors: 0, Skipped: 0, Time elapsed: 0.131 sec

Results :

Tests run: 28, Failures: 0, Errors: 0, Skipped: 0

[HUDSON] Recording test results
[INFO] [jar:jar]
[INFO] Building jar: http://ci.sonatype.org/job/plugins-IT-with-maven-2.0.x/org.apache.maven.plugins$maven-resources-plugin/ws/target/maven-resources-plugin-2.4-SNAPSHOT.jar 
[INFO] [plugin:addPluginArtifactMetadata]
[INFO] [invoker:install {execution: integration-test}]
[INFO] Installing http://ci.sonatype.org/job/plugins-IT-with-maven-2.0.x/org.apache.maven.plugins$maven-resources-plugin/ws/pom.xml  to http://ci.sonatype.org/job/plugins-IT-with-maven-2.0.x/org.apache.maven.plugins$maven-resources-plugin/ws/target/local-repo/org/apache/maven/plugins/maven-resources-plugin/2.4-SNAPSHOT/maven-resources-plugin-2.4-SNAPSHOT.pom 
[INFO] Installing http://ci.sonatype.org/job/plugins-IT-with-maven-2.0.x/org.apache.maven.plugins$maven-resources-plugin/ws/target/maven-resources-plugin-2.4-SNAPSHOT.jar  to http://ci.sonatype.org/job/plugins-IT-with-maven-2.0.x/org.apache.maven.plugins$maven-resources-plugin/ws/target/local-repo/org/apache/maven/plugins/maven-resources-plugin/2.4-SNAPSHOT/maven-resources-plugin-2.4-SNAPSHOT.jar 
[INFO] [invoker:run {execution: integration-test}]
[INFO] Building: escapeInterpolation/pom.xml
[INFO] ...SUCCESS.
[INFO] Building: binaries-filtering/pom.xml
[INFO] ...SUCCESS.
[INFO] Building: copy-resources-it/pom.xml
[INFO] ...SUCCESS.
[INFO] Building: profile-override/pom.xml
[INFO] ...SUCCESS.
[INFO] Building: filter/pom.xml
[INFO] ...SUCCESS.
[INFO] Building: includeEmptyDirs/pom.xml
[INFO] ...FAILED[verify script returned false].
[INFO] Building: MRESOURCES-20/pom.xml
[INFO] ...SUCCESS.
[INFO] Building: MRESOURCES-18/pom.xml
[INFO] ...SUCCESS.
[INFO] Building: filter-test-resources/pom.xml
[INFO] ...SUCCESS.
[INFO] 

---------------------------------------
Execution Summary:
Builds Passing: 8
Builds Failing: 1
---------------------------------------

The following builds failed:

*  includeEmptyDirs/pom.xml

[HUDSON] Archiving http://ci.sonatype.org/job/plugins-IT-with-maven-2.0.x/org.apache.maven.plugins$maven-resources-plugin/ws/pom.xml  to /home/j2ee-hudson/.hudson/jobs/plugins-IT-with-maven-2.0.x/modules/org.apache.maven.plugins$maven-resources-plugin/builds/2008-11-14_00-08-09/archive/org.apache.maven.plugins/maven-resources-plugin/2.4-SNAPSHOT/pom.xml
[HUDSON] Archiving http://ci.sonatype.org/job/plugins-IT-with-maven-2.0.x/org.apache.maven.plugins$maven-resources-plugin/ws/target/maven-resources-plugin-2.4-SNAPSHOT.jar  to /home/j2ee-hudson/.hudson/jobs/plugins-IT-with-maven-2.0.x/modules/org.apache.maven.plugins$maven-resources-plugin/builds/2008-11-14_00-08-09/archive/org.apache.maven.plugins/maven-resources-plugin/2.4-SNAPSHOT/maven-resources-plugin-2.4-SNAPSHOT.jar


Hudson build is back to normal: plugins-IT-with-maven-2.0.x » Maven Resources Plugin #564

Posted by Hudson <Hu...@sonatype.org>.
See http://ci.sonatype.org/job/plugins-IT-with-maven-2.0.x/org.apache.maven.plugins$maven-resources-plugin/564/changes



Build failed in Hudson: plugins-IT-with-maven-2.0.x » Maven Resources Plugin #563

Posted by Hudson <Hu...@sonatype.org>.
See http://ci.sonatype.org/job/plugins-IT-with-maven-2.0.x/org.apache.maven.plugins$maven-resources-plugin/563/changes

------------------------------------------
[INFO] ------------------------------------------------------------------------
[INFO] Building Maven Resources Plugin
[INFO]    task-segment: [clean, deploy]
[INFO] ------------------------------------------------------------------------
[INFO] [clean:clean]
[INFO] Deleting directory http://ci.sonatype.org/job/plugins-IT-with-maven-2.0.x/org.apache.maven.plugins$maven-resources-plugin/ws/target 
[INFO] snapshot org.apache.maven.shared:maven-filtering:1.0-beta-3-SNAPSHOT: checking for updates from central
[INFO] snapshot org.apache.maven.shared:maven-filtering:1.0-beta-3-SNAPSHOT: checking for updates from codehaus.snapshot
[INFO] snapshot org.apache.maven.shared:maven-filtering:1.0-beta-3-SNAPSHOT: checking for updates from apache.snapshots
Downloading: http://localhost:8081/content/groups/public/org/apache/maven/shared/maven-filtering/1.0-beta-3-SNAPSHOT/maven-filtering-1.0-beta-3-20081116.023247-274.pom
4K downloaded
[INFO] snapshot org.codehaus.plexus:plexus-interpolation:1.7-SNAPSHOT: checking for updates from central
[INFO] snapshot org.codehaus.plexus:plexus-interpolation:1.7-SNAPSHOT: checking for updates from codehaus.snapshot
[INFO] snapshot org.codehaus.plexus:plexus-interpolation:1.7-SNAPSHOT: checking for updates from apache.snapshots
Downloading: http://localhost:8081/content/groups/public/org/codehaus/plexus/plexus-interpolation/1.7-SNAPSHOT/plexus-interpolation-1.7-20081115.221720-2.pom
Downloading: http://localhost:8081/content/groups/public/org/apache/maven/shared/maven-filtering/1.0-beta-3-SNAPSHOT/maven-filtering-1.0-beta-3-20081116.023247-274.jar
30K downloaded
Downloading: http://localhost:8081/content/groups/public/org/codehaus/plexus/plexus-interpolation/1.7-SNAPSHOT/plexus-interpolation-1.7-20081115.221720-2.jar
49K downloaded
[INFO] [enforcer:enforce {execution: ensure-no-container-api}]
[INFO] [plugin:helpmojo {execution: generated-helpmojo}]
[INFO] Using 2 extractors.
[INFO] Applying extractor for language: java
[INFO] Extractor for language: java found 3 mojo descriptors.
[INFO] Applying extractor for language: bsh
[INFO] Extractor for language: bsh found 0 mojo descriptors.
[INFO] [plugin:descriptor]
[INFO] Using 2 extractors.
[INFO] Applying extractor for language: java
[INFO] Extractor for language: java found 4 mojo descriptors.
[INFO] Applying extractor for language: bsh
[INFO] Extractor for language: bsh found 0 mojo descriptors.
[INFO] [remote-resources:process {execution: default}]
[INFO] [resources:resources]
[INFO] Using encoding: 'UTF-8' to copy filtered resources.
[INFO] [compiler:compile]
[INFO] Compiling 7 source files to http://ci.sonatype.org/job/plugins-IT-with-maven-2.0.x/org.apache.maven.plugins$maven-resources-plugin/ws/target/classes 
[INFO] [resources:testResources]
[INFO] Using encoding: 'UTF-8' to copy filtered resources.
[INFO] [compiler:testCompile]
[INFO] Compiling 11 source files to http://ci.sonatype.org/job/plugins-IT-with-maven-2.0.x/org.apache.maven.plugins$maven-resources-plugin/ws/target/test-classes 
[INFO] [surefire:test]
[INFO] Surefire report directory: http://ci.sonatype.org/job/plugins-IT-with-maven-2.0.x/org.apache.maven.plugins$maven-resources-plugin/ws/target/surefire-reports 

-------------------------------------------------------
 T E S T S
-------------------------------------------------------
Running org.apache.maven.plugin.resources.CopyResourcesMojoTest
[WARNING] Using platform encoding (UTF-8 actually) to copy filtered resources, i.e. build is platform dependent!
[INFO] Copying 1 resource
Tests run: 1, Failures: 0, Errors: 0, Skipped: 0, Time elapsed: 0.553 sec
Running org.apache.maven.plugin.resources.TestResourcesTest
[WARNING] Using platform encoding (UTF-8 actually) to copy filtered resources, i.e. build is platform dependent!
[INFO] Copying 5 resources
Tests run: 2, Failures: 0, Errors: 0, Skipped: 0, Time elapsed: 0.21 sec
Running org.apache.maven.plugin.resources.AdvancePropertyUtilsTest
Tests run: 3, Failures: 0, Errors: 0, Skipped: 0, Time elapsed: 0.155 sec
Running org.apache.maven.plugin.resources.ReflectionPropertiesTest
Tests run: 2, Failures: 0, Errors: 0, Skipped: 0, Time elapsed: 0.14 sec
Running org.apache.maven.plugin.resources.ResourcesMojoTest
[WARNING] Using platform encoding (UTF-8 actually) to copy filtered resources, i.e. build is platform dependent!
[INFO] Copying 5 resources
[WARNING] Using platform encoding (UTF-8 actually) to copy filtered resources, i.e. build is platform dependent!
[INFO] Copying 5 resources
[INFO] Using 'UTF-8' encoding to copy filtered resources.
[INFO] Copying 1 resource
[WARNING] Using platform encoding (UTF-8 actually) to copy filtered resources, i.e. build is platform dependent!
[INFO] Copying 4 resources
[WARNING] Using platform encoding (UTF-8 actually) to copy filtered resources, i.e. build is platform dependent!
[INFO] Copying 8 resources
[WARNING] Using platform encoding (UTF-8 actually) to copy filtered resources, i.e. build is platform dependent!
[INFO] Copying 5 resources to org/apache/maven/plugin/test
[WARNING] File encoding has not been set, using platform encoding UTF-8, i.e. build is platform dependent!
[WARNING] Using platform encoding (UTF-8 actually) to copy filtered resources, i.e. build is platform dependent!
[INFO] Copying 1 resource
[WARNING] File encoding has not been set, using platform encoding UTF-8, i.e. build is platform dependent!
[WARNING] Using platform encoding (UTF-8 actually) to copy filtered resources, i.e. build is platform dependent!
[INFO] Copying 1 resource
[WARNING] File encoding has not been set, using platform encoding UTF-8, i.e. build is platform dependent!
[WARNING] Using platform encoding (UTF-8 actually) to copy filtered resources, i.e. build is platform dependent!
[INFO] Copying 1 resource
[WARNING] File encoding has not been set, using platform encoding UTF-8, i.e. build is platform dependent!
[WARNING] Using platform encoding (UTF-8 actually) to copy filtered resources, i.e. build is platform dependent!
[INFO] Copying 2 resources
[WARNING] File encoding has not been set, using platform encoding UTF-8, i.e. build is platform dependent!
[WARNING] Using platform encoding (UTF-8 actually) to copy filtered resources, i.e. build is platform dependent!
[INFO] Copying 2 resources
Tests run: 12, Failures: 0, Errors: 0, Skipped: 0, Time elapsed: 0.744 sec
Running org.apache.maven.plugin.resources.BasicPropertyUtilsTest
Tests run: 5, Failures: 0, Errors: 0, Skipped: 0, Time elapsed: 0.26 sec
Running org.apache.maven.plugin.resources.EnhancedPropertyUtilsTest
Tests run: 3, Failures: 0, Errors: 0, Skipped: 0, Time elapsed: 0.137 sec

Results :

Tests run: 28, Failures: 0, Errors: 0, Skipped: 0

[HUDSON] Recording test results
[INFO] [jar:jar]
[INFO] Building jar: http://ci.sonatype.org/job/plugins-IT-with-maven-2.0.x/org.apache.maven.plugins$maven-resources-plugin/ws/target/maven-resources-plugin-2.4-SNAPSHOT.jar 
[INFO] [plugin:addPluginArtifactMetadata]
[INFO] [invoker:install {execution: integration-test}]
[INFO] Installing http://ci.sonatype.org/job/plugins-IT-with-maven-2.0.x/org.apache.maven.plugins$maven-resources-plugin/ws/pom.xml  to http://ci.sonatype.org/job/plugins-IT-with-maven-2.0.x/org.apache.maven.plugins$maven-resources-plugin/ws/target/local-repo/org/apache/maven/plugins/maven-resources-plugin/2.4-SNAPSHOT/maven-resources-plugin-2.4-SNAPSHOT.pom 
[INFO] Installing http://ci.sonatype.org/job/plugins-IT-with-maven-2.0.x/org.apache.maven.plugins$maven-resources-plugin/ws/target/maven-resources-plugin-2.4-SNAPSHOT.jar  to http://ci.sonatype.org/job/plugins-IT-with-maven-2.0.x/org.apache.maven.plugins$maven-resources-plugin/ws/target/local-repo/org/apache/maven/plugins/maven-resources-plugin/2.4-SNAPSHOT/maven-resources-plugin-2.4-SNAPSHOT.jar 
[INFO] [invoker:run {execution: integration-test}]
[INFO] Building: escapeInterpolation/pom.xml
[INFO] ...SUCCESS.
[INFO] Building: binaries-filtering/pom.xml
[INFO] ...SUCCESS.
[INFO] Building: copy-resources-it/pom.xml
[INFO] ...SUCCESS.
[INFO] Building: MRESOURCES-78/pom.xml
[INFO] ...SUCCESS.
[INFO] Building: profile-override/pom.xml
[INFO] ...SUCCESS.
[INFO] Building: filter/pom.xml
[INFO] ...SUCCESS.
[INFO] Building: includeEmptyDirs/pom.xml
[INFO] ...FAILED[verify script returned false].
[INFO] Building: MRESOURCES-20/pom.xml
[INFO] ...SUCCESS.
[INFO] Building: MRESOURCES-18/pom.xml
[INFO] ...SUCCESS.
[INFO] Building: filter-test-resources/pom.xml
[INFO] ...SUCCESS.
[INFO] 

---------------------------------------
Execution Summary:
Builds Passing: 9
Builds Failing: 1
---------------------------------------

The following builds failed:

*  includeEmptyDirs/pom.xml

[HUDSON] Archiving http://ci.sonatype.org/job/plugins-IT-with-maven-2.0.x/org.apache.maven.plugins$maven-resources-plugin/ws/pom.xml  to /home/j2ee-hudson/.hudson/jobs/plugins-IT-with-maven-2.0.x/modules/org.apache.maven.plugins$maven-resources-plugin/builds/2008-11-16_00-11-47/archive/org.apache.maven.plugins/maven-resources-plugin/2.4-SNAPSHOT/pom.xml
[HUDSON] Archiving http://ci.sonatype.org/job/plugins-IT-with-maven-2.0.x/org.apache.maven.plugins$maven-resources-plugin/ws/target/maven-resources-plugin-2.4-SNAPSHOT.jar  to /home/j2ee-hudson/.hudson/jobs/plugins-IT-with-maven-2.0.x/modules/org.apache.maven.plugins$maven-resources-plugin/builds/2008-11-16_00-11-47/archive/org.apache.maven.plugins/maven-resources-plugin/2.4-SNAPSHOT/maven-resources-plugin-2.4-SNAPSHOT.jar


Build failed in Hudson: plugins-IT-with-maven-2.0.x » Maven Resources Plugin #562

Posted by Hudson <Hu...@sonatype.org>.
See http://ci.sonatype.org/job/plugins-IT-with-maven-2.0.x/org.apache.maven.plugins$maven-resources-plugin/562/changes

------------------------------------------
[INFO] ------------------------------------------------------------------------
[INFO] Building Maven Resources Plugin
[INFO]    task-segment: [clean, deploy]
[INFO] ------------------------------------------------------------------------
[INFO] [clean:clean]
[INFO] Deleting directory http://ci.sonatype.org/job/plugins-IT-with-maven-2.0.x/org.apache.maven.plugins$maven-resources-plugin/ws/target 
Downloading: http://localhost:8081/content/groups/public/org/apache/maven/shared/maven-filtering/1.0-beta-2/maven-filtering-1.0-beta-2.pom
3K downloaded
Downloading: http://localhost:8081/content/groups/public/org/apache/maven/shared/maven-filtering/1.0-beta-2/maven-filtering-1.0-beta-2.jar
32K downloaded
[INFO] [enforcer:enforce {execution: ensure-no-container-api}]
[INFO] [plugin:helpmojo {execution: generated-helpmojo}]
[INFO] Using 2 extractors.
[INFO] Applying extractor for language: java
[INFO] Extractor for language: java found 3 mojo descriptors.
[INFO] Applying extractor for language: bsh
[INFO] Extractor for language: bsh found 0 mojo descriptors.
[INFO] [plugin:descriptor]
[INFO] Using 2 extractors.
[INFO] Applying extractor for language: java
[INFO] Extractor for language: java found 4 mojo descriptors.
[INFO] Applying extractor for language: bsh
[INFO] Extractor for language: bsh found 0 mojo descriptors.
[INFO] [remote-resources:process {execution: default}]
[INFO] [resources:resources]
[INFO] Using encoding: 'UTF-8' to copy filtered resources.
[INFO] [compiler:compile]
[INFO] Compiling 7 source files to http://ci.sonatype.org/job/plugins-IT-with-maven-2.0.x/org.apache.maven.plugins$maven-resources-plugin/ws/target/classes 
[INFO] [resources:testResources]
[INFO] Using encoding: 'UTF-8' to copy filtered resources.
[INFO] [compiler:testCompile]
[INFO] Compiling 11 source files to http://ci.sonatype.org/job/plugins-IT-with-maven-2.0.x/org.apache.maven.plugins$maven-resources-plugin/ws/target/test-classes 
[INFO] [surefire:test]
[INFO] Surefire report directory: http://ci.sonatype.org/job/plugins-IT-with-maven-2.0.x/org.apache.maven.plugins$maven-resources-plugin/ws/target/surefire-reports 

-------------------------------------------------------
 T E S T S
-------------------------------------------------------
Running org.apache.maven.plugin.resources.CopyResourcesMojoTest
[WARNING] Using platform encoding (UTF-8 actually) to copy filtered resources, i.e. build is platform dependent!
[INFO] Copying 1 resource
Tests run: 1, Failures: 0, Errors: 0, Skipped: 0, Time elapsed: 0.631 sec
Running org.apache.maven.plugin.resources.TestResourcesTest
[WARNING] Using platform encoding (UTF-8 actually) to copy filtered resources, i.e. build is platform dependent!
[INFO] Copying 5 resources
Tests run: 2, Failures: 0, Errors: 0, Skipped: 0, Time elapsed: 0.187 sec
Running org.apache.maven.plugin.resources.AdvancePropertyUtilsTest
Tests run: 3, Failures: 0, Errors: 0, Skipped: 0, Time elapsed: 0.161 sec
Running org.apache.maven.plugin.resources.ReflectionPropertiesTest
Tests run: 2, Failures: 0, Errors: 0, Skipped: 0, Time elapsed: 0.144 sec
Running org.apache.maven.plugin.resources.ResourcesMojoTest
[WARNING] Using platform encoding (UTF-8 actually) to copy filtered resources, i.e. build is platform dependent!
[INFO] Copying 5 resources
[WARNING] Using platform encoding (UTF-8 actually) to copy filtered resources, i.e. build is platform dependent!
[INFO] Copying 5 resources
[INFO] Using 'UTF-8' encoding to copy filtered resources.
[INFO] Copying 1 resource
[WARNING] Using platform encoding (UTF-8 actually) to copy filtered resources, i.e. build is platform dependent!
[INFO] Copying 4 resources
[WARNING] Using platform encoding (UTF-8 actually) to copy filtered resources, i.e. build is platform dependent!
[INFO] Copying 8 resources
[WARNING] Using platform encoding (UTF-8 actually) to copy filtered resources, i.e. build is platform dependent!
[INFO] Copying 5 resources to org/apache/maven/plugin/test
[WARNING] File encoding has not been set, using platform encoding UTF-8, i.e. build is platform dependent!
[WARNING] Using platform encoding (UTF-8 actually) to copy filtered resources, i.e. build is platform dependent!
[INFO] Copying 1 resource
[WARNING] File encoding has not been set, using platform encoding UTF-8, i.e. build is platform dependent!
[WARNING] Using platform encoding (UTF-8 actually) to copy filtered resources, i.e. build is platform dependent!
[INFO] Copying 1 resource
[WARNING] File encoding has not been set, using platform encoding UTF-8, i.e. build is platform dependent!
[WARNING] Using platform encoding (UTF-8 actually) to copy filtered resources, i.e. build is platform dependent!
[INFO] Copying 1 resource
[WARNING] File encoding has not been set, using platform encoding UTF-8, i.e. build is platform dependent!
[WARNING] Using platform encoding (UTF-8 actually) to copy filtered resources, i.e. build is platform dependent!
[INFO] Copying 2 resources
[WARNING] File encoding has not been set, using platform encoding UTF-8, i.e. build is platform dependent!
[WARNING] Using platform encoding (UTF-8 actually) to copy filtered resources, i.e. build is platform dependent!
[INFO] Copying 2 resources
Tests run: 12, Failures: 0, Errors: 0, Skipped: 0, Time elapsed: 0.716 sec
Running org.apache.maven.plugin.resources.BasicPropertyUtilsTest
Tests run: 5, Failures: 0, Errors: 0, Skipped: 0, Time elapsed: 0.236 sec
Running org.apache.maven.plugin.resources.EnhancedPropertyUtilsTest
Tests run: 3, Failures: 0, Errors: 0, Skipped: 0, Time elapsed: 0.136 sec

Results :

Tests run: 28, Failures: 0, Errors: 0, Skipped: 0

[HUDSON] Recording test results
[INFO] [jar:jar]
[INFO] Building jar: http://ci.sonatype.org/job/plugins-IT-with-maven-2.0.x/org.apache.maven.plugins$maven-resources-plugin/ws/target/maven-resources-plugin-2.4-SNAPSHOT.jar 
[INFO] [plugin:addPluginArtifactMetadata]
[INFO] [invoker:install {execution: integration-test}]
[INFO] Installing http://ci.sonatype.org/job/plugins-IT-with-maven-2.0.x/org.apache.maven.plugins$maven-resources-plugin/ws/pom.xml  to http://ci.sonatype.org/job/plugins-IT-with-maven-2.0.x/org.apache.maven.plugins$maven-resources-plugin/ws/target/local-repo/org/apache/maven/plugins/maven-resources-plugin/2.4-SNAPSHOT/maven-resources-plugin-2.4-SNAPSHOT.pom 
[INFO] Installing http://ci.sonatype.org/job/plugins-IT-with-maven-2.0.x/org.apache.maven.plugins$maven-resources-plugin/ws/target/maven-resources-plugin-2.4-SNAPSHOT.jar  to http://ci.sonatype.org/job/plugins-IT-with-maven-2.0.x/org.apache.maven.plugins$maven-resources-plugin/ws/target/local-repo/org/apache/maven/plugins/maven-resources-plugin/2.4-SNAPSHOT/maven-resources-plugin-2.4-SNAPSHOT.jar 
[INFO] [invoker:run {execution: integration-test}]
[INFO] Building: escapeInterpolation/pom.xml
[INFO] ...SUCCESS.
[INFO] Building: binaries-filtering/pom.xml
[INFO] ...SUCCESS.
[INFO] Building: copy-resources-it/pom.xml
[INFO] ...SUCCESS.
[INFO] Building: profile-override/pom.xml
[INFO] ...SUCCESS.
[INFO] Building: filter/pom.xml
[INFO] ...SUCCESS.
[INFO] Building: includeEmptyDirs/pom.xml
[INFO] ...FAILED[verify script returned false].
[INFO] Building: MRESOURCES-20/pom.xml
[INFO] ...SUCCESS.
[INFO] Building: MRESOURCES-18/pom.xml
[INFO] ...SUCCESS.
[INFO] Building: filter-test-resources/pom.xml
[INFO] ...SUCCESS.
[INFO] 

---------------------------------------
Execution Summary:
Builds Passing: 8
Builds Failing: 1
---------------------------------------

The following builds failed:

*  includeEmptyDirs/pom.xml

[HUDSON] Archiving http://ci.sonatype.org/job/plugins-IT-with-maven-2.0.x/org.apache.maven.plugins$maven-resources-plugin/ws/pom.xml  to /home/j2ee-hudson/.hudson/jobs/plugins-IT-with-maven-2.0.x/modules/org.apache.maven.plugins$maven-resources-plugin/builds/2008-11-15_00-10-15/archive/org.apache.maven.plugins/maven-resources-plugin/2.4-SNAPSHOT/pom.xml
[HUDSON] Archiving http://ci.sonatype.org/job/plugins-IT-with-maven-2.0.x/org.apache.maven.plugins$maven-resources-plugin/ws/target/maven-resources-plugin-2.4-SNAPSHOT.jar  to /home/j2ee-hudson/.hudson/jobs/plugins-IT-with-maven-2.0.x/modules/org.apache.maven.plugins$maven-resources-plugin/builds/2008-11-15_00-10-15/archive/org.apache.maven.plugins/maven-resources-plugin/2.4-SNAPSHOT/maven-resources-plugin-2.4-SNAPSHOT.jar