You are viewing a plain text version of this content. The canonical link for it is here.
Posted to notifications@maven.apache.org by Hudson <Hu...@sonatype.org> on 2008/11/08 07:49:52 UTC
Build failed in Hudson: plugins-IT-with-maven-2.0.x » Maven JAR Plugin #559
See http://ci.sonatype.org/job/plugins-IT-with-maven-2.0.x/org.apache.maven.plugins$maven-jar-plugin/559/changes
------------------------------------------
[INFO] ------------------------------------------------------------------------
[INFO] Building Maven JAR Plugin
[INFO] task-segment: [clean, deploy]
[INFO] ------------------------------------------------------------------------
[INFO] [clean:clean]
[INFO] Deleting directory http://ci.sonatype.org/job/plugins-IT-with-maven-2.0.x/org.apache.maven.plugins$maven-jar-plugin/ws/target
Downloading: http://localhost:8081/content/groups/public/org/apache/maven/maven-project/2.0.7/maven-project-2.0.7.jar
113K downloaded
Downloading: http://localhost:8081/content/groups/public/org/apache/maven/maven-settings/2.0.7/maven-settings-2.0.7.jar
47K downloaded
Downloading: http://localhost:8081/content/groups/public/org/apache/maven/maven-model/2.0.7/maven-model-2.0.7.jar
84K downloaded
Downloading: http://localhost:8081/content/groups/public/org/apache/maven/maven-profile/2.0.7/maven-profile-2.0.7.jar
34K downloaded
Downloading: http://localhost:8081/content/groups/public/org/apache/maven/maven-artifact-manager/2.0.7/maven-artifact-manager-2.0.7.jar
55K downloaded
Downloading: http://localhost:8081/content/groups/public/org/apache/maven/maven-repository-metadata/2.0.7/maven-repository-metadata-2.0.7.jar
23K downloaded
Downloading: http://localhost:8081/content/groups/public/org/apache/maven/maven-artifact/2.0.7/maven-artifact-2.0.7.jar
85K downloaded
Downloading: http://localhost:8081/content/groups/public/org/apache/maven/maven-plugin-registry/2.0.7/maven-plugin-registry-2.0.7.jar
28K downloaded
Downloading: http://localhost:8081/content/groups/public/org/codehaus/plexus/plexus-interpolation/1.5/plexus-interpolation-1.5.jar
40K downloaded
[INFO] [enforcer:enforce {execution: ensure-no-container-api}]
[INFO] [plugin:helpmojo {execution: generated-helpmojo}]
[INFO] Using 2 extractors.
[INFO] Applying extractor for language: java
[INFO] Extractor for language: java found 4 mojo descriptors.
[INFO] Applying extractor for language: bsh
[INFO] Extractor for language: bsh found 0 mojo descriptors.
[INFO] [plugin:descriptor]
[INFO] Using 2 extractors.
[INFO] Applying extractor for language: java
[INFO] Extractor for language: java found 5 mojo descriptors.
[INFO] Applying extractor for language: bsh
[INFO] Extractor for language: bsh found 0 mojo descriptors.
[INFO] [remote-resources:process {execution: default}]
[INFO] [resources:resources]
[INFO] Using encoding: 'UTF-8' to copy filtered resources.
[INFO] [compiler:compile]
[INFO] Compiling 6 source files to http://ci.sonatype.org/job/plugins-IT-with-maven-2.0.x/org.apache.maven.plugins$maven-jar-plugin/ws/target/classes
[INFO] [resources:testResources]
[INFO] Using encoding: 'UTF-8' to copy filtered resources.
[INFO] [compiler:testCompile]
[INFO] Compiling 4 source files to http://ci.sonatype.org/job/plugins-IT-with-maven-2.0.x/org.apache.maven.plugins$maven-jar-plugin/ws/target/test-classes
[INFO] [surefire:test]
[INFO] Surefire report directory: http://ci.sonatype.org/job/plugins-IT-with-maven-2.0.x/org.apache.maven.plugins$maven-jar-plugin/ws/target/surefire-reports
-------------------------------------------------------
T E S T S
-------------------------------------------------------
Running org.apache.maven.plugin.jar.JarSignVerifyMojoTest
[debug] jarsigner executable=[/opt/java/sdk/Sun/jdk1.5.0_12/jre/../bin/jarsigner]
[debug] Executing: /bin/sh -c "cd /tmp && /opt/java/sdk/Sun/jdk1.5.0_12/jre/../bin/jarsigner -verify /tmp/signed/file-version.jar"
[info] jar verified.
[debug] jarsigner executable=[/opt/java/sdk/Sun/jdk1.5.0_12/jre/../bin/jarsigner]
[debug] Executing: /bin/sh -c "cd /tmp && /opt/java/sdk/Sun/jdk1.5.0_12/jre/../bin/jarsigner -verify -verbose -certs /tmp/signed/file-version.jar"
[info] jar verified.
[debug] jarsigner executable=[/opt/java/sdk/Sun/jdk1.5.0_12/jre/../bin/jarsigner]
[debug] Executing: /bin/sh -c "cd /tmp && /opt/java/sdk/Sun/jdk1.5.0_12/jre/../bin/jarsigner -verify /tmp/signed/file-version.jar"
[debug] jarsigner executable=[/opt/java/sdk/Sun/jdk1.5.0_12/jre/../bin/jarsigner]
[debug] Executing: /bin/sh -c "cd /tmp && /opt/java/sdk/Sun/jdk1.5.0_12/jre/../bin/jarsigner -verify /tmp/signed/file-version.jar"
[info] jar is unsigned.
[debug] jarsigner executable=[/opt/java/sdk/Sun/jdk1.5.0_12/jre/../bin/jarsigner]
[debug] Executing: /bin/sh -c "cd /tmp && /opt/java/sdk/Sun/jdk1.5.0_12/jre/../bin/jarsigner -verify /tmp/signed/file-version.jar"
Tests run: 6, Failures: 0, Errors: 0, Skipped: 0, Time elapsed: 0.07 sec
Running org.apache.maven.plugin.jar.JarSignMojoTest
[debug] jarsigner executable=[/opt/java/sdk/Sun/jdk1.5.0_12/jre/../bin/jarsigner]
[debug] mdkirs: false /tmp
[debug] jarsigner executable=[/opt/java/sdk/Sun/jdk1.5.0_12/jre/../bin/jarsigner]
[debug] mdkirs: false /tmp
[debug] jarsigner executable=[/opt/java/sdk/Sun/jdk1.5.0_12/jre/../bin/jarsigner]
[debug] mdkirs: false /tmp
[debug] jarsigner executable=[/opt/java/sdk/Sun/jdk1.5.0_12/jre/../bin/jarsigner]
[debug] Executing: /bin/sh -c "cd /tmp && /opt/java/sdk/Sun/jdk1.5.0_12/jre/../bin/jarsigner -verify /tmp/signed.jar"
[info] jar verified.
[debug] jarsigner executable=[/opt/java/sdk/Sun/jdk1.5.0_12/jre/../bin/jarsigner]
[debug] Signing JAR in-place (overwritting original JAR).
[debug] jarsigner executable=[/opt/java/sdk/Sun/jdk1.5.0_12/jre/../bin/jarsigner]
[debug] Executing: /bin/sh -c "cd /tmp && /opt/java/sdk/Sun/jdk1.5.0_12/jre/../bin/jarsigner -verify /tmp/null.jar"
[info] jar verified.
[debug] jarsigner executable=[/opt/java/sdk/Sun/jdk1.5.0_12/jre/../bin/jarsigner]
[debug] mdkirs: false /tmp
[info] JAR /tmp/signed.jar is already signed. Skipping.
[debug] jarsigner executable=[/opt/java/sdk/Sun/jdk1.5.0_12/jre/../bin/jarsigner]
[debug] mdkirs: false /tmp
Tests run: 6, Failures: 0, Errors: 0, Skipped: 0, Time elapsed: 0.042 sec
Running org.apache.maven.plugin.jar.JarMojoTest
Tests run: 1, Failures: 0, Errors: 0, Skipped: 0, Time elapsed: 0.478 sec
Results :
Tests run: 13, Failures: 0, Errors: 0, Skipped: 0
[HUDSON] Recording test results
[INFO] [jar:jar]
[INFO] Building jar: http://ci.sonatype.org/job/plugins-IT-with-maven-2.0.x/org.apache.maven.plugins$maven-jar-plugin/ws/target/maven-jar-plugin-2.3-SNAPSHOT.jar
[INFO] [plugin:addPluginArtifactMetadata]
[INFO] [invoker:install {execution: integration-test}]
[INFO] Installing http://ci.sonatype.org/job/plugins-IT-with-maven-2.0.x/org.apache.maven.plugins$maven-jar-plugin/ws/pom.xml to http://ci.sonatype.org/job/plugins-IT-with-maven-2.0.x/org.apache.maven.plugins$maven-jar-plugin/ws/target/local-repo/org/apache/maven/plugins/maven-jar-plugin/2.3-SNAPSHOT/maven-jar-plugin-2.3-SNAPSHOT.pom
[INFO] Installing http://ci.sonatype.org/job/plugins-IT-with-maven-2.0.x/org.apache.maven.plugins$maven-jar-plugin/ws/target/maven-jar-plugin-2.3-SNAPSHOT.jar to http://ci.sonatype.org/job/plugins-IT-with-maven-2.0.x/org.apache.maven.plugins$maven-jar-plugin/ws/target/local-repo/org/apache/maven/plugins/maven-jar-plugin/2.3-SNAPSHOT/maven-jar-plugin-2.3-SNAPSHOT.jar
[INFO] [invoker:run {execution: integration-test}]
[INFO] Building: MJAR-80-fullcontent/pom.xml
[INFO] ...SUCCESS.
[INFO] Building: MJAR-70-recreation/pom.xml
[INFO] ...FAILED[verify script returned false].
[INFO] Building: MJAR-30-excludes/pom.xml
[INFO] ...SUCCESS.
[INFO] Building: mjar-90/pom.xml
[INFO] ...SUCCESS.
[INFO] Building: MJAR-75/pom.xml
[INFO] ...FAILED[code=1]. See http://ci.sonatype.org/job/plugins-IT-with-maven-2.0.x/org.apache.maven.plugins$maven-jar-plugin/ws/target/it/MJAR-75/build.log for details.
[INFO] Building: MJAR-60/pom.xml
[INFO] ...SUCCESS.
[INFO] Building: MJAR-30-fullcontent/pom.xml
[INFO] ...SUCCESS.
[INFO] Building: MJAR-30-include/pom.xml
[INFO] ...SUCCESS.
[INFO] Building: manifest-content/pom.xml
[INFO] ...SUCCESS.
[INFO] Building: project-004/pom.xml
[INFO] ...SUCCESS.
[INFO] Building: MJAR-80-include/pom.xml
[INFO] ...SUCCESS.
[INFO] Building: mjar-71-02/pom.xml
[INFO] ...SUCCESS.
[INFO] Building: MJAR-70-no-recreation/pom.xml
[INFO] ...FAILED[verify script returned false].
[INFO] Building: MJAR-82/pom.xml
[INFO] ...SUCCESS.
[INFO] Building: mjar-71-01/pom.xml
[INFO] ...SUCCESS.
[INFO] Building: MJAR-80-exclude/pom.xml
[INFO] ...SUCCESS.
[INFO]
---------------------------------------
Execution Summary:
Builds Passing: 13
Builds Failing: 3
---------------------------------------
The following builds failed:
* MJAR-70-recreation/pom.xml
* MJAR-75/pom.xml
* MJAR-70-no-recreation/pom.xml
[HUDSON] Archiving http://ci.sonatype.org/job/plugins-IT-with-maven-2.0.x/org.apache.maven.plugins$maven-jar-plugin/ws/pom.xml to /home/j2ee-hudson/.hudson/jobs/plugins-IT-with-maven-2.0.x/modules/org.apache.maven.plugins$maven-jar-plugin/builds/2008-11-08_00-07-41/archive/org.apache.maven.plugins/maven-jar-plugin/2.3-SNAPSHOT/pom.xml
[HUDSON] Archiving http://ci.sonatype.org/job/plugins-IT-with-maven-2.0.x/org.apache.maven.plugins$maven-jar-plugin/ws/target/maven-jar-plugin-2.3-SNAPSHOT.jar to /home/j2ee-hudson/.hudson/jobs/plugins-IT-with-maven-2.0.x/modules/org.apache.maven.plugins$maven-jar-plugin/builds/2008-11-08_00-07-41/archive/org.apache.maven.plugins/maven-jar-plugin/2.3-SNAPSHOT/maven-jar-plugin-2.3-SNAPSHOT.jar
Hudson build is back to normal: plugins-IT-with-maven-2.0.x » Maven JAR Plugin #581
Posted by Hudson <Hu...@sonatype.org>.
See http://ci.sonatype.org/job/plugins-IT-with-maven-2.0.x/org.apache.maven.plugins$maven-jar-plugin/581/changes
Build failed in Hudson: plugins-IT-with-maven-2.0.x » Maven JAR Plugin #580
Posted by Hudson <Hu...@sonatype.org>.
See http://ci.sonatype.org/job/plugins-IT-with-maven-2.0.x/org.apache.maven.plugins$maven-jar-plugin/580/changes
------------------------------------------
[INFO] ------------------------------------------------------------------------
[INFO] Building Maven JAR Plugin
[INFO] task-segment: [clean, deploy]
[INFO] ------------------------------------------------------------------------
[INFO] [clean:clean]
[INFO] Deleting directory http://ci.sonatype.org/job/plugins-IT-with-maven-2.0.x/org.apache.maven.plugins$maven-jar-plugin/ws/target
[INFO] snapshot org.apache.maven:maven-archiver:2.4-SNAPSHOT: checking for updates from central
[INFO] snapshot org.apache.maven:maven-archiver:2.4-SNAPSHOT: checking for updates from apache.snapshots
Downloading: http://localhost:8081/content/groups/public/org/apache/maven/maven-archiver/2.4-SNAPSHOT/maven-archiver-2.4-20081214.225330-858.pom
3K downloaded
Downloading: http://localhost:8081/content/groups/public/org/codehaus/plexus/plexus-interpolation/1.5/plexus-interpolation-1.5.pom
2K downloaded
Downloading: http://localhost:8081/content/groups/public/org/apache/maven/maven-project/2.0.7/maven-project-2.0.7.jar
113K downloaded
Downloading: http://localhost:8081/content/groups/public/org/apache/maven/maven-settings/2.0.7/maven-settings-2.0.7.jar
47K downloaded
Downloading: http://localhost:8081/content/groups/public/org/apache/maven/maven-model/2.0.7/maven-model-2.0.7.jar
84K downloaded
Downloading: http://localhost:8081/content/groups/public/org/apache/maven/maven-profile/2.0.7/maven-profile-2.0.7.jar
34K downloaded
Downloading: http://localhost:8081/content/groups/public/org/apache/maven/maven-artifact-manager/2.0.7/maven-artifact-manager-2.0.7.jar
55K downloaded
Downloading: http://localhost:8081/content/groups/public/org/apache/maven/maven-repository-metadata/2.0.7/maven-repository-metadata-2.0.7.jar
23K downloaded
Downloading: http://localhost:8081/content/groups/public/org/apache/maven/maven-artifact/2.0.7/maven-artifact-2.0.7.jar
85K downloaded
Downloading: http://localhost:8081/content/groups/public/org/apache/maven/maven-plugin-registry/2.0.7/maven-plugin-registry-2.0.7.jar
28K downloaded
Downloading: http://localhost:8081/content/groups/public/org/apache/maven/maven-archiver/2.4-SNAPSHOT/maven-archiver-2.4-20081214.225330-858.jar
19K downloaded
Downloading: http://localhost:8081/content/groups/public/org/codehaus/plexus/plexus-interpolation/1.5/plexus-interpolation-1.5.jar
40K downloaded
[INFO] [enforcer:enforce {execution: ensure-no-container-api}]
[INFO] [plugin:helpmojo {execution: generated-helpmojo}]
[INFO] Using 2 extractors.
[INFO] Applying extractor for language: java
[INFO] Extractor for language: java found 4 mojo descriptors.
[INFO] Applying extractor for language: bsh
[INFO] Extractor for language: bsh found 0 mojo descriptors.
[INFO] [plugin:descriptor]
[INFO] Using 2 extractors.
[INFO] Applying extractor for language: java
[INFO] Extractor for language: java found 5 mojo descriptors.
[INFO] Applying extractor for language: bsh
[INFO] Extractor for language: bsh found 0 mojo descriptors.
[INFO] [remote-resources:process {execution: default}]
[INFO] [resources:resources]
[INFO] Using encoding: 'UTF-8' to copy filtered resources.
[INFO] [compiler:compile]
[INFO] Compiling 6 source files to http://ci.sonatype.org/job/plugins-IT-with-maven-2.0.x/org.apache.maven.plugins$maven-jar-plugin/ws/target/classes
[INFO] [resources:testResources]
[INFO] Using encoding: 'UTF-8' to copy filtered resources.
[INFO] [compiler:testCompile]
[INFO] Compiling 4 source files to http://ci.sonatype.org/job/plugins-IT-with-maven-2.0.x/org.apache.maven.plugins$maven-jar-plugin/ws/target/test-classes
[INFO] [surefire:test]
[INFO] Surefire report directory: http://ci.sonatype.org/job/plugins-IT-with-maven-2.0.x/org.apache.maven.plugins$maven-jar-plugin/ws/target/surefire-reports
-------------------------------------------------------
T E S T S
-------------------------------------------------------
Running org.apache.maven.plugin.jar.JarSignVerifyMojoTest
[debug] jarsigner executable=[/opt/java/sdk/Sun/jdk1.5.0_12/jre/../bin/jarsigner]
[debug] Executing: /bin/sh -c "cd /tmp && /opt/java/sdk/Sun/jdk1.5.0_12/jre/../bin/jarsigner -verify /tmp/signed/file-version.jar"
[info] jar verified.
[debug] jarsigner executable=[/opt/java/sdk/Sun/jdk1.5.0_12/jre/../bin/jarsigner]
[debug] Executing: /bin/sh -c "cd /tmp && /opt/java/sdk/Sun/jdk1.5.0_12/jre/../bin/jarsigner -verify -verbose -certs /tmp/signed/file-version.jar"
[info] jar verified.
[debug] jarsigner executable=[/opt/java/sdk/Sun/jdk1.5.0_12/jre/../bin/jarsigner]
[debug] Executing: /bin/sh -c "cd /tmp && /opt/java/sdk/Sun/jdk1.5.0_12/jre/../bin/jarsigner -verify /tmp/signed/file-version.jar"
[debug] jarsigner executable=[/opt/java/sdk/Sun/jdk1.5.0_12/jre/../bin/jarsigner]
[debug] Executing: /bin/sh -c "cd /tmp && /opt/java/sdk/Sun/jdk1.5.0_12/jre/../bin/jarsigner -verify /tmp/signed/file-version.jar"
[info] jar is unsigned.
[debug] jarsigner executable=[/opt/java/sdk/Sun/jdk1.5.0_12/jre/../bin/jarsigner]
[debug] Executing: /bin/sh -c "cd /tmp && /opt/java/sdk/Sun/jdk1.5.0_12/jre/../bin/jarsigner -verify /tmp/signed/file-version.jar"
Tests run: 6, Failures: 0, Errors: 0, Skipped: 0, Time elapsed: 0.069 sec
Running org.apache.maven.plugin.jar.JarSignMojoTest
[debug] jarsigner executable=[/opt/java/sdk/Sun/jdk1.5.0_12/jre/../bin/jarsigner]
[debug] mdkirs: false /tmp
[debug] jarsigner executable=[/opt/java/sdk/Sun/jdk1.5.0_12/jre/../bin/jarsigner]
[debug] mdkirs: false /tmp
[debug] jarsigner executable=[/opt/java/sdk/Sun/jdk1.5.0_12/jre/../bin/jarsigner]
[debug] mdkirs: false /tmp
[debug] jarsigner executable=[/opt/java/sdk/Sun/jdk1.5.0_12/jre/../bin/jarsigner]
[debug] Executing: /bin/sh -c "cd /tmp && /opt/java/sdk/Sun/jdk1.5.0_12/jre/../bin/jarsigner -verify /tmp/signed.jar"
[info] jar verified.
[debug] jarsigner executable=[/opt/java/sdk/Sun/jdk1.5.0_12/jre/../bin/jarsigner]
[debug] Signing JAR in-place (overwritting original JAR).
[debug] jarsigner executable=[/opt/java/sdk/Sun/jdk1.5.0_12/jre/../bin/jarsigner]
[debug] Executing: /bin/sh -c "cd /tmp && /opt/java/sdk/Sun/jdk1.5.0_12/jre/../bin/jarsigner -verify /tmp/null.jar"
[info] jar verified.
[debug] jarsigner executable=[/opt/java/sdk/Sun/jdk1.5.0_12/jre/../bin/jarsigner]
[debug] mdkirs: false /tmp
[info] JAR /tmp/signed.jar is already signed. Skipping.
[debug] jarsigner executable=[/opt/java/sdk/Sun/jdk1.5.0_12/jre/../bin/jarsigner]
[debug] mdkirs: false /tmp
Tests run: 6, Failures: 0, Errors: 0, Skipped: 0, Time elapsed: 0.04 sec
Running org.apache.maven.plugin.jar.JarMojoTest
Tests run: 1, Failures: 0, Errors: 0, Skipped: 0, Time elapsed: 0.473 sec
Results :
Tests run: 13, Failures: 0, Errors: 0, Skipped: 0
[HUDSON] Recording test results
[INFO] [jar:jar]
[INFO] Building jar: http://ci.sonatype.org/job/plugins-IT-with-maven-2.0.x/org.apache.maven.plugins$maven-jar-plugin/ws/target/maven-jar-plugin-2.3-SNAPSHOT.jar
[INFO] [plugin:addPluginArtifactMetadata]
[INFO] [invoker:install {execution: integration-test}]
[INFO] Installing http://ci.sonatype.org/job/plugins-IT-with-maven-2.0.x/org.apache.maven.plugins$maven-jar-plugin/ws/pom.xml to http://ci.sonatype.org/job/plugins-IT-with-maven-2.0.x/org.apache.maven.plugins$maven-jar-plugin/ws/target/local-repo/org/apache/maven/plugins/maven-jar-plugin/2.3-SNAPSHOT/maven-jar-plugin-2.3-SNAPSHOT.pom
[INFO] Installing http://ci.sonatype.org/job/plugins-IT-with-maven-2.0.x/org.apache.maven.plugins$maven-jar-plugin/ws/target/maven-jar-plugin-2.3-SNAPSHOT.jar to http://ci.sonatype.org/job/plugins-IT-with-maven-2.0.x/org.apache.maven.plugins$maven-jar-plugin/ws/target/local-repo/org/apache/maven/plugins/maven-jar-plugin/2.3-SNAPSHOT/maven-jar-plugin-2.3-SNAPSHOT.jar
[INFO] [invoker:run {execution: integration-test}]
[INFO] Building: MJAR-80-fullcontent/pom.xml
[INFO] ...SUCCESS.
[INFO] Building: MJAR-70-recreation/pom.xml
[INFO] ...FAILED[verify script returned false].
[INFO] Building: MJAR-30-excludes/pom.xml
[INFO] ...SUCCESS.
[INFO] Building: mjar-90/pom.xml
[INFO] ...SUCCESS.
[INFO] Building: MJAR-75/pom.xml
[INFO] ...FAILED[code=1]. See http://ci.sonatype.org/job/plugins-IT-with-maven-2.0.x/org.apache.maven.plugins$maven-jar-plugin/ws/target/it/MJAR-75/build.log for details.
[INFO] Building: MJAR-60/pom.xml
[INFO] ...SUCCESS.
[INFO] Building: MJAR-30-fullcontent/pom.xml
[INFO] ...SUCCESS.
[INFO] Building: MJAR-30-include/pom.xml
[INFO] ...SUCCESS.
[INFO] Building: manifest-content/pom.xml
[INFO] ...SUCCESS.
[INFO] Building: project-004/pom.xml
[INFO] ...SUCCESS.
[INFO] Building: MJAR-80-include/pom.xml
[INFO] ...SUCCESS.
[INFO] Building: mjar-71-02/pom.xml
[INFO] ...SUCCESS.
[INFO] Building: MJAR-70-no-recreation/pom.xml
[INFO] ...FAILED[verify script returned false].
[INFO] Building: MJAR-82/pom.xml
[INFO] ...SUCCESS.
[INFO] Building: mjar-71-01/pom.xml
[INFO] ...SUCCESS.
[INFO] Building: MJAR-80-exclude/pom.xml
[INFO] ...SUCCESS.
[INFO]
---------------------------------------
Execution Summary:
Builds Passing: 13
Builds Failing: 3
---------------------------------------
The following builds failed:
* MJAR-70-recreation/pom.xml
* MJAR-75/pom.xml
* MJAR-70-no-recreation/pom.xml
[HUDSON] Archiving http://ci.sonatype.org/job/plugins-IT-with-maven-2.0.x/org.apache.maven.plugins$maven-jar-plugin/ws/pom.xml to /home/j2ee-hudson/.hudson/jobs/plugins-IT-with-maven-2.0.x/modules/org.apache.maven.plugins$maven-jar-plugin/builds/2008-12-19_00-04-27/archive/org.apache.maven.plugins/maven-jar-plugin/2.3-SNAPSHOT/pom.xml
[HUDSON] Archiving http://ci.sonatype.org/job/plugins-IT-with-maven-2.0.x/org.apache.maven.plugins$maven-jar-plugin/ws/target/maven-jar-plugin-2.3-SNAPSHOT.jar to /home/j2ee-hudson/.hudson/jobs/plugins-IT-with-maven-2.0.x/modules/org.apache.maven.plugins$maven-jar-plugin/builds/2008-12-19_00-04-27/archive/org.apache.maven.plugins/maven-jar-plugin/2.3-SNAPSHOT/maven-jar-plugin-2.3-SNAPSHOT.jar
Build failed in Hudson: plugins-IT-with-maven-2.0.x » Maven JAR Plugin #579
Posted by Hudson <Hu...@sonatype.org>.
See http://ci.sonatype.org/job/plugins-IT-with-maven-2.0.x/org.apache.maven.plugins$maven-jar-plugin/579/changes
------------------------------------------
[INFO] ------------------------------------------------------------------------
[INFO] Building Maven JAR Plugin
[INFO] task-segment: [clean, deploy]
[INFO] ------------------------------------------------------------------------
[INFO] [clean:clean]
[INFO] Deleting directory http://ci.sonatype.org/job/plugins-IT-with-maven-2.0.x/org.apache.maven.plugins$maven-jar-plugin/ws/target
[INFO] snapshot org.apache.maven:maven-archiver:2.4-SNAPSHOT: checking for updates from central
[INFO] snapshot org.apache.maven:maven-archiver:2.4-SNAPSHOT: checking for updates from apache.snapshots
Downloading: http://localhost:8081/content/groups/public/org/apache/maven/maven-archiver/2.4-SNAPSHOT/maven-archiver-2.4-20081214.225330-858.pom
3K downloaded
Downloading: http://localhost:8081/content/groups/public/org/codehaus/plexus/plexus-interpolation/1.5/plexus-interpolation-1.5.pom
2K downloaded
Downloading: http://localhost:8081/content/groups/public/org/apache/maven/maven-project/2.0.7/maven-project-2.0.7.jar
113K downloaded
Downloading: http://localhost:8081/content/groups/public/org/apache/maven/maven-settings/2.0.7/maven-settings-2.0.7.jar
47K downloaded
Downloading: http://localhost:8081/content/groups/public/org/apache/maven/maven-model/2.0.7/maven-model-2.0.7.jar
84K downloaded
Downloading: http://localhost:8081/content/groups/public/org/apache/maven/maven-profile/2.0.7/maven-profile-2.0.7.jar
34K downloaded
Downloading: http://localhost:8081/content/groups/public/org/apache/maven/maven-artifact-manager/2.0.7/maven-artifact-manager-2.0.7.jar
55K downloaded
Downloading: http://localhost:8081/content/groups/public/org/apache/maven/maven-repository-metadata/2.0.7/maven-repository-metadata-2.0.7.jar
23K downloaded
Downloading: http://localhost:8081/content/groups/public/org/apache/maven/maven-artifact/2.0.7/maven-artifact-2.0.7.jar
85K downloaded
Downloading: http://localhost:8081/content/groups/public/org/apache/maven/maven-plugin-registry/2.0.7/maven-plugin-registry-2.0.7.jar
28K downloaded
Downloading: http://localhost:8081/content/groups/public/org/apache/maven/maven-archiver/2.4-SNAPSHOT/maven-archiver-2.4-20081214.225330-858.jar
19K downloaded
Downloading: http://localhost:8081/content/groups/public/org/codehaus/plexus/plexus-interpolation/1.5/plexus-interpolation-1.5.jar
40K downloaded
[INFO] [enforcer:enforce {execution: ensure-no-container-api}]
[INFO] [plugin:helpmojo {execution: generated-helpmojo}]
[INFO] Using 2 extractors.
[INFO] Applying extractor for language: java
[INFO] Extractor for language: java found 4 mojo descriptors.
[INFO] Applying extractor for language: bsh
[INFO] Extractor for language: bsh found 0 mojo descriptors.
[INFO] [plugin:descriptor]
[INFO] Using 2 extractors.
[INFO] Applying extractor for language: java
[INFO] Extractor for language: java found 5 mojo descriptors.
[INFO] Applying extractor for language: bsh
[INFO] Extractor for language: bsh found 0 mojo descriptors.
[INFO] [remote-resources:process {execution: default}]
[INFO] [resources:resources]
[INFO] Using encoding: 'UTF-8' to copy filtered resources.
[INFO] [compiler:compile]
[INFO] Compiling 6 source files to http://ci.sonatype.org/job/plugins-IT-with-maven-2.0.x/org.apache.maven.plugins$maven-jar-plugin/ws/target/classes
[INFO] [resources:testResources]
[INFO] Using encoding: 'UTF-8' to copy filtered resources.
[INFO] [compiler:testCompile]
[INFO] Compiling 4 source files to http://ci.sonatype.org/job/plugins-IT-with-maven-2.0.x/org.apache.maven.plugins$maven-jar-plugin/ws/target/test-classes
[INFO] [surefire:test]
[INFO] Surefire report directory: http://ci.sonatype.org/job/plugins-IT-with-maven-2.0.x/org.apache.maven.plugins$maven-jar-plugin/ws/target/surefire-reports
-------------------------------------------------------
T E S T S
-------------------------------------------------------
Running org.apache.maven.plugin.jar.JarSignVerifyMojoTest
[debug] jarsigner executable=[/opt/java/sdk/Sun/jdk1.5.0_12/jre/../bin/jarsigner]
[debug] Executing: /bin/sh -c "cd /tmp && /opt/java/sdk/Sun/jdk1.5.0_12/jre/../bin/jarsigner -verify /tmp/signed/file-version.jar"
[info] jar verified.
[debug] jarsigner executable=[/opt/java/sdk/Sun/jdk1.5.0_12/jre/../bin/jarsigner]
[debug] Executing: /bin/sh -c "cd /tmp && /opt/java/sdk/Sun/jdk1.5.0_12/jre/../bin/jarsigner -verify -verbose -certs /tmp/signed/file-version.jar"
[info] jar verified.
[debug] jarsigner executable=[/opt/java/sdk/Sun/jdk1.5.0_12/jre/../bin/jarsigner]
[debug] Executing: /bin/sh -c "cd /tmp && /opt/java/sdk/Sun/jdk1.5.0_12/jre/../bin/jarsigner -verify /tmp/signed/file-version.jar"
[debug] jarsigner executable=[/opt/java/sdk/Sun/jdk1.5.0_12/jre/../bin/jarsigner]
[debug] Executing: /bin/sh -c "cd /tmp && /opt/java/sdk/Sun/jdk1.5.0_12/jre/../bin/jarsigner -verify /tmp/signed/file-version.jar"
[info] jar is unsigned.
[debug] jarsigner executable=[/opt/java/sdk/Sun/jdk1.5.0_12/jre/../bin/jarsigner]
[debug] Executing: /bin/sh -c "cd /tmp && /opt/java/sdk/Sun/jdk1.5.0_12/jre/../bin/jarsigner -verify /tmp/signed/file-version.jar"
Tests run: 6, Failures: 0, Errors: 0, Skipped: 0, Time elapsed: 0.072 sec
Running org.apache.maven.plugin.jar.JarSignMojoTest
[debug] jarsigner executable=[/opt/java/sdk/Sun/jdk1.5.0_12/jre/../bin/jarsigner]
[debug] mdkirs: false /tmp
[debug] jarsigner executable=[/opt/java/sdk/Sun/jdk1.5.0_12/jre/../bin/jarsigner]
[debug] mdkirs: false /tmp
[debug] jarsigner executable=[/opt/java/sdk/Sun/jdk1.5.0_12/jre/../bin/jarsigner]
[debug] mdkirs: false /tmp
[debug] jarsigner executable=[/opt/java/sdk/Sun/jdk1.5.0_12/jre/../bin/jarsigner]
[debug] Executing: /bin/sh -c "cd /tmp && /opt/java/sdk/Sun/jdk1.5.0_12/jre/../bin/jarsigner -verify /tmp/signed.jar"
[info] jar verified.
[debug] jarsigner executable=[/opt/java/sdk/Sun/jdk1.5.0_12/jre/../bin/jarsigner]
[debug] Signing JAR in-place (overwritting original JAR).
[debug] jarsigner executable=[/opt/java/sdk/Sun/jdk1.5.0_12/jre/../bin/jarsigner]
[debug] Executing: /bin/sh -c "cd /tmp && /opt/java/sdk/Sun/jdk1.5.0_12/jre/../bin/jarsigner -verify /tmp/null.jar"
[info] jar verified.
[debug] jarsigner executable=[/opt/java/sdk/Sun/jdk1.5.0_12/jre/../bin/jarsigner]
[debug] mdkirs: false /tmp
[info] JAR /tmp/signed.jar is already signed. Skipping.
[debug] jarsigner executable=[/opt/java/sdk/Sun/jdk1.5.0_12/jre/../bin/jarsigner]
[debug] mdkirs: false /tmp
Tests run: 6, Failures: 0, Errors: 0, Skipped: 0, Time elapsed: 0.041 sec
Running org.apache.maven.plugin.jar.JarMojoTest
Tests run: 1, Failures: 0, Errors: 0, Skipped: 0, Time elapsed: 0.462 sec
Results :
Tests run: 13, Failures: 0, Errors: 0, Skipped: 0
[HUDSON] Recording test results
[INFO] [jar:jar]
[INFO] Building jar: http://ci.sonatype.org/job/plugins-IT-with-maven-2.0.x/org.apache.maven.plugins$maven-jar-plugin/ws/target/maven-jar-plugin-2.3-SNAPSHOT.jar
[INFO] [plugin:addPluginArtifactMetadata]
[INFO] [invoker:install {execution: integration-test}]
[INFO] Installing http://ci.sonatype.org/job/plugins-IT-with-maven-2.0.x/org.apache.maven.plugins$maven-jar-plugin/ws/pom.xml to http://ci.sonatype.org/job/plugins-IT-with-maven-2.0.x/org.apache.maven.plugins$maven-jar-plugin/ws/target/local-repo/org/apache/maven/plugins/maven-jar-plugin/2.3-SNAPSHOT/maven-jar-plugin-2.3-SNAPSHOT.pom
[INFO] Installing http://ci.sonatype.org/job/plugins-IT-with-maven-2.0.x/org.apache.maven.plugins$maven-jar-plugin/ws/target/maven-jar-plugin-2.3-SNAPSHOT.jar to http://ci.sonatype.org/job/plugins-IT-with-maven-2.0.x/org.apache.maven.plugins$maven-jar-plugin/ws/target/local-repo/org/apache/maven/plugins/maven-jar-plugin/2.3-SNAPSHOT/maven-jar-plugin-2.3-SNAPSHOT.jar
[INFO] [invoker:run {execution: integration-test}]
[INFO] Building: MJAR-80-fullcontent/pom.xml
[INFO] ...SUCCESS.
[INFO] Building: MJAR-70-recreation/pom.xml
[INFO] ...FAILED[verify script returned false].
[INFO] Building: MJAR-30-excludes/pom.xml
[INFO] ...SUCCESS.
[INFO] Building: mjar-90/pom.xml
[INFO] ...SUCCESS.
[INFO] Building: MJAR-75/pom.xml
[INFO] ...FAILED[code=1]. See http://ci.sonatype.org/job/plugins-IT-with-maven-2.0.x/org.apache.maven.plugins$maven-jar-plugin/ws/target/it/MJAR-75/build.log for details.
[INFO] Building: MJAR-60/pom.xml
[INFO] ...SUCCESS.
[INFO] Building: MJAR-30-fullcontent/pom.xml
[INFO] ...SUCCESS.
[INFO] Building: MJAR-30-include/pom.xml
[INFO] ...SUCCESS.
[INFO] Building: manifest-content/pom.xml
[INFO] ...SUCCESS.
[INFO] Building: project-004/pom.xml
[INFO] ...SUCCESS.
[INFO] Building: MJAR-80-include/pom.xml
[INFO] ...SUCCESS.
[INFO] Building: mjar-71-02/pom.xml
[INFO] ...SUCCESS.
[INFO] Building: MJAR-70-no-recreation/pom.xml
[INFO] ...FAILED[verify script returned false].
[INFO] Building: MJAR-82/pom.xml
[INFO] ...SUCCESS.
[INFO] Building: mjar-71-01/pom.xml
[INFO] ...SUCCESS.
[INFO] Building: MJAR-80-exclude/pom.xml
[INFO] ...SUCCESS.
[INFO]
---------------------------------------
Execution Summary:
Builds Passing: 13
Builds Failing: 3
---------------------------------------
The following builds failed:
* MJAR-70-recreation/pom.xml
* MJAR-75/pom.xml
* MJAR-70-no-recreation/pom.xml
[HUDSON] Archiving http://ci.sonatype.org/job/plugins-IT-with-maven-2.0.x/org.apache.maven.plugins$maven-jar-plugin/ws/pom.xml to /home/j2ee-hudson/.hudson/jobs/plugins-IT-with-maven-2.0.x/modules/org.apache.maven.plugins$maven-jar-plugin/builds/2008-12-18_00-07-43/archive/org.apache.maven.plugins/maven-jar-plugin/2.3-SNAPSHOT/pom.xml
[HUDSON] Archiving http://ci.sonatype.org/job/plugins-IT-with-maven-2.0.x/org.apache.maven.plugins$maven-jar-plugin/ws/target/maven-jar-plugin-2.3-SNAPSHOT.jar to /home/j2ee-hudson/.hudson/jobs/plugins-IT-with-maven-2.0.x/modules/org.apache.maven.plugins$maven-jar-plugin/builds/2008-12-18_00-07-43/archive/org.apache.maven.plugins/maven-jar-plugin/2.3-SNAPSHOT/maven-jar-plugin-2.3-SNAPSHOT.jar
Build failed in Hudson: plugins-IT-with-maven-2.0.x » Maven JAR Plugin #578
Posted by Hudson <Hu...@sonatype.org>.
See http://ci.sonatype.org/job/plugins-IT-with-maven-2.0.x/org.apache.maven.plugins$maven-jar-plugin/578/changes
------------------------------------------
[INFO] ------------------------------------------------------------------------
[INFO] Building Maven JAR Plugin
[INFO] task-segment: [clean, deploy]
[INFO] ------------------------------------------------------------------------
[INFO] [clean:clean]
[INFO] Deleting directory http://ci.sonatype.org/job/plugins-IT-with-maven-2.0.x/org.apache.maven.plugins$maven-jar-plugin/ws/target
Downloading: http://localhost:8081/content/groups/public/org/apache/maven/maven-project/2.0.7/maven-project-2.0.7.jar
113K downloaded
Downloading: http://localhost:8081/content/groups/public/org/apache/maven/maven-settings/2.0.7/maven-settings-2.0.7.jar
47K downloaded
Downloading: http://localhost:8081/content/groups/public/org/apache/maven/maven-model/2.0.7/maven-model-2.0.7.jar
84K downloaded
Downloading: http://localhost:8081/content/groups/public/org/apache/maven/maven-profile/2.0.7/maven-profile-2.0.7.jar
34K downloaded
Downloading: http://localhost:8081/content/groups/public/org/apache/maven/maven-artifact-manager/2.0.7/maven-artifact-manager-2.0.7.jar
55K downloaded
Downloading: http://localhost:8081/content/groups/public/org/apache/maven/maven-repository-metadata/2.0.7/maven-repository-metadata-2.0.7.jar
23K downloaded
Downloading: http://localhost:8081/content/groups/public/org/apache/maven/maven-artifact/2.0.7/maven-artifact-2.0.7.jar
85K downloaded
Downloading: http://localhost:8081/content/groups/public/org/apache/maven/maven-plugin-registry/2.0.7/maven-plugin-registry-2.0.7.jar
28K downloaded
Downloading: http://localhost:8081/content/groups/public/org/codehaus/plexus/plexus-interpolation/1.5/plexus-interpolation-1.5.jar
40K downloaded
[INFO] [enforcer:enforce {execution: ensure-no-container-api}]
[INFO] [plugin:helpmojo {execution: generated-helpmojo}]
[INFO] Using 2 extractors.
[INFO] Applying extractor for language: java
[INFO] Extractor for language: java found 4 mojo descriptors.
[INFO] Applying extractor for language: bsh
[INFO] Extractor for language: bsh found 0 mojo descriptors.
[INFO] [plugin:descriptor]
[INFO] Using 2 extractors.
[INFO] Applying extractor for language: java
[INFO] Extractor for language: java found 5 mojo descriptors.
[INFO] Applying extractor for language: bsh
[INFO] Extractor for language: bsh found 0 mojo descriptors.
[INFO] [remote-resources:process {execution: default}]
[INFO] [resources:resources]
[INFO] Using encoding: 'UTF-8' to copy filtered resources.
[INFO] [compiler:compile]
[INFO] Compiling 6 source files to http://ci.sonatype.org/job/plugins-IT-with-maven-2.0.x/org.apache.maven.plugins$maven-jar-plugin/ws/target/classes
[INFO] [resources:testResources]
[INFO] Using encoding: 'UTF-8' to copy filtered resources.
[INFO] [compiler:testCompile]
[INFO] Compiling 4 source files to http://ci.sonatype.org/job/plugins-IT-with-maven-2.0.x/org.apache.maven.plugins$maven-jar-plugin/ws/target/test-classes
[INFO] [surefire:test]
[INFO] Surefire report directory: http://ci.sonatype.org/job/plugins-IT-with-maven-2.0.x/org.apache.maven.plugins$maven-jar-plugin/ws/target/surefire-reports
-------------------------------------------------------
T E S T S
-------------------------------------------------------
Running org.apache.maven.plugin.jar.JarSignVerifyMojoTest
[debug] jarsigner executable=[/opt/java/sdk/Sun/jdk1.5.0_12/jre/../bin/jarsigner]
[debug] Executing: /bin/sh -c "cd /tmp && /opt/java/sdk/Sun/jdk1.5.0_12/jre/../bin/jarsigner -verify /tmp/signed/file-version.jar"
[info] jar verified.
[debug] jarsigner executable=[/opt/java/sdk/Sun/jdk1.5.0_12/jre/../bin/jarsigner]
[debug] Executing: /bin/sh -c "cd /tmp && /opt/java/sdk/Sun/jdk1.5.0_12/jre/../bin/jarsigner -verify -verbose -certs /tmp/signed/file-version.jar"
[info] jar verified.
[debug] jarsigner executable=[/opt/java/sdk/Sun/jdk1.5.0_12/jre/../bin/jarsigner]
[debug] Executing: /bin/sh -c "cd /tmp && /opt/java/sdk/Sun/jdk1.5.0_12/jre/../bin/jarsigner -verify /tmp/signed/file-version.jar"
[debug] jarsigner executable=[/opt/java/sdk/Sun/jdk1.5.0_12/jre/../bin/jarsigner]
[debug] Executing: /bin/sh -c "cd /tmp && /opt/java/sdk/Sun/jdk1.5.0_12/jre/../bin/jarsigner -verify /tmp/signed/file-version.jar"
[info] jar is unsigned.
[debug] jarsigner executable=[/opt/java/sdk/Sun/jdk1.5.0_12/jre/../bin/jarsigner]
[debug] Executing: /bin/sh -c "cd /tmp && /opt/java/sdk/Sun/jdk1.5.0_12/jre/../bin/jarsigner -verify /tmp/signed/file-version.jar"
Tests run: 6, Failures: 0, Errors: 0, Skipped: 0, Time elapsed: 0.072 sec
Running org.apache.maven.plugin.jar.JarSignMojoTest
[debug] jarsigner executable=[/opt/java/sdk/Sun/jdk1.5.0_12/jre/../bin/jarsigner]
[debug] mdkirs: false /tmp
[debug] jarsigner executable=[/opt/java/sdk/Sun/jdk1.5.0_12/jre/../bin/jarsigner]
[debug] mdkirs: false /tmp
[debug] jarsigner executable=[/opt/java/sdk/Sun/jdk1.5.0_12/jre/../bin/jarsigner]
[debug] mdkirs: false /tmp
[debug] jarsigner executable=[/opt/java/sdk/Sun/jdk1.5.0_12/jre/../bin/jarsigner]
[debug] Executing: /bin/sh -c "cd /tmp && /opt/java/sdk/Sun/jdk1.5.0_12/jre/../bin/jarsigner -verify /tmp/signed.jar"
[info] jar verified.
[debug] jarsigner executable=[/opt/java/sdk/Sun/jdk1.5.0_12/jre/../bin/jarsigner]
[debug] Signing JAR in-place (overwritting original JAR).
[debug] jarsigner executable=[/opt/java/sdk/Sun/jdk1.5.0_12/jre/../bin/jarsigner]
[debug] Executing: /bin/sh -c "cd /tmp && /opt/java/sdk/Sun/jdk1.5.0_12/jre/../bin/jarsigner -verify /tmp/null.jar"
[info] jar verified.
[debug] jarsigner executable=[/opt/java/sdk/Sun/jdk1.5.0_12/jre/../bin/jarsigner]
[debug] mdkirs: false /tmp
[info] JAR /tmp/signed.jar is already signed. Skipping.
[debug] jarsigner executable=[/opt/java/sdk/Sun/jdk1.5.0_12/jre/../bin/jarsigner]
[debug] mdkirs: false /tmp
Tests run: 6, Failures: 0, Errors: 0, Skipped: 0, Time elapsed: 0.041 sec
Running org.apache.maven.plugin.jar.JarMojoTest
Tests run: 1, Failures: 0, Errors: 0, Skipped: 0, Time elapsed: 0.511 sec
Results :
Tests run: 13, Failures: 0, Errors: 0, Skipped: 0
[HUDSON] Recording test results
[INFO] [jar:jar]
[INFO] Building jar: http://ci.sonatype.org/job/plugins-IT-with-maven-2.0.x/org.apache.maven.plugins$maven-jar-plugin/ws/target/maven-jar-plugin-2.3-SNAPSHOT.jar
[INFO] [plugin:addPluginArtifactMetadata]
[INFO] [invoker:install {execution: integration-test}]
[INFO] Installing http://ci.sonatype.org/job/plugins-IT-with-maven-2.0.x/org.apache.maven.plugins$maven-jar-plugin/ws/pom.xml to http://ci.sonatype.org/job/plugins-IT-with-maven-2.0.x/org.apache.maven.plugins$maven-jar-plugin/ws/target/local-repo/org/apache/maven/plugins/maven-jar-plugin/2.3-SNAPSHOT/maven-jar-plugin-2.3-SNAPSHOT.pom
[INFO] Installing http://ci.sonatype.org/job/plugins-IT-with-maven-2.0.x/org.apache.maven.plugins$maven-jar-plugin/ws/target/maven-jar-plugin-2.3-SNAPSHOT.jar to http://ci.sonatype.org/job/plugins-IT-with-maven-2.0.x/org.apache.maven.plugins$maven-jar-plugin/ws/target/local-repo/org/apache/maven/plugins/maven-jar-plugin/2.3-SNAPSHOT/maven-jar-plugin-2.3-SNAPSHOT.jar
[INFO] [invoker:run {execution: integration-test}]
[INFO] Building: MJAR-80-fullcontent/pom.xml
[INFO] ...SUCCESS.
[INFO] Building: MJAR-70-recreation/pom.xml
[INFO] ...FAILED[verify script returned false].
[INFO] Building: MJAR-30-excludes/pom.xml
[INFO] ...SUCCESS.
[INFO] Building: mjar-90/pom.xml
[INFO] ...SUCCESS.
[INFO] Building: MJAR-75/pom.xml
[INFO] ...FAILED[code=1]. See http://ci.sonatype.org/job/plugins-IT-with-maven-2.0.x/org.apache.maven.plugins$maven-jar-plugin/ws/target/it/MJAR-75/build.log for details.
[INFO] Building: MJAR-60/pom.xml
[INFO] ...SUCCESS.
[INFO] Building: MJAR-30-fullcontent/pom.xml
[INFO] ...SUCCESS.
[INFO] Building: MJAR-30-include/pom.xml
[INFO] ...SUCCESS.
[INFO] Building: manifest-content/pom.xml
[INFO] ...SUCCESS.
[INFO] Building: project-004/pom.xml
[INFO] ...SUCCESS.
[INFO] Building: MJAR-80-include/pom.xml
[INFO] ...SUCCESS.
[INFO] Building: mjar-71-02/pom.xml
[INFO] ...SUCCESS.
[INFO] Building: MJAR-70-no-recreation/pom.xml
[INFO] ...FAILED[verify script returned false].
[INFO] Building: MJAR-82/pom.xml
[INFO] ...SUCCESS.
[INFO] Building: mjar-71-01/pom.xml
[INFO] ...SUCCESS.
[INFO] Building: MJAR-80-exclude/pom.xml
[INFO] ...SUCCESS.
[INFO]
---------------------------------------
Execution Summary:
Builds Passing: 13
Builds Failing: 3
---------------------------------------
The following builds failed:
* MJAR-70-recreation/pom.xml
* MJAR-75/pom.xml
* MJAR-70-no-recreation/pom.xml
[HUDSON] Archiving http://ci.sonatype.org/job/plugins-IT-with-maven-2.0.x/org.apache.maven.plugins$maven-jar-plugin/ws/pom.xml to /home/j2ee-hudson/.hudson/jobs/plugins-IT-with-maven-2.0.x/modules/org.apache.maven.plugins$maven-jar-plugin/builds/2008-12-17_00-04-52/archive/org.apache.maven.plugins/maven-jar-plugin/2.3-SNAPSHOT/pom.xml
[HUDSON] Archiving http://ci.sonatype.org/job/plugins-IT-with-maven-2.0.x/org.apache.maven.plugins$maven-jar-plugin/ws/target/maven-jar-plugin-2.3-SNAPSHOT.jar to /home/j2ee-hudson/.hudson/jobs/plugins-IT-with-maven-2.0.x/modules/org.apache.maven.plugins$maven-jar-plugin/builds/2008-12-17_00-04-52/archive/org.apache.maven.plugins/maven-jar-plugin/2.3-SNAPSHOT/maven-jar-plugin-2.3-SNAPSHOT.jar
Build failed in Hudson: plugins-IT-with-maven-2.0.x » Maven JAR Plugin #577
Posted by Hudson <Hu...@sonatype.org>.
See http://ci.sonatype.org/job/plugins-IT-with-maven-2.0.x/org.apache.maven.plugins$maven-jar-plugin/577/changes
------------------------------------------
[INFO] ------------------------------------------------------------------------
[INFO] Building Maven JAR Plugin
[INFO] task-segment: [clean, deploy]
[INFO] ------------------------------------------------------------------------
[INFO] [clean:clean]
[INFO] Deleting directory http://ci.sonatype.org/job/plugins-IT-with-maven-2.0.x/org.apache.maven.plugins$maven-jar-plugin/ws/target
Downloading: http://localhost:8081/content/groups/public/org/apache/maven/maven-project/2.0.7/maven-project-2.0.7.jar
113K downloaded
Downloading: http://localhost:8081/content/groups/public/org/apache/maven/maven-settings/2.0.7/maven-settings-2.0.7.jar
47K downloaded
Downloading: http://localhost:8081/content/groups/public/org/apache/maven/maven-model/2.0.7/maven-model-2.0.7.jar
84K downloaded
Downloading: http://localhost:8081/content/groups/public/org/apache/maven/maven-profile/2.0.7/maven-profile-2.0.7.jar
34K downloaded
Downloading: http://localhost:8081/content/groups/public/org/apache/maven/maven-artifact-manager/2.0.7/maven-artifact-manager-2.0.7.jar
55K downloaded
Downloading: http://localhost:8081/content/groups/public/org/apache/maven/maven-repository-metadata/2.0.7/maven-repository-metadata-2.0.7.jar
23K downloaded
Downloading: http://localhost:8081/content/groups/public/org/apache/maven/maven-artifact/2.0.7/maven-artifact-2.0.7.jar
85K downloaded
Downloading: http://localhost:8081/content/groups/public/org/apache/maven/maven-plugin-registry/2.0.7/maven-plugin-registry-2.0.7.jar
28K downloaded
Downloading: http://localhost:8081/content/groups/public/org/codehaus/plexus/plexus-interpolation/1.5/plexus-interpolation-1.5.jar
40K downloaded
[INFO] [enforcer:enforce {execution: ensure-no-container-api}]
[INFO] [plugin:helpmojo {execution: generated-helpmojo}]
[INFO] Using 2 extractors.
[INFO] Applying extractor for language: java
[INFO] Extractor for language: java found 4 mojo descriptors.
[INFO] Applying extractor for language: bsh
[INFO] Extractor for language: bsh found 0 mojo descriptors.
[INFO] [plugin:descriptor]
[INFO] Using 2 extractors.
[INFO] Applying extractor for language: java
[INFO] Extractor for language: java found 5 mojo descriptors.
[INFO] Applying extractor for language: bsh
[INFO] Extractor for language: bsh found 0 mojo descriptors.
[INFO] [remote-resources:process {execution: default}]
[INFO] [resources:resources]
[INFO] Using encoding: 'UTF-8' to copy filtered resources.
[INFO] [compiler:compile]
[INFO] Compiling 6 source files to http://ci.sonatype.org/job/plugins-IT-with-maven-2.0.x/org.apache.maven.plugins$maven-jar-plugin/ws/target/classes
[INFO] [resources:testResources]
[INFO] Using encoding: 'UTF-8' to copy filtered resources.
[INFO] [compiler:testCompile]
[INFO] Compiling 4 source files to http://ci.sonatype.org/job/plugins-IT-with-maven-2.0.x/org.apache.maven.plugins$maven-jar-plugin/ws/target/test-classes
[INFO] [surefire:test]
[INFO] Surefire report directory: http://ci.sonatype.org/job/plugins-IT-with-maven-2.0.x/org.apache.maven.plugins$maven-jar-plugin/ws/target/surefire-reports
-------------------------------------------------------
T E S T S
-------------------------------------------------------
Running org.apache.maven.plugin.jar.JarSignVerifyMojoTest
[debug] jarsigner executable=[/opt/java/sdk/Sun/jdk1.5.0_12/jre/../bin/jarsigner]
[debug] Executing: /bin/sh -c "cd /tmp && /opt/java/sdk/Sun/jdk1.5.0_12/jre/../bin/jarsigner -verify /tmp/signed/file-version.jar"
[info] jar verified.
[debug] jarsigner executable=[/opt/java/sdk/Sun/jdk1.5.0_12/jre/../bin/jarsigner]
[debug] Executing: /bin/sh -c "cd /tmp && /opt/java/sdk/Sun/jdk1.5.0_12/jre/../bin/jarsigner -verify -verbose -certs /tmp/signed/file-version.jar"
[info] jar verified.
[debug] jarsigner executable=[/opt/java/sdk/Sun/jdk1.5.0_12/jre/../bin/jarsigner]
[debug] Executing: /bin/sh -c "cd /tmp && /opt/java/sdk/Sun/jdk1.5.0_12/jre/../bin/jarsigner -verify /tmp/signed/file-version.jar"
[debug] jarsigner executable=[/opt/java/sdk/Sun/jdk1.5.0_12/jre/../bin/jarsigner]
[debug] Executing: /bin/sh -c "cd /tmp && /opt/java/sdk/Sun/jdk1.5.0_12/jre/../bin/jarsigner -verify /tmp/signed/file-version.jar"
[info] jar is unsigned.
[debug] jarsigner executable=[/opt/java/sdk/Sun/jdk1.5.0_12/jre/../bin/jarsigner]
[debug] Executing: /bin/sh -c "cd /tmp && /opt/java/sdk/Sun/jdk1.5.0_12/jre/../bin/jarsigner -verify /tmp/signed/file-version.jar"
Tests run: 6, Failures: 0, Errors: 0, Skipped: 0, Time elapsed: 0.071 sec
Running org.apache.maven.plugin.jar.JarSignMojoTest
[debug] jarsigner executable=[/opt/java/sdk/Sun/jdk1.5.0_12/jre/../bin/jarsigner]
[debug] mdkirs: false /tmp
[debug] jarsigner executable=[/opt/java/sdk/Sun/jdk1.5.0_12/jre/../bin/jarsigner]
[debug] mdkirs: false /tmp
[debug] jarsigner executable=[/opt/java/sdk/Sun/jdk1.5.0_12/jre/../bin/jarsigner]
[debug] mdkirs: false /tmp
[debug] jarsigner executable=[/opt/java/sdk/Sun/jdk1.5.0_12/jre/../bin/jarsigner]
[debug] Executing: /bin/sh -c "cd /tmp && /opt/java/sdk/Sun/jdk1.5.0_12/jre/../bin/jarsigner -verify /tmp/signed.jar"
[info] jar verified.
[debug] jarsigner executable=[/opt/java/sdk/Sun/jdk1.5.0_12/jre/../bin/jarsigner]
[debug] Signing JAR in-place (overwritting original JAR).
[debug] jarsigner executable=[/opt/java/sdk/Sun/jdk1.5.0_12/jre/../bin/jarsigner]
[debug] Executing: /bin/sh -c "cd /tmp && /opt/java/sdk/Sun/jdk1.5.0_12/jre/../bin/jarsigner -verify /tmp/null.jar"
[info] jar verified.
[debug] jarsigner executable=[/opt/java/sdk/Sun/jdk1.5.0_12/jre/../bin/jarsigner]
[debug] mdkirs: false /tmp
[info] JAR /tmp/signed.jar is already signed. Skipping.
[debug] jarsigner executable=[/opt/java/sdk/Sun/jdk1.5.0_12/jre/../bin/jarsigner]
[debug] mdkirs: false /tmp
Tests run: 6, Failures: 0, Errors: 0, Skipped: 0, Time elapsed: 0.041 sec
Running org.apache.maven.plugin.jar.JarMojoTest
Tests run: 1, Failures: 0, Errors: 0, Skipped: 0, Time elapsed: 0.5 sec
Results :
Tests run: 13, Failures: 0, Errors: 0, Skipped: 0
[HUDSON] Recording test results
[INFO] [jar:jar]
[INFO] Building jar: http://ci.sonatype.org/job/plugins-IT-with-maven-2.0.x/org.apache.maven.plugins$maven-jar-plugin/ws/target/maven-jar-plugin-2.3-SNAPSHOT.jar
[INFO] [plugin:addPluginArtifactMetadata]
[INFO] [invoker:install {execution: integration-test}]
[INFO] Installing http://ci.sonatype.org/job/plugins-IT-with-maven-2.0.x/org.apache.maven.plugins$maven-jar-plugin/ws/pom.xml to http://ci.sonatype.org/job/plugins-IT-with-maven-2.0.x/org.apache.maven.plugins$maven-jar-plugin/ws/target/local-repo/org/apache/maven/plugins/maven-jar-plugin/2.3-SNAPSHOT/maven-jar-plugin-2.3-SNAPSHOT.pom
[INFO] Installing http://ci.sonatype.org/job/plugins-IT-with-maven-2.0.x/org.apache.maven.plugins$maven-jar-plugin/ws/target/maven-jar-plugin-2.3-SNAPSHOT.jar to http://ci.sonatype.org/job/plugins-IT-with-maven-2.0.x/org.apache.maven.plugins$maven-jar-plugin/ws/target/local-repo/org/apache/maven/plugins/maven-jar-plugin/2.3-SNAPSHOT/maven-jar-plugin-2.3-SNAPSHOT.jar
[INFO] [invoker:run {execution: integration-test}]
[INFO] Building: MJAR-80-fullcontent/pom.xml
[INFO] ...SUCCESS.
[INFO] Building: MJAR-70-recreation/pom.xml
[INFO] ...FAILED[verify script returned false].
[INFO] Building: MJAR-30-excludes/pom.xml
[INFO] ...SUCCESS.
[INFO] Building: mjar-90/pom.xml
[INFO] ...SUCCESS.
[INFO] Building: MJAR-75/pom.xml
[INFO] ...FAILED[code=1]. See http://ci.sonatype.org/job/plugins-IT-with-maven-2.0.x/org.apache.maven.plugins$maven-jar-plugin/ws/target/it/MJAR-75/build.log for details.
[INFO] Building: MJAR-60/pom.xml
[INFO] ...SUCCESS.
[INFO] Building: MJAR-30-fullcontent/pom.xml
[INFO] ...SUCCESS.
[INFO] Building: MJAR-30-include/pom.xml
[INFO] ...SUCCESS.
[INFO] Building: manifest-content/pom.xml
[INFO] ...SUCCESS.
[INFO] Building: project-004/pom.xml
[INFO] ...SUCCESS.
[INFO] Building: MJAR-80-include/pom.xml
[INFO] ...SUCCESS.
[INFO] Building: mjar-71-02/pom.xml
[INFO] ...SUCCESS.
[INFO] Building: MJAR-70-no-recreation/pom.xml
[INFO] ...FAILED[verify script returned false].
[INFO] Building: MJAR-82/pom.xml
[INFO] ...SUCCESS.
[INFO] Building: mjar-71-01/pom.xml
[INFO] ...SUCCESS.
[INFO] Building: MJAR-80-exclude/pom.xml
[INFO] ...SUCCESS.
[INFO]
---------------------------------------
Execution Summary:
Builds Passing: 13
Builds Failing: 3
---------------------------------------
The following builds failed:
* MJAR-70-recreation/pom.xml
* MJAR-75/pom.xml
* MJAR-70-no-recreation/pom.xml
[HUDSON] Archiving http://ci.sonatype.org/job/plugins-IT-with-maven-2.0.x/org.apache.maven.plugins$maven-jar-plugin/ws/pom.xml to /home/j2ee-hudson/.hudson/jobs/plugins-IT-with-maven-2.0.x/modules/org.apache.maven.plugins$maven-jar-plugin/builds/2008-12-16_00-05-34/archive/org.apache.maven.plugins/maven-jar-plugin/2.3-SNAPSHOT/pom.xml
[HUDSON] Archiving http://ci.sonatype.org/job/plugins-IT-with-maven-2.0.x/org.apache.maven.plugins$maven-jar-plugin/ws/target/maven-jar-plugin-2.3-SNAPSHOT.jar to /home/j2ee-hudson/.hudson/jobs/plugins-IT-with-maven-2.0.x/modules/org.apache.maven.plugins$maven-jar-plugin/builds/2008-12-16_00-05-34/archive/org.apache.maven.plugins/maven-jar-plugin/2.3-SNAPSHOT/maven-jar-plugin-2.3-SNAPSHOT.jar
Build failed in Hudson: plugins-IT-with-maven-2.0.x » Maven JAR Plugin #576
Posted by Hudson <Hu...@sonatype.org>.
See http://ci.sonatype.org/job/plugins-IT-with-maven-2.0.x/org.apache.maven.plugins$maven-jar-plugin/576/changes
------------------------------------------
[INFO] ------------------------------------------------------------------------
[INFO] Building Maven JAR Plugin
[INFO] task-segment: [clean, deploy]
[INFO] ------------------------------------------------------------------------
[INFO] [clean:clean]
[INFO] Deleting directory http://ci.sonatype.org/job/plugins-IT-with-maven-2.0.x/org.apache.maven.plugins$maven-jar-plugin/ws/target
Downloading: http://localhost:8081/content/groups/public/org/apache/maven/maven-project/2.0.7/maven-project-2.0.7.jar
113K downloaded
Downloading: http://localhost:8081/content/groups/public/org/apache/maven/maven-settings/2.0.7/maven-settings-2.0.7.jar
47K downloaded
Downloading: http://localhost:8081/content/groups/public/org/apache/maven/maven-model/2.0.7/maven-model-2.0.7.jar
84K downloaded
Downloading: http://localhost:8081/content/groups/public/org/apache/maven/maven-profile/2.0.7/maven-profile-2.0.7.jar
34K downloaded
Downloading: http://localhost:8081/content/groups/public/org/apache/maven/maven-artifact-manager/2.0.7/maven-artifact-manager-2.0.7.jar
55K downloaded
Downloading: http://localhost:8081/content/groups/public/org/apache/maven/maven-repository-metadata/2.0.7/maven-repository-metadata-2.0.7.jar
23K downloaded
Downloading: http://localhost:8081/content/groups/public/org/apache/maven/maven-artifact/2.0.7/maven-artifact-2.0.7.jar
85K downloaded
Downloading: http://localhost:8081/content/groups/public/org/apache/maven/maven-plugin-registry/2.0.7/maven-plugin-registry-2.0.7.jar
28K downloaded
Downloading: http://localhost:8081/content/groups/public/org/codehaus/plexus/plexus-interpolation/1.5/plexus-interpolation-1.5.jar
40K downloaded
[INFO] [enforcer:enforce {execution: ensure-no-container-api}]
[INFO] [plugin:helpmojo {execution: generated-helpmojo}]
[INFO] Using 2 extractors.
[INFO] Applying extractor for language: java
[INFO] Extractor for language: java found 4 mojo descriptors.
[INFO] Applying extractor for language: bsh
[INFO] Extractor for language: bsh found 0 mojo descriptors.
[INFO] [plugin:descriptor]
[INFO] Using 2 extractors.
[INFO] Applying extractor for language: java
[INFO] Extractor for language: java found 5 mojo descriptors.
[INFO] Applying extractor for language: bsh
[INFO] Extractor for language: bsh found 0 mojo descriptors.
[INFO] [remote-resources:process {execution: default}]
[INFO] [resources:resources]
[INFO] Using encoding: 'UTF-8' to copy filtered resources.
[INFO] [compiler:compile]
[INFO] Compiling 6 source files to http://ci.sonatype.org/job/plugins-IT-with-maven-2.0.x/org.apache.maven.plugins$maven-jar-plugin/ws/target/classes
[INFO] [resources:testResources]
[INFO] Using encoding: 'UTF-8' to copy filtered resources.
[INFO] [compiler:testCompile]
[INFO] Compiling 4 source files to http://ci.sonatype.org/job/plugins-IT-with-maven-2.0.x/org.apache.maven.plugins$maven-jar-plugin/ws/target/test-classes
[INFO] [surefire:test]
[INFO] Surefire report directory: http://ci.sonatype.org/job/plugins-IT-with-maven-2.0.x/org.apache.maven.plugins$maven-jar-plugin/ws/target/surefire-reports
-------------------------------------------------------
T E S T S
-------------------------------------------------------
Running org.apache.maven.plugin.jar.JarSignVerifyMojoTest
[debug] jarsigner executable=[/opt/java/sdk/Sun/jdk1.5.0_12/jre/../bin/jarsigner]
[debug] Executing: /bin/sh -c "cd /tmp && /opt/java/sdk/Sun/jdk1.5.0_12/jre/../bin/jarsigner -verify /tmp/signed/file-version.jar"
[info] jar verified.
[debug] jarsigner executable=[/opt/java/sdk/Sun/jdk1.5.0_12/jre/../bin/jarsigner]
[debug] Executing: /bin/sh -c "cd /tmp && /opt/java/sdk/Sun/jdk1.5.0_12/jre/../bin/jarsigner -verify -verbose -certs /tmp/signed/file-version.jar"
[info] jar verified.
[debug] jarsigner executable=[/opt/java/sdk/Sun/jdk1.5.0_12/jre/../bin/jarsigner]
[debug] Executing: /bin/sh -c "cd /tmp && /opt/java/sdk/Sun/jdk1.5.0_12/jre/../bin/jarsigner -verify /tmp/signed/file-version.jar"
[debug] jarsigner executable=[/opt/java/sdk/Sun/jdk1.5.0_12/jre/../bin/jarsigner]
[debug] Executing: /bin/sh -c "cd /tmp && /opt/java/sdk/Sun/jdk1.5.0_12/jre/../bin/jarsigner -verify /tmp/signed/file-version.jar"
[info] jar is unsigned.
[debug] jarsigner executable=[/opt/java/sdk/Sun/jdk1.5.0_12/jre/../bin/jarsigner]
[debug] Executing: /bin/sh -c "cd /tmp && /opt/java/sdk/Sun/jdk1.5.0_12/jre/../bin/jarsigner -verify /tmp/signed/file-version.jar"
Tests run: 6, Failures: 0, Errors: 0, Skipped: 0, Time elapsed: 0.073 sec
Running org.apache.maven.plugin.jar.JarSignMojoTest
[debug] jarsigner executable=[/opt/java/sdk/Sun/jdk1.5.0_12/jre/../bin/jarsigner]
[debug] mdkirs: false /tmp
[debug] jarsigner executable=[/opt/java/sdk/Sun/jdk1.5.0_12/jre/../bin/jarsigner]
[debug] mdkirs: false /tmp
[debug] jarsigner executable=[/opt/java/sdk/Sun/jdk1.5.0_12/jre/../bin/jarsigner]
[debug] mdkirs: false /tmp
[debug] jarsigner executable=[/opt/java/sdk/Sun/jdk1.5.0_12/jre/../bin/jarsigner]
[debug] Executing: /bin/sh -c "cd /tmp && /opt/java/sdk/Sun/jdk1.5.0_12/jre/../bin/jarsigner -verify /tmp/signed.jar"
[info] jar verified.
[debug] jarsigner executable=[/opt/java/sdk/Sun/jdk1.5.0_12/jre/../bin/jarsigner]
[debug] Signing JAR in-place (overwritting original JAR).
[debug] jarsigner executable=[/opt/java/sdk/Sun/jdk1.5.0_12/jre/../bin/jarsigner]
[debug] Executing: /bin/sh -c "cd /tmp && /opt/java/sdk/Sun/jdk1.5.0_12/jre/../bin/jarsigner -verify /tmp/null.jar"
[info] jar verified.
[debug] jarsigner executable=[/opt/java/sdk/Sun/jdk1.5.0_12/jre/../bin/jarsigner]
[debug] mdkirs: false /tmp
[info] JAR /tmp/signed.jar is already signed. Skipping.
[debug] jarsigner executable=[/opt/java/sdk/Sun/jdk1.5.0_12/jre/../bin/jarsigner]
[debug] mdkirs: false /tmp
Tests run: 6, Failures: 0, Errors: 0, Skipped: 0, Time elapsed: 0.043 sec
Running org.apache.maven.plugin.jar.JarMojoTest
Tests run: 1, Failures: 0, Errors: 0, Skipped: 0, Time elapsed: 0.488 sec
Results :
Tests run: 13, Failures: 0, Errors: 0, Skipped: 0
[HUDSON] Recording test results
[INFO] [jar:jar]
[INFO] Building jar: http://ci.sonatype.org/job/plugins-IT-with-maven-2.0.x/org.apache.maven.plugins$maven-jar-plugin/ws/target/maven-jar-plugin-2.3-SNAPSHOT.jar
[INFO] [plugin:addPluginArtifactMetadata]
[INFO] [invoker:install {execution: integration-test}]
[INFO] Installing http://ci.sonatype.org/job/plugins-IT-with-maven-2.0.x/org.apache.maven.plugins$maven-jar-plugin/ws/pom.xml to http://ci.sonatype.org/job/plugins-IT-with-maven-2.0.x/org.apache.maven.plugins$maven-jar-plugin/ws/target/local-repo/org/apache/maven/plugins/maven-jar-plugin/2.3-SNAPSHOT/maven-jar-plugin-2.3-SNAPSHOT.pom
[INFO] Installing http://ci.sonatype.org/job/plugins-IT-with-maven-2.0.x/org.apache.maven.plugins$maven-jar-plugin/ws/target/maven-jar-plugin-2.3-SNAPSHOT.jar to http://ci.sonatype.org/job/plugins-IT-with-maven-2.0.x/org.apache.maven.plugins$maven-jar-plugin/ws/target/local-repo/org/apache/maven/plugins/maven-jar-plugin/2.3-SNAPSHOT/maven-jar-plugin-2.3-SNAPSHOT.jar
[INFO] [invoker:run {execution: integration-test}]
[INFO] Building: MJAR-80-fullcontent/pom.xml
[INFO] ...SUCCESS.
[INFO] Building: MJAR-70-recreation/pom.xml
[INFO] ...FAILED[verify script returned false].
[INFO] Building: MJAR-30-excludes/pom.xml
[INFO] ...SUCCESS.
[INFO] Building: mjar-90/pom.xml
[INFO] ...SUCCESS.
[INFO] Building: MJAR-75/pom.xml
[INFO] ...FAILED[code=1]. See http://ci.sonatype.org/job/plugins-IT-with-maven-2.0.x/org.apache.maven.plugins$maven-jar-plugin/ws/target/it/MJAR-75/build.log for details.
[INFO] Building: MJAR-60/pom.xml
[INFO] ...SUCCESS.
[INFO] Building: MJAR-30-fullcontent/pom.xml
[INFO] ...SUCCESS.
[INFO] Building: MJAR-30-include/pom.xml
[INFO] ...SUCCESS.
[INFO] Building: manifest-content/pom.xml
[INFO] ...SUCCESS.
[INFO] Building: project-004/pom.xml
[INFO] ...SUCCESS.
[INFO] Building: MJAR-80-include/pom.xml
[INFO] ...SUCCESS.
[INFO] Building: mjar-71-02/pom.xml
[INFO] ...SUCCESS.
[INFO] Building: MJAR-70-no-recreation/pom.xml
[INFO] ...FAILED[verify script returned false].
[INFO] Building: MJAR-82/pom.xml
[INFO] ...SUCCESS.
[INFO] Building: mjar-71-01/pom.xml
[INFO] ...SUCCESS.
[INFO] Building: MJAR-80-exclude/pom.xml
[INFO] ...SUCCESS.
[INFO]
---------------------------------------
Execution Summary:
Builds Passing: 13
Builds Failing: 3
---------------------------------------
The following builds failed:
* MJAR-70-recreation/pom.xml
* MJAR-75/pom.xml
* MJAR-70-no-recreation/pom.xml
[HUDSON] Archiving http://ci.sonatype.org/job/plugins-IT-with-maven-2.0.x/org.apache.maven.plugins$maven-jar-plugin/ws/pom.xml to /home/j2ee-hudson/.hudson/jobs/plugins-IT-with-maven-2.0.x/modules/org.apache.maven.plugins$maven-jar-plugin/builds/2008-12-15_00-04-50/archive/org.apache.maven.plugins/maven-jar-plugin/2.3-SNAPSHOT/pom.xml
[HUDSON] Archiving http://ci.sonatype.org/job/plugins-IT-with-maven-2.0.x/org.apache.maven.plugins$maven-jar-plugin/ws/target/maven-jar-plugin-2.3-SNAPSHOT.jar to /home/j2ee-hudson/.hudson/jobs/plugins-IT-with-maven-2.0.x/modules/org.apache.maven.plugins$maven-jar-plugin/builds/2008-12-15_00-04-50/archive/org.apache.maven.plugins/maven-jar-plugin/2.3-SNAPSHOT/maven-jar-plugin-2.3-SNAPSHOT.jar
Build failed in Hudson: plugins-IT-with-maven-2.0.x » Maven JAR Plugin #575
Posted by Hudson <Hu...@sonatype.org>.
See http://ci.sonatype.org/job/plugins-IT-with-maven-2.0.x/org.apache.maven.plugins$maven-jar-plugin/575/changes
------------------------------------------
[INFO] ------------------------------------------------------------------------
[INFO] Building Maven JAR Plugin
[INFO] task-segment: [clean, deploy]
[INFO] ------------------------------------------------------------------------
[INFO] [clean:clean]
[INFO] Deleting directory http://ci.sonatype.org/job/plugins-IT-with-maven-2.0.x/org.apache.maven.plugins$maven-jar-plugin/ws/target
Downloading: http://localhost:8081/content/groups/public/org/apache/maven/maven-project/2.0.7/maven-project-2.0.7.jar
113K downloaded
Downloading: http://localhost:8081/content/groups/public/org/apache/maven/maven-settings/2.0.7/maven-settings-2.0.7.jar
47K downloaded
Downloading: http://localhost:8081/content/groups/public/org/apache/maven/maven-model/2.0.7/maven-model-2.0.7.jar
84K downloaded
Downloading: http://localhost:8081/content/groups/public/org/apache/maven/maven-profile/2.0.7/maven-profile-2.0.7.jar
34K downloaded
Downloading: http://localhost:8081/content/groups/public/org/apache/maven/maven-artifact-manager/2.0.7/maven-artifact-manager-2.0.7.jar
55K downloaded
Downloading: http://localhost:8081/content/groups/public/org/apache/maven/maven-repository-metadata/2.0.7/maven-repository-metadata-2.0.7.jar
23K downloaded
Downloading: http://localhost:8081/content/groups/public/org/apache/maven/maven-artifact/2.0.7/maven-artifact-2.0.7.jar
85K downloaded
Downloading: http://localhost:8081/content/groups/public/org/apache/maven/maven-plugin-registry/2.0.7/maven-plugin-registry-2.0.7.jar
28K downloaded
Downloading: http://localhost:8081/content/groups/public/org/codehaus/plexus/plexus-interpolation/1.5/plexus-interpolation-1.5.jar
40K downloaded
[INFO] [enforcer:enforce {execution: ensure-no-container-api}]
[INFO] [plugin:helpmojo {execution: generated-helpmojo}]
[INFO] Using 2 extractors.
[INFO] Applying extractor for language: java
[INFO] Extractor for language: java found 4 mojo descriptors.
[INFO] Applying extractor for language: bsh
[INFO] Extractor for language: bsh found 0 mojo descriptors.
[INFO] [plugin:descriptor]
[INFO] Using 2 extractors.
[INFO] Applying extractor for language: java
[INFO] Extractor for language: java found 5 mojo descriptors.
[INFO] Applying extractor for language: bsh
[INFO] Extractor for language: bsh found 0 mojo descriptors.
[INFO] [remote-resources:process {execution: default}]
[INFO] [resources:resources]
[INFO] Using encoding: 'UTF-8' to copy filtered resources.
[INFO] [compiler:compile]
[INFO] Compiling 6 source files to http://ci.sonatype.org/job/plugins-IT-with-maven-2.0.x/org.apache.maven.plugins$maven-jar-plugin/ws/target/classes
[INFO] [resources:testResources]
[INFO] Using encoding: 'UTF-8' to copy filtered resources.
[INFO] [compiler:testCompile]
[INFO] Compiling 4 source files to http://ci.sonatype.org/job/plugins-IT-with-maven-2.0.x/org.apache.maven.plugins$maven-jar-plugin/ws/target/test-classes
[INFO] [surefire:test]
[INFO] Surefire report directory: http://ci.sonatype.org/job/plugins-IT-with-maven-2.0.x/org.apache.maven.plugins$maven-jar-plugin/ws/target/surefire-reports
-------------------------------------------------------
T E S T S
-------------------------------------------------------
Running org.apache.maven.plugin.jar.JarSignVerifyMojoTest
[debug] jarsigner executable=[/opt/java/sdk/Sun/jdk1.5.0_12/jre/../bin/jarsigner]
[debug] Executing: /bin/sh -c "cd /tmp && /opt/java/sdk/Sun/jdk1.5.0_12/jre/../bin/jarsigner -verify /tmp/signed/file-version.jar"
[info] jar verified.
[debug] jarsigner executable=[/opt/java/sdk/Sun/jdk1.5.0_12/jre/../bin/jarsigner]
[debug] Executing: /bin/sh -c "cd /tmp && /opt/java/sdk/Sun/jdk1.5.0_12/jre/../bin/jarsigner -verify -verbose -certs /tmp/signed/file-version.jar"
[info] jar verified.
[debug] jarsigner executable=[/opt/java/sdk/Sun/jdk1.5.0_12/jre/../bin/jarsigner]
[debug] Executing: /bin/sh -c "cd /tmp && /opt/java/sdk/Sun/jdk1.5.0_12/jre/../bin/jarsigner -verify /tmp/signed/file-version.jar"
[debug] jarsigner executable=[/opt/java/sdk/Sun/jdk1.5.0_12/jre/../bin/jarsigner]
[debug] Executing: /bin/sh -c "cd /tmp && /opt/java/sdk/Sun/jdk1.5.0_12/jre/../bin/jarsigner -verify /tmp/signed/file-version.jar"
[info] jar is unsigned.
[debug] jarsigner executable=[/opt/java/sdk/Sun/jdk1.5.0_12/jre/../bin/jarsigner]
[debug] Executing: /bin/sh -c "cd /tmp && /opt/java/sdk/Sun/jdk1.5.0_12/jre/../bin/jarsigner -verify /tmp/signed/file-version.jar"
Tests run: 6, Failures: 0, Errors: 0, Skipped: 0, Time elapsed: 0.072 sec
Running org.apache.maven.plugin.jar.JarSignMojoTest
[debug] jarsigner executable=[/opt/java/sdk/Sun/jdk1.5.0_12/jre/../bin/jarsigner]
[debug] mdkirs: false /tmp
[debug] jarsigner executable=[/opt/java/sdk/Sun/jdk1.5.0_12/jre/../bin/jarsigner]
[debug] mdkirs: false /tmp
[debug] jarsigner executable=[/opt/java/sdk/Sun/jdk1.5.0_12/jre/../bin/jarsigner]
[debug] mdkirs: false /tmp
[debug] jarsigner executable=[/opt/java/sdk/Sun/jdk1.5.0_12/jre/../bin/jarsigner]
[debug] Executing: /bin/sh -c "cd /tmp && /opt/java/sdk/Sun/jdk1.5.0_12/jre/../bin/jarsigner -verify /tmp/signed.jar"
[info] jar verified.
[debug] jarsigner executable=[/opt/java/sdk/Sun/jdk1.5.0_12/jre/../bin/jarsigner]
[debug] Signing JAR in-place (overwritting original JAR).
[debug] jarsigner executable=[/opt/java/sdk/Sun/jdk1.5.0_12/jre/../bin/jarsigner]
[debug] Executing: /bin/sh -c "cd /tmp && /opt/java/sdk/Sun/jdk1.5.0_12/jre/../bin/jarsigner -verify /tmp/null.jar"
[info] jar verified.
[debug] jarsigner executable=[/opt/java/sdk/Sun/jdk1.5.0_12/jre/../bin/jarsigner]
[debug] mdkirs: false /tmp
[info] JAR /tmp/signed.jar is already signed. Skipping.
[debug] jarsigner executable=[/opt/java/sdk/Sun/jdk1.5.0_12/jre/../bin/jarsigner]
[debug] mdkirs: false /tmp
Tests run: 6, Failures: 0, Errors: 0, Skipped: 0, Time elapsed: 0.041 sec
Running org.apache.maven.plugin.jar.JarMojoTest
Tests run: 1, Failures: 0, Errors: 0, Skipped: 0, Time elapsed: 0.46 sec
Results :
Tests run: 13, Failures: 0, Errors: 0, Skipped: 0
[HUDSON] Recording test results
[INFO] [jar:jar]
[INFO] Building jar: http://ci.sonatype.org/job/plugins-IT-with-maven-2.0.x/org.apache.maven.plugins$maven-jar-plugin/ws/target/maven-jar-plugin-2.3-SNAPSHOT.jar
[INFO] [plugin:addPluginArtifactMetadata]
[INFO] [invoker:install {execution: integration-test}]
[INFO] Installing http://ci.sonatype.org/job/plugins-IT-with-maven-2.0.x/org.apache.maven.plugins$maven-jar-plugin/ws/pom.xml to http://ci.sonatype.org/job/plugins-IT-with-maven-2.0.x/org.apache.maven.plugins$maven-jar-plugin/ws/target/local-repo/org/apache/maven/plugins/maven-jar-plugin/2.3-SNAPSHOT/maven-jar-plugin-2.3-SNAPSHOT.pom
[INFO] Installing http://ci.sonatype.org/job/plugins-IT-with-maven-2.0.x/org.apache.maven.plugins$maven-jar-plugin/ws/target/maven-jar-plugin-2.3-SNAPSHOT.jar to http://ci.sonatype.org/job/plugins-IT-with-maven-2.0.x/org.apache.maven.plugins$maven-jar-plugin/ws/target/local-repo/org/apache/maven/plugins/maven-jar-plugin/2.3-SNAPSHOT/maven-jar-plugin-2.3-SNAPSHOT.jar
[INFO] [invoker:run {execution: integration-test}]
[INFO] Building: MJAR-80-fullcontent/pom.xml
[INFO] ...SUCCESS.
[INFO] Building: MJAR-70-recreation/pom.xml
[INFO] ...FAILED[verify script returned false].
[INFO] Building: MJAR-30-excludes/pom.xml
[INFO] ...SUCCESS.
[INFO] Building: mjar-90/pom.xml
[INFO] ...SUCCESS.
[INFO] Building: MJAR-75/pom.xml
[INFO] ...FAILED[code=1]. See http://ci.sonatype.org/job/plugins-IT-with-maven-2.0.x/org.apache.maven.plugins$maven-jar-plugin/ws/target/it/MJAR-75/build.log for details.
[INFO] Building: MJAR-60/pom.xml
[INFO] ...SUCCESS.
[INFO] Building: MJAR-30-fullcontent/pom.xml
[INFO] ...SUCCESS.
[INFO] Building: MJAR-30-include/pom.xml
[INFO] ...SUCCESS.
[INFO] Building: manifest-content/pom.xml
[INFO] ...SUCCESS.
[INFO] Building: project-004/pom.xml
[INFO] ...SUCCESS.
[INFO] Building: MJAR-80-include/pom.xml
[INFO] ...SUCCESS.
[INFO] Building: mjar-71-02/pom.xml
[INFO] ...SUCCESS.
[INFO] Building: MJAR-70-no-recreation/pom.xml
[INFO] ...FAILED[verify script returned false].
[INFO] Building: MJAR-82/pom.xml
[INFO] ...SUCCESS.
[INFO] Building: mjar-71-01/pom.xml
[INFO] ...SUCCESS.
[INFO] Building: MJAR-80-exclude/pom.xml
[INFO] ...SUCCESS.
[INFO]
---------------------------------------
Execution Summary:
Builds Passing: 13
Builds Failing: 3
---------------------------------------
The following builds failed:
* MJAR-70-recreation/pom.xml
* MJAR-75/pom.xml
* MJAR-70-no-recreation/pom.xml
[HUDSON] Archiving http://ci.sonatype.org/job/plugins-IT-with-maven-2.0.x/org.apache.maven.plugins$maven-jar-plugin/ws/pom.xml to /home/j2ee-hudson/.hudson/jobs/plugins-IT-with-maven-2.0.x/modules/org.apache.maven.plugins$maven-jar-plugin/builds/2008-12-12_00-04-47/archive/org.apache.maven.plugins/maven-jar-plugin/2.3-SNAPSHOT/pom.xml
[HUDSON] Archiving http://ci.sonatype.org/job/plugins-IT-with-maven-2.0.x/org.apache.maven.plugins$maven-jar-plugin/ws/target/maven-jar-plugin-2.3-SNAPSHOT.jar to /home/j2ee-hudson/.hudson/jobs/plugins-IT-with-maven-2.0.x/modules/org.apache.maven.plugins$maven-jar-plugin/builds/2008-12-12_00-04-47/archive/org.apache.maven.plugins/maven-jar-plugin/2.3-SNAPSHOT/maven-jar-plugin-2.3-SNAPSHOT.jar
Build failed in Hudson: plugins-IT-with-maven-2.0.x » Maven JAR Plugin #574
Posted by Hudson <Hu...@sonatype.org>.
See http://ci.sonatype.org/job/plugins-IT-with-maven-2.0.x/org.apache.maven.plugins$maven-jar-plugin/574/changes
------------------------------------------
[INFO] ------------------------------------------------------------------------
[INFO] Building Maven JAR Plugin
[INFO] task-segment: [clean, deploy]
[INFO] ------------------------------------------------------------------------
[INFO] [clean:clean]
[INFO] Deleting directory http://ci.sonatype.org/job/plugins-IT-with-maven-2.0.x/org.apache.maven.plugins$maven-jar-plugin/ws/target
Downloading: http://localhost:8081/content/groups/public/org/apache/maven/maven-project/2.0.7/maven-project-2.0.7.jar
113K downloaded
Downloading: http://localhost:8081/content/groups/public/org/apache/maven/maven-settings/2.0.7/maven-settings-2.0.7.jar
47K downloaded
Downloading: http://localhost:8081/content/groups/public/org/apache/maven/maven-model/2.0.7/maven-model-2.0.7.jar
84K downloaded
Downloading: http://localhost:8081/content/groups/public/org/apache/maven/maven-profile/2.0.7/maven-profile-2.0.7.jar
34K downloaded
Downloading: http://localhost:8081/content/groups/public/org/apache/maven/maven-artifact-manager/2.0.7/maven-artifact-manager-2.0.7.jar
55K downloaded
Downloading: http://localhost:8081/content/groups/public/org/apache/maven/maven-repository-metadata/2.0.7/maven-repository-metadata-2.0.7.jar
23K downloaded
Downloading: http://localhost:8081/content/groups/public/org/apache/maven/maven-artifact/2.0.7/maven-artifact-2.0.7.jar
85K downloaded
Downloading: http://localhost:8081/content/groups/public/org/apache/maven/maven-plugin-registry/2.0.7/maven-plugin-registry-2.0.7.jar
28K downloaded
Downloading: http://localhost:8081/content/groups/public/org/codehaus/plexus/plexus-interpolation/1.5/plexus-interpolation-1.5.jar
40K downloaded
[INFO] [enforcer:enforce {execution: ensure-no-container-api}]
[INFO] [plugin:helpmojo {execution: generated-helpmojo}]
[INFO] Using 2 extractors.
[INFO] Applying extractor for language: java
[INFO] Extractor for language: java found 4 mojo descriptors.
[INFO] Applying extractor for language: bsh
[INFO] Extractor for language: bsh found 0 mojo descriptors.
[INFO] [plugin:descriptor]
[INFO] Using 2 extractors.
[INFO] Applying extractor for language: java
[INFO] Extractor for language: java found 5 mojo descriptors.
[INFO] Applying extractor for language: bsh
[INFO] Extractor for language: bsh found 0 mojo descriptors.
[INFO] [remote-resources:process {execution: default}]
[INFO] [resources:resources]
[INFO] Using encoding: 'UTF-8' to copy filtered resources.
[INFO] [compiler:compile]
[INFO] Compiling 6 source files to http://ci.sonatype.org/job/plugins-IT-with-maven-2.0.x/org.apache.maven.plugins$maven-jar-plugin/ws/target/classes
[INFO] [resources:testResources]
[INFO] Using encoding: 'UTF-8' to copy filtered resources.
[INFO] [compiler:testCompile]
[INFO] Compiling 4 source files to http://ci.sonatype.org/job/plugins-IT-with-maven-2.0.x/org.apache.maven.plugins$maven-jar-plugin/ws/target/test-classes
[INFO] [surefire:test]
[INFO] Surefire report directory: http://ci.sonatype.org/job/plugins-IT-with-maven-2.0.x/org.apache.maven.plugins$maven-jar-plugin/ws/target/surefire-reports
-------------------------------------------------------
T E S T S
-------------------------------------------------------
Running org.apache.maven.plugin.jar.JarSignVerifyMojoTest
[debug] jarsigner executable=[/opt/java/sdk/Sun/jdk1.5.0_12/jre/../bin/jarsigner]
[debug] Executing: /bin/sh -c "cd /tmp && /opt/java/sdk/Sun/jdk1.5.0_12/jre/../bin/jarsigner -verify /tmp/signed/file-version.jar"
[info] jar verified.
[debug] jarsigner executable=[/opt/java/sdk/Sun/jdk1.5.0_12/jre/../bin/jarsigner]
[debug] Executing: /bin/sh -c "cd /tmp && /opt/java/sdk/Sun/jdk1.5.0_12/jre/../bin/jarsigner -verify -verbose -certs /tmp/signed/file-version.jar"
[info] jar verified.
[debug] jarsigner executable=[/opt/java/sdk/Sun/jdk1.5.0_12/jre/../bin/jarsigner]
[debug] Executing: /bin/sh -c "cd /tmp && /opt/java/sdk/Sun/jdk1.5.0_12/jre/../bin/jarsigner -verify /tmp/signed/file-version.jar"
[debug] jarsigner executable=[/opt/java/sdk/Sun/jdk1.5.0_12/jre/../bin/jarsigner]
[debug] Executing: /bin/sh -c "cd /tmp && /opt/java/sdk/Sun/jdk1.5.0_12/jre/../bin/jarsigner -verify /tmp/signed/file-version.jar"
[info] jar is unsigned.
[debug] jarsigner executable=[/opt/java/sdk/Sun/jdk1.5.0_12/jre/../bin/jarsigner]
[debug] Executing: /bin/sh -c "cd /tmp && /opt/java/sdk/Sun/jdk1.5.0_12/jre/../bin/jarsigner -verify /tmp/signed/file-version.jar"
Tests run: 6, Failures: 0, Errors: 0, Skipped: 0, Time elapsed: 0.071 sec
Running org.apache.maven.plugin.jar.JarSignMojoTest
[debug] jarsigner executable=[/opt/java/sdk/Sun/jdk1.5.0_12/jre/../bin/jarsigner]
[debug] mdkirs: false /tmp
[debug] jarsigner executable=[/opt/java/sdk/Sun/jdk1.5.0_12/jre/../bin/jarsigner]
[debug] mdkirs: false /tmp
[debug] jarsigner executable=[/opt/java/sdk/Sun/jdk1.5.0_12/jre/../bin/jarsigner]
[debug] mdkirs: false /tmp
[debug] jarsigner executable=[/opt/java/sdk/Sun/jdk1.5.0_12/jre/../bin/jarsigner]
[debug] Executing: /bin/sh -c "cd /tmp && /opt/java/sdk/Sun/jdk1.5.0_12/jre/../bin/jarsigner -verify /tmp/signed.jar"
[info] jar verified.
[debug] jarsigner executable=[/opt/java/sdk/Sun/jdk1.5.0_12/jre/../bin/jarsigner]
[debug] Signing JAR in-place (overwritting original JAR).
[debug] jarsigner executable=[/opt/java/sdk/Sun/jdk1.5.0_12/jre/../bin/jarsigner]
[debug] Executing: /bin/sh -c "cd /tmp && /opt/java/sdk/Sun/jdk1.5.0_12/jre/../bin/jarsigner -verify /tmp/null.jar"
[info] jar verified.
[debug] jarsigner executable=[/opt/java/sdk/Sun/jdk1.5.0_12/jre/../bin/jarsigner]
[debug] mdkirs: false /tmp
[info] JAR /tmp/signed.jar is already signed. Skipping.
[debug] jarsigner executable=[/opt/java/sdk/Sun/jdk1.5.0_12/jre/../bin/jarsigner]
[debug] mdkirs: false /tmp
Tests run: 6, Failures: 0, Errors: 0, Skipped: 0, Time elapsed: 0.04 sec
Running org.apache.maven.plugin.jar.JarMojoTest
Tests run: 1, Failures: 0, Errors: 0, Skipped: 0, Time elapsed: 0.468 sec
Results :
Tests run: 13, Failures: 0, Errors: 0, Skipped: 0
[HUDSON] Recording test results
[INFO] [jar:jar]
[INFO] Building jar: http://ci.sonatype.org/job/plugins-IT-with-maven-2.0.x/org.apache.maven.plugins$maven-jar-plugin/ws/target/maven-jar-plugin-2.3-SNAPSHOT.jar
[INFO] [plugin:addPluginArtifactMetadata]
[INFO] [invoker:install {execution: integration-test}]
[INFO] Installing http://ci.sonatype.org/job/plugins-IT-with-maven-2.0.x/org.apache.maven.plugins$maven-jar-plugin/ws/pom.xml to http://ci.sonatype.org/job/plugins-IT-with-maven-2.0.x/org.apache.maven.plugins$maven-jar-plugin/ws/target/local-repo/org/apache/maven/plugins/maven-jar-plugin/2.3-SNAPSHOT/maven-jar-plugin-2.3-SNAPSHOT.pom
[INFO] Installing http://ci.sonatype.org/job/plugins-IT-with-maven-2.0.x/org.apache.maven.plugins$maven-jar-plugin/ws/target/maven-jar-plugin-2.3-SNAPSHOT.jar to http://ci.sonatype.org/job/plugins-IT-with-maven-2.0.x/org.apache.maven.plugins$maven-jar-plugin/ws/target/local-repo/org/apache/maven/plugins/maven-jar-plugin/2.3-SNAPSHOT/maven-jar-plugin-2.3-SNAPSHOT.jar
[INFO] [invoker:run {execution: integration-test}]
[INFO] Building: MJAR-80-fullcontent/pom.xml
[INFO] ...SUCCESS.
[INFO] Building: MJAR-70-recreation/pom.xml
[INFO] ...FAILED[verify script returned false].
[INFO] Building: MJAR-30-excludes/pom.xml
[INFO] ...SUCCESS.
[INFO] Building: mjar-90/pom.xml
[INFO] ...SUCCESS.
[INFO] Building: MJAR-75/pom.xml
[INFO] ...FAILED[code=1]. See http://ci.sonatype.org/job/plugins-IT-with-maven-2.0.x/org.apache.maven.plugins$maven-jar-plugin/ws/target/it/MJAR-75/build.log for details.
[INFO] Building: MJAR-60/pom.xml
[INFO] ...SUCCESS.
[INFO] Building: MJAR-30-fullcontent/pom.xml
[INFO] ...SUCCESS.
[INFO] Building: MJAR-30-include/pom.xml
[INFO] ...SUCCESS.
[INFO] Building: manifest-content/pom.xml
[INFO] ...SUCCESS.
[INFO] Building: project-004/pom.xml
[INFO] ...SUCCESS.
[INFO] Building: MJAR-80-include/pom.xml
[INFO] ...SUCCESS.
[INFO] Building: mjar-71-02/pom.xml
[INFO] ...SUCCESS.
[INFO] Building: MJAR-70-no-recreation/pom.xml
[INFO] ...FAILED[verify script returned false].
[INFO] Building: MJAR-82/pom.xml
[INFO] ...SUCCESS.
[INFO] Building: mjar-71-01/pom.xml
[INFO] ...SUCCESS.
[INFO] Building: MJAR-80-exclude/pom.xml
[INFO] ...SUCCESS.
[INFO]
---------------------------------------
Execution Summary:
Builds Passing: 13
Builds Failing: 3
---------------------------------------
The following builds failed:
* MJAR-70-recreation/pom.xml
* MJAR-75/pom.xml
* MJAR-70-no-recreation/pom.xml
[HUDSON] Archiving http://ci.sonatype.org/job/plugins-IT-with-maven-2.0.x/org.apache.maven.plugins$maven-jar-plugin/ws/pom.xml to /home/j2ee-hudson/.hudson/jobs/plugins-IT-with-maven-2.0.x/modules/org.apache.maven.plugins$maven-jar-plugin/builds/2008-12-11_00-05-08/archive/org.apache.maven.plugins/maven-jar-plugin/2.3-SNAPSHOT/pom.xml
[HUDSON] Archiving http://ci.sonatype.org/job/plugins-IT-with-maven-2.0.x/org.apache.maven.plugins$maven-jar-plugin/ws/target/maven-jar-plugin-2.3-SNAPSHOT.jar to /home/j2ee-hudson/.hudson/jobs/plugins-IT-with-maven-2.0.x/modules/org.apache.maven.plugins$maven-jar-plugin/builds/2008-12-11_00-05-08/archive/org.apache.maven.plugins/maven-jar-plugin/2.3-SNAPSHOT/maven-jar-plugin-2.3-SNAPSHOT.jar
Build failed in Hudson: plugins-IT-with-maven-2.0.x » Maven JAR Plugin #573
Posted by Hudson <Hu...@sonatype.org>.
See http://ci.sonatype.org/job/plugins-IT-with-maven-2.0.x/org.apache.maven.plugins$maven-jar-plugin/573/changes
------------------------------------------
[INFO] ------------------------------------------------------------------------
[INFO] Building Maven JAR Plugin
[INFO] task-segment: [clean, deploy]
[INFO] ------------------------------------------------------------------------
[INFO] [clean:clean]
[INFO] Deleting directory http://ci.sonatype.org/job/plugins-IT-with-maven-2.0.x/org.apache.maven.plugins$maven-jar-plugin/ws/target
Downloading: http://localhost:8081/content/groups/public/org/apache/maven/maven-project/2.0.7/maven-project-2.0.7.jar
113K downloaded
Downloading: http://localhost:8081/content/groups/public/org/apache/maven/maven-settings/2.0.7/maven-settings-2.0.7.jar
47K downloaded
Downloading: http://localhost:8081/content/groups/public/org/apache/maven/maven-model/2.0.7/maven-model-2.0.7.jar
84K downloaded
Downloading: http://localhost:8081/content/groups/public/org/apache/maven/maven-profile/2.0.7/maven-profile-2.0.7.jar
34K downloaded
Downloading: http://localhost:8081/content/groups/public/org/apache/maven/maven-artifact-manager/2.0.7/maven-artifact-manager-2.0.7.jar
55K downloaded
Downloading: http://localhost:8081/content/groups/public/org/apache/maven/maven-repository-metadata/2.0.7/maven-repository-metadata-2.0.7.jar
23K downloaded
Downloading: http://localhost:8081/content/groups/public/org/apache/maven/maven-artifact/2.0.7/maven-artifact-2.0.7.jar
85K downloaded
Downloading: http://localhost:8081/content/groups/public/org/apache/maven/maven-plugin-registry/2.0.7/maven-plugin-registry-2.0.7.jar
28K downloaded
Downloading: http://localhost:8081/content/groups/public/org/codehaus/plexus/plexus-interpolation/1.5/plexus-interpolation-1.5.jar
40K downloaded
[INFO] [enforcer:enforce {execution: ensure-no-container-api}]
[INFO] [plugin:helpmojo {execution: generated-helpmojo}]
[INFO] Using 2 extractors.
[INFO] Applying extractor for language: java
[INFO] Extractor for language: java found 4 mojo descriptors.
[INFO] Applying extractor for language: bsh
[INFO] Extractor for language: bsh found 0 mojo descriptors.
[INFO] [plugin:descriptor]
[INFO] Using 2 extractors.
[INFO] Applying extractor for language: java
[INFO] Extractor for language: java found 5 mojo descriptors.
[INFO] Applying extractor for language: bsh
[INFO] Extractor for language: bsh found 0 mojo descriptors.
[INFO] [remote-resources:process {execution: default}]
[INFO] [resources:resources]
[INFO] Using encoding: 'UTF-8' to copy filtered resources.
[INFO] [compiler:compile]
[INFO] Compiling 6 source files to http://ci.sonatype.org/job/plugins-IT-with-maven-2.0.x/org.apache.maven.plugins$maven-jar-plugin/ws/target/classes
[INFO] [resources:testResources]
[INFO] Using encoding: 'UTF-8' to copy filtered resources.
[INFO] [compiler:testCompile]
[INFO] Compiling 4 source files to http://ci.sonatype.org/job/plugins-IT-with-maven-2.0.x/org.apache.maven.plugins$maven-jar-plugin/ws/target/test-classes
[INFO] [surefire:test]
[INFO] Surefire report directory: http://ci.sonatype.org/job/plugins-IT-with-maven-2.0.x/org.apache.maven.plugins$maven-jar-plugin/ws/target/surefire-reports
-------------------------------------------------------
T E S T S
-------------------------------------------------------
Running org.apache.maven.plugin.jar.JarSignVerifyMojoTest
[debug] jarsigner executable=[/opt/java/sdk/Sun/jdk1.5.0_12/jre/../bin/jarsigner]
[debug] Executing: /bin/sh -c "cd /tmp && /opt/java/sdk/Sun/jdk1.5.0_12/jre/../bin/jarsigner -verify /tmp/signed/file-version.jar"
[info] jar verified.
[debug] jarsigner executable=[/opt/java/sdk/Sun/jdk1.5.0_12/jre/../bin/jarsigner]
[debug] Executing: /bin/sh -c "cd /tmp && /opt/java/sdk/Sun/jdk1.5.0_12/jre/../bin/jarsigner -verify -verbose -certs /tmp/signed/file-version.jar"
[info] jar verified.
[debug] jarsigner executable=[/opt/java/sdk/Sun/jdk1.5.0_12/jre/../bin/jarsigner]
[debug] Executing: /bin/sh -c "cd /tmp && /opt/java/sdk/Sun/jdk1.5.0_12/jre/../bin/jarsigner -verify /tmp/signed/file-version.jar"
[debug] jarsigner executable=[/opt/java/sdk/Sun/jdk1.5.0_12/jre/../bin/jarsigner]
[debug] Executing: /bin/sh -c "cd /tmp && /opt/java/sdk/Sun/jdk1.5.0_12/jre/../bin/jarsigner -verify /tmp/signed/file-version.jar"
[info] jar is unsigned.
[debug] jarsigner executable=[/opt/java/sdk/Sun/jdk1.5.0_12/jre/../bin/jarsigner]
[debug] Executing: /bin/sh -c "cd /tmp && /opt/java/sdk/Sun/jdk1.5.0_12/jre/../bin/jarsigner -verify /tmp/signed/file-version.jar"
Tests run: 6, Failures: 0, Errors: 0, Skipped: 0, Time elapsed: 0.07 sec
Running org.apache.maven.plugin.jar.JarSignMojoTest
[debug] jarsigner executable=[/opt/java/sdk/Sun/jdk1.5.0_12/jre/../bin/jarsigner]
[debug] mdkirs: false /tmp
[debug] jarsigner executable=[/opt/java/sdk/Sun/jdk1.5.0_12/jre/../bin/jarsigner]
[debug] mdkirs: false /tmp
[debug] jarsigner executable=[/opt/java/sdk/Sun/jdk1.5.0_12/jre/../bin/jarsigner]
[debug] mdkirs: false /tmp
[debug] jarsigner executable=[/opt/java/sdk/Sun/jdk1.5.0_12/jre/../bin/jarsigner]
[debug] Executing: /bin/sh -c "cd /tmp && /opt/java/sdk/Sun/jdk1.5.0_12/jre/../bin/jarsigner -verify /tmp/signed.jar"
[info] jar verified.
[debug] jarsigner executable=[/opt/java/sdk/Sun/jdk1.5.0_12/jre/../bin/jarsigner]
[debug] Signing JAR in-place (overwritting original JAR).
[debug] jarsigner executable=[/opt/java/sdk/Sun/jdk1.5.0_12/jre/../bin/jarsigner]
[debug] Executing: /bin/sh -c "cd /tmp && /opt/java/sdk/Sun/jdk1.5.0_12/jre/../bin/jarsigner -verify /tmp/null.jar"
[info] jar verified.
[debug] jarsigner executable=[/opt/java/sdk/Sun/jdk1.5.0_12/jre/../bin/jarsigner]
[debug] mdkirs: false /tmp
[info] JAR /tmp/signed.jar is already signed. Skipping.
[debug] jarsigner executable=[/opt/java/sdk/Sun/jdk1.5.0_12/jre/../bin/jarsigner]
[debug] mdkirs: false /tmp
Tests run: 6, Failures: 0, Errors: 0, Skipped: 0, Time elapsed: 0.041 sec
Running org.apache.maven.plugin.jar.JarMojoTest
Tests run: 1, Failures: 0, Errors: 0, Skipped: 0, Time elapsed: 0.49 sec
Results :
Tests run: 13, Failures: 0, Errors: 0, Skipped: 0
[HUDSON] Recording test results
[INFO] [jar:jar]
[INFO] Building jar: http://ci.sonatype.org/job/plugins-IT-with-maven-2.0.x/org.apache.maven.plugins$maven-jar-plugin/ws/target/maven-jar-plugin-2.3-SNAPSHOT.jar
[INFO] [plugin:addPluginArtifactMetadata]
[INFO] [invoker:install {execution: integration-test}]
[INFO] Installing http://ci.sonatype.org/job/plugins-IT-with-maven-2.0.x/org.apache.maven.plugins$maven-jar-plugin/ws/pom.xml to http://ci.sonatype.org/job/plugins-IT-with-maven-2.0.x/org.apache.maven.plugins$maven-jar-plugin/ws/target/local-repo/org/apache/maven/plugins/maven-jar-plugin/2.3-SNAPSHOT/maven-jar-plugin-2.3-SNAPSHOT.pom
[INFO] Installing http://ci.sonatype.org/job/plugins-IT-with-maven-2.0.x/org.apache.maven.plugins$maven-jar-plugin/ws/target/maven-jar-plugin-2.3-SNAPSHOT.jar to http://ci.sonatype.org/job/plugins-IT-with-maven-2.0.x/org.apache.maven.plugins$maven-jar-plugin/ws/target/local-repo/org/apache/maven/plugins/maven-jar-plugin/2.3-SNAPSHOT/maven-jar-plugin-2.3-SNAPSHOT.jar
[INFO] [invoker:run {execution: integration-test}]
[INFO] Building: MJAR-80-fullcontent/pom.xml
[INFO] ...SUCCESS.
[INFO] Building: MJAR-70-recreation/pom.xml
[INFO] ...FAILED[verify script returned false].
[INFO] Building: MJAR-30-excludes/pom.xml
[INFO] ...SUCCESS.
[INFO] Building: mjar-90/pom.xml
[INFO] ...SUCCESS.
[INFO] Building: MJAR-75/pom.xml
[INFO] ...FAILED[code=1]. See http://ci.sonatype.org/job/plugins-IT-with-maven-2.0.x/org.apache.maven.plugins$maven-jar-plugin/ws/target/it/MJAR-75/build.log for details.
[INFO] Building: MJAR-60/pom.xml
[INFO] ...SUCCESS.
[INFO] Building: MJAR-30-fullcontent/pom.xml
[INFO] ...SUCCESS.
[INFO] Building: MJAR-30-include/pom.xml
[INFO] ...SUCCESS.
[INFO] Building: manifest-content/pom.xml
[INFO] ...SUCCESS.
[INFO] Building: project-004/pom.xml
[INFO] ...SUCCESS.
[INFO] Building: MJAR-80-include/pom.xml
[INFO] ...SUCCESS.
[INFO] Building: mjar-71-02/pom.xml
[INFO] ...SUCCESS.
[INFO] Building: MJAR-70-no-recreation/pom.xml
[INFO] ...FAILED[verify script returned false].
[INFO] Building: MJAR-82/pom.xml
[INFO] ...SUCCESS.
[INFO] Building: mjar-71-01/pom.xml
[INFO] ...SUCCESS.
[INFO] Building: MJAR-80-exclude/pom.xml
[INFO] ...SUCCESS.
[INFO]
---------------------------------------
Execution Summary:
Builds Passing: 13
Builds Failing: 3
---------------------------------------
The following builds failed:
* MJAR-70-recreation/pom.xml
* MJAR-75/pom.xml
* MJAR-70-no-recreation/pom.xml
[HUDSON] Archiving http://ci.sonatype.org/job/plugins-IT-with-maven-2.0.x/org.apache.maven.plugins$maven-jar-plugin/ws/pom.xml to /home/j2ee-hudson/.hudson/jobs/plugins-IT-with-maven-2.0.x/modules/org.apache.maven.plugins$maven-jar-plugin/builds/2008-12-10_00-05-42/archive/org.apache.maven.plugins/maven-jar-plugin/2.3-SNAPSHOT/pom.xml
[HUDSON] Archiving http://ci.sonatype.org/job/plugins-IT-with-maven-2.0.x/org.apache.maven.plugins$maven-jar-plugin/ws/target/maven-jar-plugin-2.3-SNAPSHOT.jar to /home/j2ee-hudson/.hudson/jobs/plugins-IT-with-maven-2.0.x/modules/org.apache.maven.plugins$maven-jar-plugin/builds/2008-12-10_00-05-42/archive/org.apache.maven.plugins/maven-jar-plugin/2.3-SNAPSHOT/maven-jar-plugin-2.3-SNAPSHOT.jar
Build failed in Hudson: plugins-IT-with-maven-2.0.x » Maven JAR Plugin #572
Posted by Hudson <Hu...@sonatype.org>.
See http://ci.sonatype.org/job/plugins-IT-with-maven-2.0.x/org.apache.maven.plugins$maven-jar-plugin/572/changes
------------------------------------------
[INFO] ------------------------------------------------------------------------
[INFO] Building Maven JAR Plugin
[INFO] task-segment: [clean, deploy]
[INFO] ------------------------------------------------------------------------
[INFO] [clean:clean]
[INFO] Deleting directory http://ci.sonatype.org/job/plugins-IT-with-maven-2.0.x/org.apache.maven.plugins$maven-jar-plugin/ws/target
Downloading: http://localhost:8081/content/groups/public/org/apache/maven/maven-project/2.0.7/maven-project-2.0.7.jar
113K downloaded
Downloading: http://localhost:8081/content/groups/public/org/apache/maven/maven-settings/2.0.7/maven-settings-2.0.7.jar
47K downloaded
Downloading: http://localhost:8081/content/groups/public/org/apache/maven/maven-model/2.0.7/maven-model-2.0.7.jar
84K downloaded
Downloading: http://localhost:8081/content/groups/public/org/apache/maven/maven-profile/2.0.7/maven-profile-2.0.7.jar
34K downloaded
Downloading: http://localhost:8081/content/groups/public/org/apache/maven/maven-artifact-manager/2.0.7/maven-artifact-manager-2.0.7.jar
55K downloaded
Downloading: http://localhost:8081/content/groups/public/org/apache/maven/maven-repository-metadata/2.0.7/maven-repository-metadata-2.0.7.jar
23K downloaded
Downloading: http://localhost:8081/content/groups/public/org/apache/maven/maven-artifact/2.0.7/maven-artifact-2.0.7.jar
85K downloaded
Downloading: http://localhost:8081/content/groups/public/org/apache/maven/maven-plugin-registry/2.0.7/maven-plugin-registry-2.0.7.jar
28K downloaded
Downloading: http://localhost:8081/content/groups/public/org/codehaus/plexus/plexus-interpolation/1.5/plexus-interpolation-1.5.jar
40K downloaded
[INFO] [enforcer:enforce {execution: ensure-no-container-api}]
[INFO] [plugin:helpmojo {execution: generated-helpmojo}]
[INFO] Using 2 extractors.
[INFO] Applying extractor for language: java
[INFO] Extractor for language: java found 4 mojo descriptors.
[INFO] Applying extractor for language: bsh
[INFO] Extractor for language: bsh found 0 mojo descriptors.
[INFO] [plugin:descriptor]
[INFO] Using 2 extractors.
[INFO] Applying extractor for language: java
[INFO] Extractor for language: java found 5 mojo descriptors.
[INFO] Applying extractor for language: bsh
[INFO] Extractor for language: bsh found 0 mojo descriptors.
[INFO] [remote-resources:process {execution: default}]
[INFO] [resources:resources]
[INFO] Using encoding: 'UTF-8' to copy filtered resources.
[INFO] [compiler:compile]
[INFO] Compiling 6 source files to http://ci.sonatype.org/job/plugins-IT-with-maven-2.0.x/org.apache.maven.plugins$maven-jar-plugin/ws/target/classes
[INFO] [resources:testResources]
[INFO] Using encoding: 'UTF-8' to copy filtered resources.
[INFO] [compiler:testCompile]
[INFO] Compiling 4 source files to http://ci.sonatype.org/job/plugins-IT-with-maven-2.0.x/org.apache.maven.plugins$maven-jar-plugin/ws/target/test-classes
[INFO] [surefire:test]
[INFO] Surefire report directory: http://ci.sonatype.org/job/plugins-IT-with-maven-2.0.x/org.apache.maven.plugins$maven-jar-plugin/ws/target/surefire-reports
-------------------------------------------------------
T E S T S
-------------------------------------------------------
Running org.apache.maven.plugin.jar.JarSignVerifyMojoTest
[debug] jarsigner executable=[/opt/java/sdk/Sun/jdk1.5.0_12/jre/../bin/jarsigner]
[debug] Executing: /bin/sh -c "cd /tmp && /opt/java/sdk/Sun/jdk1.5.0_12/jre/../bin/jarsigner -verify /tmp/signed/file-version.jar"
[info] jar verified.
[debug] jarsigner executable=[/opt/java/sdk/Sun/jdk1.5.0_12/jre/../bin/jarsigner]
[debug] Executing: /bin/sh -c "cd /tmp && /opt/java/sdk/Sun/jdk1.5.0_12/jre/../bin/jarsigner -verify -verbose -certs /tmp/signed/file-version.jar"
[info] jar verified.
[debug] jarsigner executable=[/opt/java/sdk/Sun/jdk1.5.0_12/jre/../bin/jarsigner]
[debug] Executing: /bin/sh -c "cd /tmp && /opt/java/sdk/Sun/jdk1.5.0_12/jre/../bin/jarsigner -verify /tmp/signed/file-version.jar"
[debug] jarsigner executable=[/opt/java/sdk/Sun/jdk1.5.0_12/jre/../bin/jarsigner]
[debug] Executing: /bin/sh -c "cd /tmp && /opt/java/sdk/Sun/jdk1.5.0_12/jre/../bin/jarsigner -verify /tmp/signed/file-version.jar"
[info] jar is unsigned.
[debug] jarsigner executable=[/opt/java/sdk/Sun/jdk1.5.0_12/jre/../bin/jarsigner]
[debug] Executing: /bin/sh -c "cd /tmp && /opt/java/sdk/Sun/jdk1.5.0_12/jre/../bin/jarsigner -verify /tmp/signed/file-version.jar"
Tests run: 6, Failures: 0, Errors: 0, Skipped: 0, Time elapsed: 0.068 sec
Running org.apache.maven.plugin.jar.JarSignMojoTest
[debug] jarsigner executable=[/opt/java/sdk/Sun/jdk1.5.0_12/jre/../bin/jarsigner]
[debug] mdkirs: false /tmp
[debug] jarsigner executable=[/opt/java/sdk/Sun/jdk1.5.0_12/jre/../bin/jarsigner]
[debug] mdkirs: false /tmp
[debug] jarsigner executable=[/opt/java/sdk/Sun/jdk1.5.0_12/jre/../bin/jarsigner]
[debug] mdkirs: false /tmp
[debug] jarsigner executable=[/opt/java/sdk/Sun/jdk1.5.0_12/jre/../bin/jarsigner]
[debug] Executing: /bin/sh -c "cd /tmp && /opt/java/sdk/Sun/jdk1.5.0_12/jre/../bin/jarsigner -verify /tmp/signed.jar"
[info] jar verified.
[debug] jarsigner executable=[/opt/java/sdk/Sun/jdk1.5.0_12/jre/../bin/jarsigner]
[debug] Signing JAR in-place (overwritting original JAR).
[debug] jarsigner executable=[/opt/java/sdk/Sun/jdk1.5.0_12/jre/../bin/jarsigner]
[debug] Executing: /bin/sh -c "cd /tmp && /opt/java/sdk/Sun/jdk1.5.0_12/jre/../bin/jarsigner -verify /tmp/null.jar"
[info] jar verified.
[debug] jarsigner executable=[/opt/java/sdk/Sun/jdk1.5.0_12/jre/../bin/jarsigner]
[debug] mdkirs: false /tmp
[info] JAR /tmp/signed.jar is already signed. Skipping.
[debug] jarsigner executable=[/opt/java/sdk/Sun/jdk1.5.0_12/jre/../bin/jarsigner]
[debug] mdkirs: false /tmp
Tests run: 6, Failures: 0, Errors: 0, Skipped: 0, Time elapsed: 0.039 sec
Running org.apache.maven.plugin.jar.JarMojoTest
Tests run: 1, Failures: 0, Errors: 0, Skipped: 0, Time elapsed: 0.459 sec
Results :
Tests run: 13, Failures: 0, Errors: 0, Skipped: 0
[HUDSON] Recording test results
[INFO] [jar:jar]
[INFO] Building jar: http://ci.sonatype.org/job/plugins-IT-with-maven-2.0.x/org.apache.maven.plugins$maven-jar-plugin/ws/target/maven-jar-plugin-2.3-SNAPSHOT.jar
[INFO] [plugin:addPluginArtifactMetadata]
[INFO] [invoker:install {execution: integration-test}]
[INFO] Installing http://ci.sonatype.org/job/plugins-IT-with-maven-2.0.x/org.apache.maven.plugins$maven-jar-plugin/ws/pom.xml to http://ci.sonatype.org/job/plugins-IT-with-maven-2.0.x/org.apache.maven.plugins$maven-jar-plugin/ws/target/local-repo/org/apache/maven/plugins/maven-jar-plugin/2.3-SNAPSHOT/maven-jar-plugin-2.3-SNAPSHOT.pom
[INFO] Installing http://ci.sonatype.org/job/plugins-IT-with-maven-2.0.x/org.apache.maven.plugins$maven-jar-plugin/ws/target/maven-jar-plugin-2.3-SNAPSHOT.jar to http://ci.sonatype.org/job/plugins-IT-with-maven-2.0.x/org.apache.maven.plugins$maven-jar-plugin/ws/target/local-repo/org/apache/maven/plugins/maven-jar-plugin/2.3-SNAPSHOT/maven-jar-plugin-2.3-SNAPSHOT.jar
[INFO] [invoker:run {execution: integration-test}]
[INFO] Building: MJAR-80-fullcontent/pom.xml
[INFO] ...SUCCESS.
[INFO] Building: MJAR-70-recreation/pom.xml
[INFO] ...FAILED[verify script returned false].
[INFO] Building: MJAR-30-excludes/pom.xml
[INFO] ...SUCCESS.
[INFO] Building: mjar-90/pom.xml
[INFO] ...SUCCESS.
[INFO] Building: MJAR-75/pom.xml
[INFO] ...FAILED[code=1]. See http://ci.sonatype.org/job/plugins-IT-with-maven-2.0.x/org.apache.maven.plugins$maven-jar-plugin/ws/target/it/MJAR-75/build.log for details.
[INFO] Building: MJAR-60/pom.xml
[INFO] ...SUCCESS.
[INFO] Building: MJAR-30-fullcontent/pom.xml
[INFO] ...SUCCESS.
[INFO] Building: MJAR-30-include/pom.xml
[INFO] ...SUCCESS.
[INFO] Building: manifest-content/pom.xml
[INFO] ...SUCCESS.
[INFO] Building: project-004/pom.xml
[INFO] ...SUCCESS.
[INFO] Building: MJAR-80-include/pom.xml
[INFO] ...SUCCESS.
[INFO] Building: mjar-71-02/pom.xml
[INFO] ...SUCCESS.
[INFO] Building: MJAR-70-no-recreation/pom.xml
[INFO] ...FAILED[verify script returned false].
[INFO] Building: MJAR-82/pom.xml
[INFO] ...SUCCESS.
[INFO] Building: mjar-71-01/pom.xml
[INFO] ...SUCCESS.
[INFO] Building: MJAR-80-exclude/pom.xml
[INFO] ...SUCCESS.
[INFO]
---------------------------------------
Execution Summary:
Builds Passing: 13
Builds Failing: 3
---------------------------------------
The following builds failed:
* MJAR-70-recreation/pom.xml
* MJAR-75/pom.xml
* MJAR-70-no-recreation/pom.xml
[HUDSON] Archiving http://ci.sonatype.org/job/plugins-IT-with-maven-2.0.x/org.apache.maven.plugins$maven-jar-plugin/ws/pom.xml to /home/j2ee-hudson/.hudson/jobs/plugins-IT-with-maven-2.0.x/modules/org.apache.maven.plugins$maven-jar-plugin/builds/2008-12-01_00-04-31/archive/org.apache.maven.plugins/maven-jar-plugin/2.3-SNAPSHOT/pom.xml
[HUDSON] Archiving http://ci.sonatype.org/job/plugins-IT-with-maven-2.0.x/org.apache.maven.plugins$maven-jar-plugin/ws/target/maven-jar-plugin-2.3-SNAPSHOT.jar to /home/j2ee-hudson/.hudson/jobs/plugins-IT-with-maven-2.0.x/modules/org.apache.maven.plugins$maven-jar-plugin/builds/2008-12-01_00-04-31/archive/org.apache.maven.plugins/maven-jar-plugin/2.3-SNAPSHOT/maven-jar-plugin-2.3-SNAPSHOT.jar
Build failed in Hudson: plugins-IT-with-maven-2.0.x » Maven JAR Plugin #571
Posted by Hudson <Hu...@sonatype.org>.
See http://ci.sonatype.org/job/plugins-IT-with-maven-2.0.x/org.apache.maven.plugins$maven-jar-plugin/571/changes
------------------------------------------
[INFO] ------------------------------------------------------------------------
[INFO] Building Maven JAR Plugin
[INFO] task-segment: [clean, deploy]
[INFO] ------------------------------------------------------------------------
[INFO] [clean:clean]
[INFO] Deleting directory http://ci.sonatype.org/job/plugins-IT-with-maven-2.0.x/org.apache.maven.plugins$maven-jar-plugin/ws/target
Downloading: http://localhost:8081/content/groups/public/org/apache/maven/maven-project/2.0.7/maven-project-2.0.7.jar
113K downloaded
Downloading: http://localhost:8081/content/groups/public/org/apache/maven/maven-settings/2.0.7/maven-settings-2.0.7.jar
47K downloaded
Downloading: http://localhost:8081/content/groups/public/org/apache/maven/maven-model/2.0.7/maven-model-2.0.7.jar
84K downloaded
Downloading: http://localhost:8081/content/groups/public/org/apache/maven/maven-profile/2.0.7/maven-profile-2.0.7.jar
34K downloaded
Downloading: http://localhost:8081/content/groups/public/org/apache/maven/maven-artifact-manager/2.0.7/maven-artifact-manager-2.0.7.jar
55K downloaded
Downloading: http://localhost:8081/content/groups/public/org/apache/maven/maven-repository-metadata/2.0.7/maven-repository-metadata-2.0.7.jar
23K downloaded
Downloading: http://localhost:8081/content/groups/public/org/apache/maven/maven-artifact/2.0.7/maven-artifact-2.0.7.jar
85K downloaded
Downloading: http://localhost:8081/content/groups/public/org/apache/maven/maven-plugin-registry/2.0.7/maven-plugin-registry-2.0.7.jar
28K downloaded
Downloading: http://localhost:8081/content/groups/public/org/codehaus/plexus/plexus-interpolation/1.5/plexus-interpolation-1.5.jar
40K downloaded
[INFO] [enforcer:enforce {execution: ensure-no-container-api}]
[INFO] [plugin:helpmojo {execution: generated-helpmojo}]
[INFO] Using 2 extractors.
[INFO] Applying extractor for language: java
[INFO] Extractor for language: java found 4 mojo descriptors.
[INFO] Applying extractor for language: bsh
[INFO] Extractor for language: bsh found 0 mojo descriptors.
[INFO] [plugin:descriptor]
[INFO] Using 2 extractors.
[INFO] Applying extractor for language: java
[INFO] Extractor for language: java found 5 mojo descriptors.
[INFO] Applying extractor for language: bsh
[INFO] Extractor for language: bsh found 0 mojo descriptors.
[INFO] [remote-resources:process {execution: default}]
[INFO] [resources:resources]
[INFO] Using encoding: 'UTF-8' to copy filtered resources.
[INFO] [compiler:compile]
[INFO] Compiling 6 source files to http://ci.sonatype.org/job/plugins-IT-with-maven-2.0.x/org.apache.maven.plugins$maven-jar-plugin/ws/target/classes
[INFO] [resources:testResources]
[INFO] Using encoding: 'UTF-8' to copy filtered resources.
[INFO] [compiler:testCompile]
[INFO] Compiling 4 source files to http://ci.sonatype.org/job/plugins-IT-with-maven-2.0.x/org.apache.maven.plugins$maven-jar-plugin/ws/target/test-classes
[INFO] [surefire:test]
[INFO] Surefire report directory: http://ci.sonatype.org/job/plugins-IT-with-maven-2.0.x/org.apache.maven.plugins$maven-jar-plugin/ws/target/surefire-reports
-------------------------------------------------------
T E S T S
-------------------------------------------------------
Running org.apache.maven.plugin.jar.JarSignVerifyMojoTest
[debug] jarsigner executable=[/opt/java/sdk/Sun/jdk1.5.0_12/jre/../bin/jarsigner]
[debug] Executing: /bin/sh -c "cd /tmp && /opt/java/sdk/Sun/jdk1.5.0_12/jre/../bin/jarsigner -verify /tmp/signed/file-version.jar"
[info] jar verified.
[debug] jarsigner executable=[/opt/java/sdk/Sun/jdk1.5.0_12/jre/../bin/jarsigner]
[debug] Executing: /bin/sh -c "cd /tmp && /opt/java/sdk/Sun/jdk1.5.0_12/jre/../bin/jarsigner -verify -verbose -certs /tmp/signed/file-version.jar"
[info] jar verified.
[debug] jarsigner executable=[/opt/java/sdk/Sun/jdk1.5.0_12/jre/../bin/jarsigner]
[debug] Executing: /bin/sh -c "cd /tmp && /opt/java/sdk/Sun/jdk1.5.0_12/jre/../bin/jarsigner -verify /tmp/signed/file-version.jar"
[debug] jarsigner executable=[/opt/java/sdk/Sun/jdk1.5.0_12/jre/../bin/jarsigner]
[debug] Executing: /bin/sh -c "cd /tmp && /opt/java/sdk/Sun/jdk1.5.0_12/jre/../bin/jarsigner -verify /tmp/signed/file-version.jar"
[info] jar is unsigned.
[debug] jarsigner executable=[/opt/java/sdk/Sun/jdk1.5.0_12/jre/../bin/jarsigner]
[debug] Executing: /bin/sh -c "cd /tmp && /opt/java/sdk/Sun/jdk1.5.0_12/jre/../bin/jarsigner -verify /tmp/signed/file-version.jar"
Tests run: 6, Failures: 0, Errors: 0, Skipped: 0, Time elapsed: 0.073 sec
Running org.apache.maven.plugin.jar.JarSignMojoTest
[debug] jarsigner executable=[/opt/java/sdk/Sun/jdk1.5.0_12/jre/../bin/jarsigner]
[debug] mdkirs: false /tmp
[debug] jarsigner executable=[/opt/java/sdk/Sun/jdk1.5.0_12/jre/../bin/jarsigner]
[debug] mdkirs: false /tmp
[debug] jarsigner executable=[/opt/java/sdk/Sun/jdk1.5.0_12/jre/../bin/jarsigner]
[debug] mdkirs: false /tmp
[debug] jarsigner executable=[/opt/java/sdk/Sun/jdk1.5.0_12/jre/../bin/jarsigner]
[debug] Executing: /bin/sh -c "cd /tmp && /opt/java/sdk/Sun/jdk1.5.0_12/jre/../bin/jarsigner -verify /tmp/signed.jar"
[info] jar verified.
[debug] jarsigner executable=[/opt/java/sdk/Sun/jdk1.5.0_12/jre/../bin/jarsigner]
[debug] Signing JAR in-place (overwritting original JAR).
[debug] jarsigner executable=[/opt/java/sdk/Sun/jdk1.5.0_12/jre/../bin/jarsigner]
[debug] Executing: /bin/sh -c "cd /tmp && /opt/java/sdk/Sun/jdk1.5.0_12/jre/../bin/jarsigner -verify /tmp/null.jar"
[info] jar verified.
[debug] jarsigner executable=[/opt/java/sdk/Sun/jdk1.5.0_12/jre/../bin/jarsigner]
[debug] mdkirs: false /tmp
[info] JAR /tmp/signed.jar is already signed. Skipping.
[debug] jarsigner executable=[/opt/java/sdk/Sun/jdk1.5.0_12/jre/../bin/jarsigner]
[debug] mdkirs: false /tmp
Tests run: 6, Failures: 0, Errors: 0, Skipped: 0, Time elapsed: 0.042 sec
Running org.apache.maven.plugin.jar.JarMojoTest
Tests run: 1, Failures: 0, Errors: 0, Skipped: 0, Time elapsed: 0.564 sec
Results :
Tests run: 13, Failures: 0, Errors: 0, Skipped: 0
[HUDSON] Recording test results
[INFO] [jar:jar]
[INFO] Building jar: http://ci.sonatype.org/job/plugins-IT-with-maven-2.0.x/org.apache.maven.plugins$maven-jar-plugin/ws/target/maven-jar-plugin-2.3-SNAPSHOT.jar
[INFO] [plugin:addPluginArtifactMetadata]
[INFO] [invoker:install {execution: integration-test}]
[INFO] Installing http://ci.sonatype.org/job/plugins-IT-with-maven-2.0.x/org.apache.maven.plugins$maven-jar-plugin/ws/pom.xml to http://ci.sonatype.org/job/plugins-IT-with-maven-2.0.x/org.apache.maven.plugins$maven-jar-plugin/ws/target/local-repo/org/apache/maven/plugins/maven-jar-plugin/2.3-SNAPSHOT/maven-jar-plugin-2.3-SNAPSHOT.pom
[INFO] Installing http://ci.sonatype.org/job/plugins-IT-with-maven-2.0.x/org.apache.maven.plugins$maven-jar-plugin/ws/target/maven-jar-plugin-2.3-SNAPSHOT.jar to http://ci.sonatype.org/job/plugins-IT-with-maven-2.0.x/org.apache.maven.plugins$maven-jar-plugin/ws/target/local-repo/org/apache/maven/plugins/maven-jar-plugin/2.3-SNAPSHOT/maven-jar-plugin-2.3-SNAPSHOT.jar
[INFO] [invoker:run {execution: integration-test}]
[INFO] Building: MJAR-80-fullcontent/pom.xml
[INFO] ...SUCCESS.
[INFO] Building: MJAR-70-recreation/pom.xml
[INFO] ...FAILED[verify script returned false].
[INFO] Building: MJAR-30-excludes/pom.xml
[INFO] ...SUCCESS.
[INFO] Building: mjar-90/pom.xml
[INFO] ...SUCCESS.
[INFO] Building: MJAR-75/pom.xml
[INFO] ...FAILED[code=1]. See http://ci.sonatype.org/job/plugins-IT-with-maven-2.0.x/org.apache.maven.plugins$maven-jar-plugin/ws/target/it/MJAR-75/build.log for details.
[INFO] Building: MJAR-60/pom.xml
[INFO] ...SUCCESS.
[INFO] Building: MJAR-30-fullcontent/pom.xml
[INFO] ...SUCCESS.
[INFO] Building: MJAR-30-include/pom.xml
[INFO] ...SUCCESS.
[INFO] Building: manifest-content/pom.xml
[INFO] ...SUCCESS.
[INFO] Building: project-004/pom.xml
[INFO] ...SUCCESS.
[INFO] Building: MJAR-80-include/pom.xml
[INFO] ...SUCCESS.
[INFO] Building: mjar-71-02/pom.xml
[INFO] ...SUCCESS.
[INFO] Building: MJAR-70-no-recreation/pom.xml
[INFO] ...FAILED[verify script returned false].
[INFO] Building: MJAR-82/pom.xml
[INFO] ...SUCCESS.
[INFO] Building: mjar-71-01/pom.xml
[INFO] ...SUCCESS.
[INFO] Building: MJAR-80-exclude/pom.xml
[INFO] ...SUCCESS.
[INFO]
---------------------------------------
Execution Summary:
Builds Passing: 13
Builds Failing: 3
---------------------------------------
The following builds failed:
* MJAR-70-recreation/pom.xml
* MJAR-75/pom.xml
* MJAR-70-no-recreation/pom.xml
[HUDSON] Archiving http://ci.sonatype.org/job/plugins-IT-with-maven-2.0.x/org.apache.maven.plugins$maven-jar-plugin/ws/pom.xml to /home/j2ee-hudson/.hudson/jobs/plugins-IT-with-maven-2.0.x/modules/org.apache.maven.plugins$maven-jar-plugin/builds/2008-11-28_00-04-28/archive/org.apache.maven.plugins/maven-jar-plugin/2.3-SNAPSHOT/pom.xml
[HUDSON] Archiving http://ci.sonatype.org/job/plugins-IT-with-maven-2.0.x/org.apache.maven.plugins$maven-jar-plugin/ws/target/maven-jar-plugin-2.3-SNAPSHOT.jar to /home/j2ee-hudson/.hudson/jobs/plugins-IT-with-maven-2.0.x/modules/org.apache.maven.plugins$maven-jar-plugin/builds/2008-11-28_00-04-28/archive/org.apache.maven.plugins/maven-jar-plugin/2.3-SNAPSHOT/maven-jar-plugin-2.3-SNAPSHOT.jar
Build failed in Hudson: plugins-IT-with-maven-2.0.x » Maven JAR Plugin #570
Posted by Hudson <Hu...@sonatype.org>.
See http://ci.sonatype.org/job/plugins-IT-with-maven-2.0.x/org.apache.maven.plugins$maven-jar-plugin/570/changes
------------------------------------------
[INFO] ------------------------------------------------------------------------
[INFO] Building Maven JAR Plugin
[INFO] task-segment: [clean, deploy]
[INFO] ------------------------------------------------------------------------
[INFO] [clean:clean]
[INFO] Deleting directory http://ci.sonatype.org/job/plugins-IT-with-maven-2.0.x/org.apache.maven.plugins$maven-jar-plugin/ws/target
Downloading: http://localhost:8081/content/groups/public/org/apache/maven/maven-project/2.0.7/maven-project-2.0.7.jar
113K downloaded
Downloading: http://localhost:8081/content/groups/public/org/apache/maven/maven-settings/2.0.7/maven-settings-2.0.7.jar
47K downloaded
Downloading: http://localhost:8081/content/groups/public/org/apache/maven/maven-model/2.0.7/maven-model-2.0.7.jar
84K downloaded
Downloading: http://localhost:8081/content/groups/public/org/apache/maven/maven-profile/2.0.7/maven-profile-2.0.7.jar
34K downloaded
Downloading: http://localhost:8081/content/groups/public/org/apache/maven/maven-artifact-manager/2.0.7/maven-artifact-manager-2.0.7.jar
55K downloaded
Downloading: http://localhost:8081/content/groups/public/org/apache/maven/maven-repository-metadata/2.0.7/maven-repository-metadata-2.0.7.jar
23K downloaded
Downloading: http://localhost:8081/content/groups/public/org/apache/maven/maven-artifact/2.0.7/maven-artifact-2.0.7.jar
85K downloaded
Downloading: http://localhost:8081/content/groups/public/org/apache/maven/maven-plugin-registry/2.0.7/maven-plugin-registry-2.0.7.jar
28K downloaded
Downloading: http://localhost:8081/content/groups/public/org/codehaus/plexus/plexus-interpolation/1.5/plexus-interpolation-1.5.jar
40K downloaded
[INFO] [enforcer:enforce {execution: ensure-no-container-api}]
[INFO] [plugin:helpmojo {execution: generated-helpmojo}]
[INFO] Using 2 extractors.
[INFO] Applying extractor for language: java
[INFO] Extractor for language: java found 4 mojo descriptors.
[INFO] Applying extractor for language: bsh
[INFO] Extractor for language: bsh found 0 mojo descriptors.
[INFO] [plugin:descriptor]
[INFO] Using 2 extractors.
[INFO] Applying extractor for language: java
[INFO] Extractor for language: java found 5 mojo descriptors.
[INFO] Applying extractor for language: bsh
[INFO] Extractor for language: bsh found 0 mojo descriptors.
[INFO] [remote-resources:process {execution: default}]
[INFO] [resources:resources]
[INFO] Using encoding: 'UTF-8' to copy filtered resources.
[INFO] [compiler:compile]
[INFO] Compiling 6 source files to http://ci.sonatype.org/job/plugins-IT-with-maven-2.0.x/org.apache.maven.plugins$maven-jar-plugin/ws/target/classes
[INFO] [resources:testResources]
[INFO] Using encoding: 'UTF-8' to copy filtered resources.
[INFO] [compiler:testCompile]
[INFO] Compiling 4 source files to http://ci.sonatype.org/job/plugins-IT-with-maven-2.0.x/org.apache.maven.plugins$maven-jar-plugin/ws/target/test-classes
[INFO] [surefire:test]
[INFO] Surefire report directory: http://ci.sonatype.org/job/plugins-IT-with-maven-2.0.x/org.apache.maven.plugins$maven-jar-plugin/ws/target/surefire-reports
-------------------------------------------------------
T E S T S
-------------------------------------------------------
Running org.apache.maven.plugin.jar.JarSignVerifyMojoTest
[debug] jarsigner executable=[/opt/java/sdk/Sun/jdk1.5.0_12/jre/../bin/jarsigner]
[debug] Executing: /bin/sh -c "cd /tmp && /opt/java/sdk/Sun/jdk1.5.0_12/jre/../bin/jarsigner -verify /tmp/signed/file-version.jar"
[info] jar verified.
[debug] jarsigner executable=[/opt/java/sdk/Sun/jdk1.5.0_12/jre/../bin/jarsigner]
[debug] Executing: /bin/sh -c "cd /tmp && /opt/java/sdk/Sun/jdk1.5.0_12/jre/../bin/jarsigner -verify -verbose -certs /tmp/signed/file-version.jar"
[info] jar verified.
[debug] jarsigner executable=[/opt/java/sdk/Sun/jdk1.5.0_12/jre/../bin/jarsigner]
[debug] Executing: /bin/sh -c "cd /tmp && /opt/java/sdk/Sun/jdk1.5.0_12/jre/../bin/jarsigner -verify /tmp/signed/file-version.jar"
[debug] jarsigner executable=[/opt/java/sdk/Sun/jdk1.5.0_12/jre/../bin/jarsigner]
[debug] Executing: /bin/sh -c "cd /tmp && /opt/java/sdk/Sun/jdk1.5.0_12/jre/../bin/jarsigner -verify /tmp/signed/file-version.jar"
[info] jar is unsigned.
[debug] jarsigner executable=[/opt/java/sdk/Sun/jdk1.5.0_12/jre/../bin/jarsigner]
[debug] Executing: /bin/sh -c "cd /tmp && /opt/java/sdk/Sun/jdk1.5.0_12/jre/../bin/jarsigner -verify /tmp/signed/file-version.jar"
Tests run: 6, Failures: 0, Errors: 0, Skipped: 0, Time elapsed: 0.071 sec
Running org.apache.maven.plugin.jar.JarSignMojoTest
[debug] jarsigner executable=[/opt/java/sdk/Sun/jdk1.5.0_12/jre/../bin/jarsigner]
[debug] mdkirs: false /tmp
[debug] jarsigner executable=[/opt/java/sdk/Sun/jdk1.5.0_12/jre/../bin/jarsigner]
[debug] mdkirs: false /tmp
[debug] jarsigner executable=[/opt/java/sdk/Sun/jdk1.5.0_12/jre/../bin/jarsigner]
[debug] mdkirs: false /tmp
[debug] jarsigner executable=[/opt/java/sdk/Sun/jdk1.5.0_12/jre/../bin/jarsigner]
[debug] Executing: /bin/sh -c "cd /tmp && /opt/java/sdk/Sun/jdk1.5.0_12/jre/../bin/jarsigner -verify /tmp/signed.jar"
[info] jar verified.
[debug] jarsigner executable=[/opt/java/sdk/Sun/jdk1.5.0_12/jre/../bin/jarsigner]
[debug] Signing JAR in-place (overwritting original JAR).
[debug] jarsigner executable=[/opt/java/sdk/Sun/jdk1.5.0_12/jre/../bin/jarsigner]
[debug] Executing: /bin/sh -c "cd /tmp && /opt/java/sdk/Sun/jdk1.5.0_12/jre/../bin/jarsigner -verify /tmp/null.jar"
[info] jar verified.
[debug] jarsigner executable=[/opt/java/sdk/Sun/jdk1.5.0_12/jre/../bin/jarsigner]
[debug] mdkirs: false /tmp
[info] JAR /tmp/signed.jar is already signed. Skipping.
[debug] jarsigner executable=[/opt/java/sdk/Sun/jdk1.5.0_12/jre/../bin/jarsigner]
[debug] mdkirs: false /tmp
Tests run: 6, Failures: 0, Errors: 0, Skipped: 0, Time elapsed: 0.042 sec
Running org.apache.maven.plugin.jar.JarMojoTest
Tests run: 1, Failures: 0, Errors: 0, Skipped: 0, Time elapsed: 0.456 sec
Results :
Tests run: 13, Failures: 0, Errors: 0, Skipped: 0
[HUDSON] Recording test results
[INFO] [jar:jar]
[INFO] Building jar: http://ci.sonatype.org/job/plugins-IT-with-maven-2.0.x/org.apache.maven.plugins$maven-jar-plugin/ws/target/maven-jar-plugin-2.3-SNAPSHOT.jar
[INFO] [plugin:addPluginArtifactMetadata]
[INFO] [invoker:install {execution: integration-test}]
[INFO] Installing http://ci.sonatype.org/job/plugins-IT-with-maven-2.0.x/org.apache.maven.plugins$maven-jar-plugin/ws/pom.xml to http://ci.sonatype.org/job/plugins-IT-with-maven-2.0.x/org.apache.maven.plugins$maven-jar-plugin/ws/target/local-repo/org/apache/maven/plugins/maven-jar-plugin/2.3-SNAPSHOT/maven-jar-plugin-2.3-SNAPSHOT.pom
[INFO] Installing http://ci.sonatype.org/job/plugins-IT-with-maven-2.0.x/org.apache.maven.plugins$maven-jar-plugin/ws/target/maven-jar-plugin-2.3-SNAPSHOT.jar to http://ci.sonatype.org/job/plugins-IT-with-maven-2.0.x/org.apache.maven.plugins$maven-jar-plugin/ws/target/local-repo/org/apache/maven/plugins/maven-jar-plugin/2.3-SNAPSHOT/maven-jar-plugin-2.3-SNAPSHOT.jar
[INFO] [invoker:run {execution: integration-test}]
[INFO] Building: MJAR-80-fullcontent/pom.xml
[INFO] ...SUCCESS.
[INFO] Building: MJAR-70-recreation/pom.xml
[INFO] ...FAILED[verify script returned false].
[INFO] Building: MJAR-30-excludes/pom.xml
[INFO] ...SUCCESS.
[INFO] Building: mjar-90/pom.xml
[INFO] ...SUCCESS.
[INFO] Building: MJAR-75/pom.xml
[INFO] ...FAILED[code=1]. See http://ci.sonatype.org/job/plugins-IT-with-maven-2.0.x/org.apache.maven.plugins$maven-jar-plugin/ws/target/it/MJAR-75/build.log for details.
[INFO] Building: MJAR-60/pom.xml
[INFO] ...SUCCESS.
[INFO] Building: MJAR-30-fullcontent/pom.xml
[INFO] ...SUCCESS.
[INFO] Building: MJAR-30-include/pom.xml
[INFO] ...SUCCESS.
[INFO] Building: manifest-content/pom.xml
[INFO] ...SUCCESS.
[INFO] Building: project-004/pom.xml
[INFO] ...SUCCESS.
[INFO] Building: MJAR-80-include/pom.xml
[INFO] ...SUCCESS.
[INFO] Building: mjar-71-02/pom.xml
[INFO] ...SUCCESS.
[INFO] Building: MJAR-70-no-recreation/pom.xml
[INFO] ...FAILED[verify script returned false].
[INFO] Building: MJAR-82/pom.xml
[INFO] ...SUCCESS.
[INFO] Building: mjar-71-01/pom.xml
[INFO] ...SUCCESS.
[INFO] Building: MJAR-80-exclude/pom.xml
[INFO] ...SUCCESS.
[INFO]
---------------------------------------
Execution Summary:
Builds Passing: 13
Builds Failing: 3
---------------------------------------
The following builds failed:
* MJAR-70-recreation/pom.xml
* MJAR-75/pom.xml
* MJAR-70-no-recreation/pom.xml
[HUDSON] Archiving http://ci.sonatype.org/job/plugins-IT-with-maven-2.0.x/org.apache.maven.plugins$maven-jar-plugin/ws/pom.xml to /home/j2ee-hudson/.hudson/jobs/plugins-IT-with-maven-2.0.x/modules/org.apache.maven.plugins$maven-jar-plugin/builds/2008-11-26_00-04-36/archive/org.apache.maven.plugins/maven-jar-plugin/2.3-SNAPSHOT/pom.xml
[HUDSON] Archiving http://ci.sonatype.org/job/plugins-IT-with-maven-2.0.x/org.apache.maven.plugins$maven-jar-plugin/ws/target/maven-jar-plugin-2.3-SNAPSHOT.jar to /home/j2ee-hudson/.hudson/jobs/plugins-IT-with-maven-2.0.x/modules/org.apache.maven.plugins$maven-jar-plugin/builds/2008-11-26_00-04-36/archive/org.apache.maven.plugins/maven-jar-plugin/2.3-SNAPSHOT/maven-jar-plugin-2.3-SNAPSHOT.jar
Build failed in Hudson: plugins-IT-with-maven-2.0.x » Maven JAR Plugin #569
Posted by Hudson <Hu...@sonatype.org>.
See http://ci.sonatype.org/job/plugins-IT-with-maven-2.0.x/org.apache.maven.plugins$maven-jar-plugin/569/changes
------------------------------------------
[INFO] ------------------------------------------------------------------------
[INFO] Building Maven JAR Plugin
[INFO] task-segment: [clean, deploy]
[INFO] ------------------------------------------------------------------------
[INFO] [clean:clean]
[INFO] Deleting directory http://ci.sonatype.org/job/plugins-IT-with-maven-2.0.x/org.apache.maven.plugins$maven-jar-plugin/ws/target
Downloading: http://localhost:8081/content/groups/public/org/apache/maven/maven-project/2.0.7/maven-project-2.0.7.jar
113K downloaded
Downloading: http://localhost:8081/content/groups/public/org/apache/maven/maven-settings/2.0.7/maven-settings-2.0.7.jar
47K downloaded
Downloading: http://localhost:8081/content/groups/public/org/apache/maven/maven-model/2.0.7/maven-model-2.0.7.jar
84K downloaded
Downloading: http://localhost:8081/content/groups/public/org/apache/maven/maven-profile/2.0.7/maven-profile-2.0.7.jar
34K downloaded
Downloading: http://localhost:8081/content/groups/public/org/apache/maven/maven-artifact-manager/2.0.7/maven-artifact-manager-2.0.7.jar
55K downloaded
Downloading: http://localhost:8081/content/groups/public/org/apache/maven/maven-repository-metadata/2.0.7/maven-repository-metadata-2.0.7.jar
23K downloaded
Downloading: http://localhost:8081/content/groups/public/org/apache/maven/maven-artifact/2.0.7/maven-artifact-2.0.7.jar
85K downloaded
Downloading: http://localhost:8081/content/groups/public/org/apache/maven/maven-plugin-registry/2.0.7/maven-plugin-registry-2.0.7.jar
28K downloaded
Downloading: http://localhost:8081/content/groups/public/org/codehaus/plexus/plexus-interpolation/1.5/plexus-interpolation-1.5.jar
40K downloaded
[INFO] [enforcer:enforce {execution: ensure-no-container-api}]
[INFO] [plugin:helpmojo {execution: generated-helpmojo}]
[INFO] Using 2 extractors.
[INFO] Applying extractor for language: java
[INFO] Extractor for language: java found 4 mojo descriptors.
[INFO] Applying extractor for language: bsh
[INFO] Extractor for language: bsh found 0 mojo descriptors.
[INFO] [plugin:descriptor]
[INFO] Using 2 extractors.
[INFO] Applying extractor for language: java
[INFO] Extractor for language: java found 5 mojo descriptors.
[INFO] Applying extractor for language: bsh
[INFO] Extractor for language: bsh found 0 mojo descriptors.
[INFO] [remote-resources:process {execution: default}]
[INFO] [resources:resources]
[INFO] Using encoding: 'UTF-8' to copy filtered resources.
[INFO] [compiler:compile]
[INFO] Compiling 6 source files to http://ci.sonatype.org/job/plugins-IT-with-maven-2.0.x/org.apache.maven.plugins$maven-jar-plugin/ws/target/classes
[INFO] [resources:testResources]
[INFO] Using encoding: 'UTF-8' to copy filtered resources.
[INFO] [compiler:testCompile]
[INFO] Compiling 4 source files to http://ci.sonatype.org/job/plugins-IT-with-maven-2.0.x/org.apache.maven.plugins$maven-jar-plugin/ws/target/test-classes
[INFO] [surefire:test]
[INFO] Surefire report directory: http://ci.sonatype.org/job/plugins-IT-with-maven-2.0.x/org.apache.maven.plugins$maven-jar-plugin/ws/target/surefire-reports
-------------------------------------------------------
T E S T S
-------------------------------------------------------
Running org.apache.maven.plugin.jar.JarSignVerifyMojoTest
[debug] jarsigner executable=[/opt/java/sdk/Sun/jdk1.5.0_12/jre/../bin/jarsigner]
[debug] Executing: /bin/sh -c "cd /tmp && /opt/java/sdk/Sun/jdk1.5.0_12/jre/../bin/jarsigner -verify /tmp/signed/file-version.jar"
[info] jar verified.
[debug] jarsigner executable=[/opt/java/sdk/Sun/jdk1.5.0_12/jre/../bin/jarsigner]
[debug] Executing: /bin/sh -c "cd /tmp && /opt/java/sdk/Sun/jdk1.5.0_12/jre/../bin/jarsigner -verify -verbose -certs /tmp/signed/file-version.jar"
[info] jar verified.
[debug] jarsigner executable=[/opt/java/sdk/Sun/jdk1.5.0_12/jre/../bin/jarsigner]
[debug] Executing: /bin/sh -c "cd /tmp && /opt/java/sdk/Sun/jdk1.5.0_12/jre/../bin/jarsigner -verify /tmp/signed/file-version.jar"
[debug] jarsigner executable=[/opt/java/sdk/Sun/jdk1.5.0_12/jre/../bin/jarsigner]
[debug] Executing: /bin/sh -c "cd /tmp && /opt/java/sdk/Sun/jdk1.5.0_12/jre/../bin/jarsigner -verify /tmp/signed/file-version.jar"
[info] jar is unsigned.
[debug] jarsigner executable=[/opt/java/sdk/Sun/jdk1.5.0_12/jre/../bin/jarsigner]
[debug] Executing: /bin/sh -c "cd /tmp && /opt/java/sdk/Sun/jdk1.5.0_12/jre/../bin/jarsigner -verify /tmp/signed/file-version.jar"
Tests run: 6, Failures: 0, Errors: 0, Skipped: 0, Time elapsed: 0.071 sec
Running org.apache.maven.plugin.jar.JarSignMojoTest
[debug] jarsigner executable=[/opt/java/sdk/Sun/jdk1.5.0_12/jre/../bin/jarsigner]
[debug] mdkirs: false /tmp
[debug] jarsigner executable=[/opt/java/sdk/Sun/jdk1.5.0_12/jre/../bin/jarsigner]
[debug] mdkirs: false /tmp
[debug] jarsigner executable=[/opt/java/sdk/Sun/jdk1.5.0_12/jre/../bin/jarsigner]
[debug] mdkirs: false /tmp
[debug] jarsigner executable=[/opt/java/sdk/Sun/jdk1.5.0_12/jre/../bin/jarsigner]
[debug] Executing: /bin/sh -c "cd /tmp && /opt/java/sdk/Sun/jdk1.5.0_12/jre/../bin/jarsigner -verify /tmp/signed.jar"
[info] jar verified.
[debug] jarsigner executable=[/opt/java/sdk/Sun/jdk1.5.0_12/jre/../bin/jarsigner]
[debug] Signing JAR in-place (overwritting original JAR).
[debug] jarsigner executable=[/opt/java/sdk/Sun/jdk1.5.0_12/jre/../bin/jarsigner]
[debug] Executing: /bin/sh -c "cd /tmp && /opt/java/sdk/Sun/jdk1.5.0_12/jre/../bin/jarsigner -verify /tmp/null.jar"
[info] jar verified.
[debug] jarsigner executable=[/opt/java/sdk/Sun/jdk1.5.0_12/jre/../bin/jarsigner]
[debug] mdkirs: false /tmp
[info] JAR /tmp/signed.jar is already signed. Skipping.
[debug] jarsigner executable=[/opt/java/sdk/Sun/jdk1.5.0_12/jre/../bin/jarsigner]
[debug] mdkirs: false /tmp
Tests run: 6, Failures: 0, Errors: 0, Skipped: 0, Time elapsed: 0.042 sec
Running org.apache.maven.plugin.jar.JarMojoTest
Tests run: 1, Failures: 0, Errors: 0, Skipped: 0, Time elapsed: 0.466 sec
Results :
Tests run: 13, Failures: 0, Errors: 0, Skipped: 0
[HUDSON] Recording test results
[INFO] [jar:jar]
[INFO] Building jar: http://ci.sonatype.org/job/plugins-IT-with-maven-2.0.x/org.apache.maven.plugins$maven-jar-plugin/ws/target/maven-jar-plugin-2.3-SNAPSHOT.jar
[INFO] [plugin:addPluginArtifactMetadata]
[INFO] [invoker:install {execution: integration-test}]
[INFO] Installing http://ci.sonatype.org/job/plugins-IT-with-maven-2.0.x/org.apache.maven.plugins$maven-jar-plugin/ws/pom.xml to http://ci.sonatype.org/job/plugins-IT-with-maven-2.0.x/org.apache.maven.plugins$maven-jar-plugin/ws/target/local-repo/org/apache/maven/plugins/maven-jar-plugin/2.3-SNAPSHOT/maven-jar-plugin-2.3-SNAPSHOT.pom
[INFO] Installing http://ci.sonatype.org/job/plugins-IT-with-maven-2.0.x/org.apache.maven.plugins$maven-jar-plugin/ws/target/maven-jar-plugin-2.3-SNAPSHOT.jar to http://ci.sonatype.org/job/plugins-IT-with-maven-2.0.x/org.apache.maven.plugins$maven-jar-plugin/ws/target/local-repo/org/apache/maven/plugins/maven-jar-plugin/2.3-SNAPSHOT/maven-jar-plugin-2.3-SNAPSHOT.jar
[INFO] [invoker:run {execution: integration-test}]
[INFO] Building: MJAR-80-fullcontent/pom.xml
[INFO] ...SUCCESS.
[INFO] Building: MJAR-70-recreation/pom.xml
[INFO] ...FAILED[verify script returned false].
[INFO] Building: MJAR-30-excludes/pom.xml
[INFO] ...SUCCESS.
[INFO] Building: mjar-90/pom.xml
[INFO] ...SUCCESS.
[INFO] Building: MJAR-75/pom.xml
[INFO] ...FAILED[code=1]. See http://ci.sonatype.org/job/plugins-IT-with-maven-2.0.x/org.apache.maven.plugins$maven-jar-plugin/ws/target/it/MJAR-75/build.log for details.
[INFO] Building: MJAR-60/pom.xml
[INFO] ...SUCCESS.
[INFO] Building: MJAR-30-fullcontent/pom.xml
[INFO] ...SUCCESS.
[INFO] Building: MJAR-30-include/pom.xml
[INFO] ...SUCCESS.
[INFO] Building: manifest-content/pom.xml
[INFO] ...SUCCESS.
[INFO] Building: project-004/pom.xml
[INFO] ...SUCCESS.
[INFO] Building: MJAR-80-include/pom.xml
[INFO] ...SUCCESS.
[INFO] Building: mjar-71-02/pom.xml
[INFO] ...SUCCESS.
[INFO] Building: MJAR-70-no-recreation/pom.xml
[INFO] ...FAILED[verify script returned false].
[INFO] Building: MJAR-82/pom.xml
[INFO] ...SUCCESS.
[INFO] Building: mjar-71-01/pom.xml
[INFO] ...SUCCESS.
[INFO] Building: MJAR-80-exclude/pom.xml
[INFO] ...SUCCESS.
[INFO]
---------------------------------------
Execution Summary:
Builds Passing: 13
Builds Failing: 3
---------------------------------------
The following builds failed:
* MJAR-70-recreation/pom.xml
* MJAR-75/pom.xml
* MJAR-70-no-recreation/pom.xml
[HUDSON] Archiving http://ci.sonatype.org/job/plugins-IT-with-maven-2.0.x/org.apache.maven.plugins$maven-jar-plugin/ws/pom.xml to /home/j2ee-hudson/.hudson/jobs/plugins-IT-with-maven-2.0.x/modules/org.apache.maven.plugins$maven-jar-plugin/builds/2008-11-25_00-04-39/archive/org.apache.maven.plugins/maven-jar-plugin/2.3-SNAPSHOT/pom.xml
[HUDSON] Archiving http://ci.sonatype.org/job/plugins-IT-with-maven-2.0.x/org.apache.maven.plugins$maven-jar-plugin/ws/target/maven-jar-plugin-2.3-SNAPSHOT.jar to /home/j2ee-hudson/.hudson/jobs/plugins-IT-with-maven-2.0.x/modules/org.apache.maven.plugins$maven-jar-plugin/builds/2008-11-25_00-04-39/archive/org.apache.maven.plugins/maven-jar-plugin/2.3-SNAPSHOT/maven-jar-plugin-2.3-SNAPSHOT.jar
Build failed in Hudson: plugins-IT-with-maven-2.0.x » Maven JAR Plugin #568
Posted by Hudson <Hu...@sonatype.org>.
See http://ci.sonatype.org/job/plugins-IT-with-maven-2.0.x/org.apache.maven.plugins$maven-jar-plugin/568/changes
------------------------------------------
[INFO] ------------------------------------------------------------------------
[INFO] Building Maven JAR Plugin
[INFO] task-segment: [clean, deploy]
[INFO] ------------------------------------------------------------------------
[INFO] [clean:clean]
[INFO] Deleting directory http://ci.sonatype.org/job/plugins-IT-with-maven-2.0.x/org.apache.maven.plugins$maven-jar-plugin/ws/target
Downloading: http://localhost:8081/content/groups/public/org/apache/maven/maven-project/2.0.7/maven-project-2.0.7.jar
113K downloaded
Downloading: http://localhost:8081/content/groups/public/org/apache/maven/maven-settings/2.0.7/maven-settings-2.0.7.jar
47K downloaded
Downloading: http://localhost:8081/content/groups/public/org/apache/maven/maven-model/2.0.7/maven-model-2.0.7.jar
84K downloaded
Downloading: http://localhost:8081/content/groups/public/org/apache/maven/maven-profile/2.0.7/maven-profile-2.0.7.jar
34K downloaded
Downloading: http://localhost:8081/content/groups/public/org/apache/maven/maven-artifact-manager/2.0.7/maven-artifact-manager-2.0.7.jar
55K downloaded
Downloading: http://localhost:8081/content/groups/public/org/apache/maven/maven-repository-metadata/2.0.7/maven-repository-metadata-2.0.7.jar
23K downloaded
Downloading: http://localhost:8081/content/groups/public/org/apache/maven/maven-artifact/2.0.7/maven-artifact-2.0.7.jar
85K downloaded
Downloading: http://localhost:8081/content/groups/public/org/apache/maven/maven-plugin-registry/2.0.7/maven-plugin-registry-2.0.7.jar
28K downloaded
Downloading: http://localhost:8081/content/groups/public/org/codehaus/plexus/plexus-interpolation/1.5/plexus-interpolation-1.5.jar
40K downloaded
[INFO] [enforcer:enforce {execution: ensure-no-container-api}]
[INFO] [plugin:helpmojo {execution: generated-helpmojo}]
[INFO] Using 2 extractors.
[INFO] Applying extractor for language: java
[INFO] Extractor for language: java found 4 mojo descriptors.
[INFO] Applying extractor for language: bsh
[INFO] Extractor for language: bsh found 0 mojo descriptors.
[INFO] [plugin:descriptor]
[INFO] Using 2 extractors.
[INFO] Applying extractor for language: java
[INFO] Extractor for language: java found 5 mojo descriptors.
[INFO] Applying extractor for language: bsh
[INFO] Extractor for language: bsh found 0 mojo descriptors.
[INFO] [remote-resources:process {execution: default}]
[INFO] [resources:resources]
[INFO] Using encoding: 'UTF-8' to copy filtered resources.
[INFO] [compiler:compile]
[INFO] Compiling 6 source files to http://ci.sonatype.org/job/plugins-IT-with-maven-2.0.x/org.apache.maven.plugins$maven-jar-plugin/ws/target/classes
[INFO] [resources:testResources]
[INFO] Using encoding: 'UTF-8' to copy filtered resources.
[INFO] [compiler:testCompile]
[INFO] Compiling 4 source files to http://ci.sonatype.org/job/plugins-IT-with-maven-2.0.x/org.apache.maven.plugins$maven-jar-plugin/ws/target/test-classes
[INFO] [surefire:test]
[INFO] Surefire report directory: http://ci.sonatype.org/job/plugins-IT-with-maven-2.0.x/org.apache.maven.plugins$maven-jar-plugin/ws/target/surefire-reports
-------------------------------------------------------
T E S T S
-------------------------------------------------------
Running org.apache.maven.plugin.jar.JarSignVerifyMojoTest
[debug] jarsigner executable=[/opt/java/sdk/Sun/jdk1.5.0_12/jre/../bin/jarsigner]
[debug] Executing: /bin/sh -c "cd /tmp && /opt/java/sdk/Sun/jdk1.5.0_12/jre/../bin/jarsigner -verify /tmp/signed/file-version.jar"
[info] jar verified.
[debug] jarsigner executable=[/opt/java/sdk/Sun/jdk1.5.0_12/jre/../bin/jarsigner]
[debug] Executing: /bin/sh -c "cd /tmp && /opt/java/sdk/Sun/jdk1.5.0_12/jre/../bin/jarsigner -verify -verbose -certs /tmp/signed/file-version.jar"
[info] jar verified.
[debug] jarsigner executable=[/opt/java/sdk/Sun/jdk1.5.0_12/jre/../bin/jarsigner]
[debug] Executing: /bin/sh -c "cd /tmp && /opt/java/sdk/Sun/jdk1.5.0_12/jre/../bin/jarsigner -verify /tmp/signed/file-version.jar"
[debug] jarsigner executable=[/opt/java/sdk/Sun/jdk1.5.0_12/jre/../bin/jarsigner]
[debug] Executing: /bin/sh -c "cd /tmp && /opt/java/sdk/Sun/jdk1.5.0_12/jre/../bin/jarsigner -verify /tmp/signed/file-version.jar"
[info] jar is unsigned.
[debug] jarsigner executable=[/opt/java/sdk/Sun/jdk1.5.0_12/jre/../bin/jarsigner]
[debug] Executing: /bin/sh -c "cd /tmp && /opt/java/sdk/Sun/jdk1.5.0_12/jre/../bin/jarsigner -verify /tmp/signed/file-version.jar"
Tests run: 6, Failures: 0, Errors: 0, Skipped: 0, Time elapsed: 0.072 sec
Running org.apache.maven.plugin.jar.JarSignMojoTest
[debug] jarsigner executable=[/opt/java/sdk/Sun/jdk1.5.0_12/jre/../bin/jarsigner]
[debug] mdkirs: false /tmp
[debug] jarsigner executable=[/opt/java/sdk/Sun/jdk1.5.0_12/jre/../bin/jarsigner]
[debug] mdkirs: false /tmp
[debug] jarsigner executable=[/opt/java/sdk/Sun/jdk1.5.0_12/jre/../bin/jarsigner]
[debug] mdkirs: false /tmp
[debug] jarsigner executable=[/opt/java/sdk/Sun/jdk1.5.0_12/jre/../bin/jarsigner]
[debug] Executing: /bin/sh -c "cd /tmp && /opt/java/sdk/Sun/jdk1.5.0_12/jre/../bin/jarsigner -verify /tmp/signed.jar"
[info] jar verified.
[debug] jarsigner executable=[/opt/java/sdk/Sun/jdk1.5.0_12/jre/../bin/jarsigner]
[debug] Signing JAR in-place (overwritting original JAR).
[debug] jarsigner executable=[/opt/java/sdk/Sun/jdk1.5.0_12/jre/../bin/jarsigner]
[debug] Executing: /bin/sh -c "cd /tmp && /opt/java/sdk/Sun/jdk1.5.0_12/jre/../bin/jarsigner -verify /tmp/null.jar"
[info] jar verified.
[debug] jarsigner executable=[/opt/java/sdk/Sun/jdk1.5.0_12/jre/../bin/jarsigner]
[debug] mdkirs: false /tmp
[info] JAR /tmp/signed.jar is already signed. Skipping.
[debug] jarsigner executable=[/opt/java/sdk/Sun/jdk1.5.0_12/jre/../bin/jarsigner]
[debug] mdkirs: false /tmp
Tests run: 6, Failures: 0, Errors: 0, Skipped: 0, Time elapsed: 0.04 sec
Running org.apache.maven.plugin.jar.JarMojoTest
Tests run: 1, Failures: 0, Errors: 0, Skipped: 0, Time elapsed: 0.483 sec
Results :
Tests run: 13, Failures: 0, Errors: 0, Skipped: 0
[HUDSON] Recording test results
[INFO] [jar:jar]
[INFO] Building jar: http://ci.sonatype.org/job/plugins-IT-with-maven-2.0.x/org.apache.maven.plugins$maven-jar-plugin/ws/target/maven-jar-plugin-2.3-SNAPSHOT.jar
[INFO] [plugin:addPluginArtifactMetadata]
[INFO] [invoker:install {execution: integration-test}]
[INFO] Installing http://ci.sonatype.org/job/plugins-IT-with-maven-2.0.x/org.apache.maven.plugins$maven-jar-plugin/ws/pom.xml to http://ci.sonatype.org/job/plugins-IT-with-maven-2.0.x/org.apache.maven.plugins$maven-jar-plugin/ws/target/local-repo/org/apache/maven/plugins/maven-jar-plugin/2.3-SNAPSHOT/maven-jar-plugin-2.3-SNAPSHOT.pom
[INFO] Installing http://ci.sonatype.org/job/plugins-IT-with-maven-2.0.x/org.apache.maven.plugins$maven-jar-plugin/ws/target/maven-jar-plugin-2.3-SNAPSHOT.jar to http://ci.sonatype.org/job/plugins-IT-with-maven-2.0.x/org.apache.maven.plugins$maven-jar-plugin/ws/target/local-repo/org/apache/maven/plugins/maven-jar-plugin/2.3-SNAPSHOT/maven-jar-plugin-2.3-SNAPSHOT.jar
[INFO] [invoker:run {execution: integration-test}]
[INFO] Building: MJAR-80-fullcontent/pom.xml
[INFO] ...SUCCESS.
[INFO] Building: MJAR-70-recreation/pom.xml
[INFO] ...FAILED[verify script returned false].
[INFO] Building: MJAR-30-excludes/pom.xml
[INFO] ...SUCCESS.
[INFO] Building: mjar-90/pom.xml
[INFO] ...SUCCESS.
[INFO] Building: MJAR-75/pom.xml
[INFO] ...FAILED[code=1]. See http://ci.sonatype.org/job/plugins-IT-with-maven-2.0.x/org.apache.maven.plugins$maven-jar-plugin/ws/target/it/MJAR-75/build.log for details.
[INFO] Building: MJAR-60/pom.xml
[INFO] ...SUCCESS.
[INFO] Building: MJAR-30-fullcontent/pom.xml
[INFO] ...SUCCESS.
[INFO] Building: MJAR-30-include/pom.xml
[INFO] ...SUCCESS.
[INFO] Building: manifest-content/pom.xml
[INFO] ...SUCCESS.
[INFO] Building: project-004/pom.xml
[INFO] ...SUCCESS.
[INFO] Building: MJAR-80-include/pom.xml
[INFO] ...SUCCESS.
[INFO] Building: mjar-71-02/pom.xml
[INFO] ...SUCCESS.
[INFO] Building: MJAR-70-no-recreation/pom.xml
[INFO] ...FAILED[verify script returned false].
[INFO] Building: MJAR-82/pom.xml
[INFO] ...SUCCESS.
[INFO] Building: mjar-71-01/pom.xml
[INFO] ...SUCCESS.
[INFO] Building: MJAR-80-exclude/pom.xml
[INFO] ...SUCCESS.
[INFO]
---------------------------------------
Execution Summary:
Builds Passing: 13
Builds Failing: 3
---------------------------------------
The following builds failed:
* MJAR-70-recreation/pom.xml
* MJAR-75/pom.xml
* MJAR-70-no-recreation/pom.xml
[HUDSON] Archiving http://ci.sonatype.org/job/plugins-IT-with-maven-2.0.x/org.apache.maven.plugins$maven-jar-plugin/ws/pom.xml to /home/j2ee-hudson/.hudson/jobs/plugins-IT-with-maven-2.0.x/modules/org.apache.maven.plugins$maven-jar-plugin/builds/2008-11-21_00-07-00/archive/org.apache.maven.plugins/maven-jar-plugin/2.3-SNAPSHOT/pom.xml
[HUDSON] Archiving http://ci.sonatype.org/job/plugins-IT-with-maven-2.0.x/org.apache.maven.plugins$maven-jar-plugin/ws/target/maven-jar-plugin-2.3-SNAPSHOT.jar to /home/j2ee-hudson/.hudson/jobs/plugins-IT-with-maven-2.0.x/modules/org.apache.maven.plugins$maven-jar-plugin/builds/2008-11-21_00-07-00/archive/org.apache.maven.plugins/maven-jar-plugin/2.3-SNAPSHOT/maven-jar-plugin-2.3-SNAPSHOT.jar
Build failed in Hudson: plugins-IT-with-maven-2.0.x » Maven JAR Plugin #567
Posted by Hudson <Hu...@sonatype.org>.
See http://ci.sonatype.org/job/plugins-IT-with-maven-2.0.x/org.apache.maven.plugins$maven-jar-plugin/567/changes
------------------------------------------
[INFO] ------------------------------------------------------------------------
[INFO] Building Maven JAR Plugin
[INFO] task-segment: [clean, deploy]
[INFO] ------------------------------------------------------------------------
[INFO] [clean:clean]
[INFO] Deleting directory http://ci.sonatype.org/job/plugins-IT-with-maven-2.0.x/org.apache.maven.plugins$maven-jar-plugin/ws/target
Downloading: http://localhost:8081/content/groups/public/org/apache/maven/maven-project/2.0.7/maven-project-2.0.7.jar
113K downloaded
Downloading: http://localhost:8081/content/groups/public/org/apache/maven/maven-settings/2.0.7/maven-settings-2.0.7.jar
47K downloaded
Downloading: http://localhost:8081/content/groups/public/org/apache/maven/maven-model/2.0.7/maven-model-2.0.7.jar
84K downloaded
Downloading: http://localhost:8081/content/groups/public/org/apache/maven/maven-profile/2.0.7/maven-profile-2.0.7.jar
34K downloaded
Downloading: http://localhost:8081/content/groups/public/org/apache/maven/maven-artifact-manager/2.0.7/maven-artifact-manager-2.0.7.jar
55K downloaded
Downloading: http://localhost:8081/content/groups/public/org/apache/maven/maven-repository-metadata/2.0.7/maven-repository-metadata-2.0.7.jar
23K downloaded
Downloading: http://localhost:8081/content/groups/public/org/apache/maven/maven-artifact/2.0.7/maven-artifact-2.0.7.jar
85K downloaded
Downloading: http://localhost:8081/content/groups/public/org/apache/maven/maven-plugin-registry/2.0.7/maven-plugin-registry-2.0.7.jar
28K downloaded
Downloading: http://localhost:8081/content/groups/public/org/codehaus/plexus/plexus-interpolation/1.5/plexus-interpolation-1.5.jar
40K downloaded
[INFO] [enforcer:enforce {execution: ensure-no-container-api}]
[INFO] [plugin:helpmojo {execution: generated-helpmojo}]
[INFO] Using 2 extractors.
[INFO] Applying extractor for language: java
[INFO] Extractor for language: java found 4 mojo descriptors.
[INFO] Applying extractor for language: bsh
[INFO] Extractor for language: bsh found 0 mojo descriptors.
[INFO] [plugin:descriptor]
[INFO] Using 2 extractors.
[INFO] Applying extractor for language: java
[INFO] Extractor for language: java found 5 mojo descriptors.
[INFO] Applying extractor for language: bsh
[INFO] Extractor for language: bsh found 0 mojo descriptors.
[INFO] [remote-resources:process {execution: default}]
[INFO] [resources:resources]
[INFO] Using encoding: 'UTF-8' to copy filtered resources.
[INFO] [compiler:compile]
[INFO] Compiling 6 source files to http://ci.sonatype.org/job/plugins-IT-with-maven-2.0.x/org.apache.maven.plugins$maven-jar-plugin/ws/target/classes
[INFO] [resources:testResources]
[INFO] Using encoding: 'UTF-8' to copy filtered resources.
[INFO] [compiler:testCompile]
[INFO] Compiling 4 source files to http://ci.sonatype.org/job/plugins-IT-with-maven-2.0.x/org.apache.maven.plugins$maven-jar-plugin/ws/target/test-classes
[INFO] [surefire:test]
[INFO] Surefire report directory: http://ci.sonatype.org/job/plugins-IT-with-maven-2.0.x/org.apache.maven.plugins$maven-jar-plugin/ws/target/surefire-reports
-------------------------------------------------------
T E S T S
-------------------------------------------------------
Running org.apache.maven.plugin.jar.JarSignVerifyMojoTest
[debug] jarsigner executable=[/opt/java/sdk/Sun/jdk1.5.0_12/jre/../bin/jarsigner]
[debug] Executing: /bin/sh -c "cd /tmp && /opt/java/sdk/Sun/jdk1.5.0_12/jre/../bin/jarsigner -verify /tmp/signed/file-version.jar"
[info] jar verified.
[debug] jarsigner executable=[/opt/java/sdk/Sun/jdk1.5.0_12/jre/../bin/jarsigner]
[debug] Executing: /bin/sh -c "cd /tmp && /opt/java/sdk/Sun/jdk1.5.0_12/jre/../bin/jarsigner -verify -verbose -certs /tmp/signed/file-version.jar"
[info] jar verified.
[debug] jarsigner executable=[/opt/java/sdk/Sun/jdk1.5.0_12/jre/../bin/jarsigner]
[debug] Executing: /bin/sh -c "cd /tmp && /opt/java/sdk/Sun/jdk1.5.0_12/jre/../bin/jarsigner -verify /tmp/signed/file-version.jar"
[debug] jarsigner executable=[/opt/java/sdk/Sun/jdk1.5.0_12/jre/../bin/jarsigner]
[debug] Executing: /bin/sh -c "cd /tmp && /opt/java/sdk/Sun/jdk1.5.0_12/jre/../bin/jarsigner -verify /tmp/signed/file-version.jar"
[info] jar is unsigned.
[debug] jarsigner executable=[/opt/java/sdk/Sun/jdk1.5.0_12/jre/../bin/jarsigner]
[debug] Executing: /bin/sh -c "cd /tmp && /opt/java/sdk/Sun/jdk1.5.0_12/jre/../bin/jarsigner -verify /tmp/signed/file-version.jar"
Tests run: 6, Failures: 0, Errors: 0, Skipped: 0, Time elapsed: 0.071 sec
Running org.apache.maven.plugin.jar.JarSignMojoTest
[debug] jarsigner executable=[/opt/java/sdk/Sun/jdk1.5.0_12/jre/../bin/jarsigner]
[debug] mdkirs: false /tmp
[debug] jarsigner executable=[/opt/java/sdk/Sun/jdk1.5.0_12/jre/../bin/jarsigner]
[debug] mdkirs: false /tmp
[debug] jarsigner executable=[/opt/java/sdk/Sun/jdk1.5.0_12/jre/../bin/jarsigner]
[debug] mdkirs: false /tmp
[debug] jarsigner executable=[/opt/java/sdk/Sun/jdk1.5.0_12/jre/../bin/jarsigner]
[debug] Executing: /bin/sh -c "cd /tmp && /opt/java/sdk/Sun/jdk1.5.0_12/jre/../bin/jarsigner -verify /tmp/signed.jar"
[info] jar verified.
[debug] jarsigner executable=[/opt/java/sdk/Sun/jdk1.5.0_12/jre/../bin/jarsigner]
[debug] Signing JAR in-place (overwritting original JAR).
[debug] jarsigner executable=[/opt/java/sdk/Sun/jdk1.5.0_12/jre/../bin/jarsigner]
[debug] Executing: /bin/sh -c "cd /tmp && /opt/java/sdk/Sun/jdk1.5.0_12/jre/../bin/jarsigner -verify /tmp/null.jar"
[info] jar verified.
[debug] jarsigner executable=[/opt/java/sdk/Sun/jdk1.5.0_12/jre/../bin/jarsigner]
[debug] mdkirs: false /tmp
[info] JAR /tmp/signed.jar is already signed. Skipping.
[debug] jarsigner executable=[/opt/java/sdk/Sun/jdk1.5.0_12/jre/../bin/jarsigner]
[debug] mdkirs: false /tmp
Tests run: 6, Failures: 0, Errors: 0, Skipped: 0, Time elapsed: 0.04 sec
Running org.apache.maven.plugin.jar.JarMojoTest
Tests run: 1, Failures: 0, Errors: 0, Skipped: 0, Time elapsed: 0.482 sec
Results :
Tests run: 13, Failures: 0, Errors: 0, Skipped: 0
[HUDSON] Recording test results
[INFO] [jar:jar]
[INFO] Building jar: http://ci.sonatype.org/job/plugins-IT-with-maven-2.0.x/org.apache.maven.plugins$maven-jar-plugin/ws/target/maven-jar-plugin-2.3-SNAPSHOT.jar
[INFO] [plugin:addPluginArtifactMetadata]
[INFO] [invoker:install {execution: integration-test}]
[INFO] Installing http://ci.sonatype.org/job/plugins-IT-with-maven-2.0.x/org.apache.maven.plugins$maven-jar-plugin/ws/pom.xml to http://ci.sonatype.org/job/plugins-IT-with-maven-2.0.x/org.apache.maven.plugins$maven-jar-plugin/ws/target/local-repo/org/apache/maven/plugins/maven-jar-plugin/2.3-SNAPSHOT/maven-jar-plugin-2.3-SNAPSHOT.pom
[INFO] Installing http://ci.sonatype.org/job/plugins-IT-with-maven-2.0.x/org.apache.maven.plugins$maven-jar-plugin/ws/target/maven-jar-plugin-2.3-SNAPSHOT.jar to http://ci.sonatype.org/job/plugins-IT-with-maven-2.0.x/org.apache.maven.plugins$maven-jar-plugin/ws/target/local-repo/org/apache/maven/plugins/maven-jar-plugin/2.3-SNAPSHOT/maven-jar-plugin-2.3-SNAPSHOT.jar
[INFO] [invoker:run {execution: integration-test}]
[INFO] Building: MJAR-80-fullcontent/pom.xml
[INFO] ...SUCCESS.
[INFO] Building: MJAR-70-recreation/pom.xml
[INFO] ...FAILED[verify script returned false].
[INFO] Building: MJAR-30-excludes/pom.xml
[INFO] ...SUCCESS.
[INFO] Building: mjar-90/pom.xml
[INFO] ...SUCCESS.
[INFO] Building: MJAR-75/pom.xml
[INFO] ...FAILED[code=1]. See http://ci.sonatype.org/job/plugins-IT-with-maven-2.0.x/org.apache.maven.plugins$maven-jar-plugin/ws/target/it/MJAR-75/build.log for details.
[INFO] Building: MJAR-60/pom.xml
[INFO] ...SUCCESS.
[INFO] Building: MJAR-30-fullcontent/pom.xml
[INFO] ...SUCCESS.
[INFO] Building: MJAR-30-include/pom.xml
[INFO] ...SUCCESS.
[INFO] Building: manifest-content/pom.xml
[INFO] ...SUCCESS.
[INFO] Building: project-004/pom.xml
[INFO] ...SUCCESS.
[INFO] Building: MJAR-80-include/pom.xml
[INFO] ...SUCCESS.
[INFO] Building: mjar-71-02/pom.xml
[INFO] ...SUCCESS.
[INFO] Building: MJAR-70-no-recreation/pom.xml
[INFO] ...FAILED[verify script returned false].
[INFO] Building: MJAR-82/pom.xml
[INFO] ...SUCCESS.
[INFO] Building: mjar-71-01/pom.xml
[INFO] ...SUCCESS.
[INFO] Building: MJAR-80-exclude/pom.xml
[INFO] ...SUCCESS.
[INFO]
---------------------------------------
Execution Summary:
Builds Passing: 13
Builds Failing: 3
---------------------------------------
The following builds failed:
* MJAR-70-recreation/pom.xml
* MJAR-75/pom.xml
* MJAR-70-no-recreation/pom.xml
[HUDSON] Archiving http://ci.sonatype.org/job/plugins-IT-with-maven-2.0.x/org.apache.maven.plugins$maven-jar-plugin/ws/pom.xml to /home/j2ee-hudson/.hudson/jobs/plugins-IT-with-maven-2.0.x/modules/org.apache.maven.plugins$maven-jar-plugin/builds/2008-11-20_00-09-24/archive/org.apache.maven.plugins/maven-jar-plugin/2.3-SNAPSHOT/pom.xml
[HUDSON] Archiving http://ci.sonatype.org/job/plugins-IT-with-maven-2.0.x/org.apache.maven.plugins$maven-jar-plugin/ws/target/maven-jar-plugin-2.3-SNAPSHOT.jar to /home/j2ee-hudson/.hudson/jobs/plugins-IT-with-maven-2.0.x/modules/org.apache.maven.plugins$maven-jar-plugin/builds/2008-11-20_00-09-24/archive/org.apache.maven.plugins/maven-jar-plugin/2.3-SNAPSHOT/maven-jar-plugin-2.3-SNAPSHOT.jar
Build failed in Hudson: plugins-IT-with-maven-2.0.x » Maven JAR Plugin #566
Posted by Hudson <Hu...@sonatype.org>.
See http://ci.sonatype.org/job/plugins-IT-with-maven-2.0.x/org.apache.maven.plugins$maven-jar-plugin/566/changes
------------------------------------------
[INFO] ------------------------------------------------------------------------
[INFO] Building Maven JAR Plugin
[INFO] task-segment: [clean, deploy]
[INFO] ------------------------------------------------------------------------
[INFO] [clean:clean]
[INFO] Deleting directory http://ci.sonatype.org/job/plugins-IT-with-maven-2.0.x/org.apache.maven.plugins$maven-jar-plugin/ws/target
Downloading: http://localhost:8081/content/groups/public/org/apache/maven/maven-project/2.0.7/maven-project-2.0.7.jar
113K downloaded
Downloading: http://localhost:8081/content/groups/public/org/apache/maven/maven-settings/2.0.7/maven-settings-2.0.7.jar
47K downloaded
Downloading: http://localhost:8081/content/groups/public/org/apache/maven/maven-model/2.0.7/maven-model-2.0.7.jar
84K downloaded
Downloading: http://localhost:8081/content/groups/public/org/apache/maven/maven-profile/2.0.7/maven-profile-2.0.7.jar
34K downloaded
Downloading: http://localhost:8081/content/groups/public/org/apache/maven/maven-artifact-manager/2.0.7/maven-artifact-manager-2.0.7.jar
55K downloaded
Downloading: http://localhost:8081/content/groups/public/org/apache/maven/maven-repository-metadata/2.0.7/maven-repository-metadata-2.0.7.jar
23K downloaded
Downloading: http://localhost:8081/content/groups/public/org/apache/maven/maven-artifact/2.0.7/maven-artifact-2.0.7.jar
85K downloaded
Downloading: http://localhost:8081/content/groups/public/org/apache/maven/maven-plugin-registry/2.0.7/maven-plugin-registry-2.0.7.jar
28K downloaded
Downloading: http://localhost:8081/content/groups/public/org/codehaus/plexus/plexus-interpolation/1.5/plexus-interpolation-1.5.jar
40K downloaded
[INFO] [enforcer:enforce {execution: ensure-no-container-api}]
[INFO] [plugin:helpmojo {execution: generated-helpmojo}]
[INFO] Using 2 extractors.
[INFO] Applying extractor for language: java
[INFO] Extractor for language: java found 4 mojo descriptors.
[INFO] Applying extractor for language: bsh
[INFO] Extractor for language: bsh found 0 mojo descriptors.
[INFO] [plugin:descriptor]
[INFO] Using 2 extractors.
[INFO] Applying extractor for language: java
[INFO] Extractor for language: java found 5 mojo descriptors.
[INFO] Applying extractor for language: bsh
[INFO] Extractor for language: bsh found 0 mojo descriptors.
[INFO] [remote-resources:process {execution: default}]
[INFO] [resources:resources]
[INFO] Using encoding: 'UTF-8' to copy filtered resources.
[INFO] [compiler:compile]
[INFO] Compiling 6 source files to http://ci.sonatype.org/job/plugins-IT-with-maven-2.0.x/org.apache.maven.plugins$maven-jar-plugin/ws/target/classes
[INFO] [resources:testResources]
[INFO] Using encoding: 'UTF-8' to copy filtered resources.
[INFO] [compiler:testCompile]
[INFO] Compiling 4 source files to http://ci.sonatype.org/job/plugins-IT-with-maven-2.0.x/org.apache.maven.plugins$maven-jar-plugin/ws/target/test-classes
[INFO] [surefire:test]
[INFO] Surefire report directory: http://ci.sonatype.org/job/plugins-IT-with-maven-2.0.x/org.apache.maven.plugins$maven-jar-plugin/ws/target/surefire-reports
-------------------------------------------------------
T E S T S
-------------------------------------------------------
Running org.apache.maven.plugin.jar.JarSignVerifyMojoTest
[debug] jarsigner executable=[/opt/java/sdk/Sun/jdk1.5.0_12/jre/../bin/jarsigner]
[debug] Executing: /bin/sh -c "cd /tmp && /opt/java/sdk/Sun/jdk1.5.0_12/jre/../bin/jarsigner -verify /tmp/signed/file-version.jar"
[info] jar verified.
[debug] jarsigner executable=[/opt/java/sdk/Sun/jdk1.5.0_12/jre/../bin/jarsigner]
[debug] Executing: /bin/sh -c "cd /tmp && /opt/java/sdk/Sun/jdk1.5.0_12/jre/../bin/jarsigner -verify -verbose -certs /tmp/signed/file-version.jar"
[info] jar verified.
[debug] jarsigner executable=[/opt/java/sdk/Sun/jdk1.5.0_12/jre/../bin/jarsigner]
[debug] Executing: /bin/sh -c "cd /tmp && /opt/java/sdk/Sun/jdk1.5.0_12/jre/../bin/jarsigner -verify /tmp/signed/file-version.jar"
[debug] jarsigner executable=[/opt/java/sdk/Sun/jdk1.5.0_12/jre/../bin/jarsigner]
[debug] Executing: /bin/sh -c "cd /tmp && /opt/java/sdk/Sun/jdk1.5.0_12/jre/../bin/jarsigner -verify /tmp/signed/file-version.jar"
[info] jar is unsigned.
[debug] jarsigner executable=[/opt/java/sdk/Sun/jdk1.5.0_12/jre/../bin/jarsigner]
[debug] Executing: /bin/sh -c "cd /tmp && /opt/java/sdk/Sun/jdk1.5.0_12/jre/../bin/jarsigner -verify /tmp/signed/file-version.jar"
Tests run: 6, Failures: 0, Errors: 0, Skipped: 0, Time elapsed: 0.073 sec
Running org.apache.maven.plugin.jar.JarSignMojoTest
[debug] jarsigner executable=[/opt/java/sdk/Sun/jdk1.5.0_12/jre/../bin/jarsigner]
[debug] mdkirs: false /tmp
[debug] jarsigner executable=[/opt/java/sdk/Sun/jdk1.5.0_12/jre/../bin/jarsigner]
[debug] mdkirs: false /tmp
[debug] jarsigner executable=[/opt/java/sdk/Sun/jdk1.5.0_12/jre/../bin/jarsigner]
[debug] mdkirs: false /tmp
[debug] jarsigner executable=[/opt/java/sdk/Sun/jdk1.5.0_12/jre/../bin/jarsigner]
[debug] Executing: /bin/sh -c "cd /tmp && /opt/java/sdk/Sun/jdk1.5.0_12/jre/../bin/jarsigner -verify /tmp/signed.jar"
[info] jar verified.
[debug] jarsigner executable=[/opt/java/sdk/Sun/jdk1.5.0_12/jre/../bin/jarsigner]
[debug] Signing JAR in-place (overwritting original JAR).
[debug] jarsigner executable=[/opt/java/sdk/Sun/jdk1.5.0_12/jre/../bin/jarsigner]
[debug] Executing: /bin/sh -c "cd /tmp && /opt/java/sdk/Sun/jdk1.5.0_12/jre/../bin/jarsigner -verify /tmp/null.jar"
[info] jar verified.
[debug] jarsigner executable=[/opt/java/sdk/Sun/jdk1.5.0_12/jre/../bin/jarsigner]
[debug] mdkirs: false /tmp
[info] JAR /tmp/signed.jar is already signed. Skipping.
[debug] jarsigner executable=[/opt/java/sdk/Sun/jdk1.5.0_12/jre/../bin/jarsigner]
[debug] mdkirs: false /tmp
Tests run: 6, Failures: 0, Errors: 0, Skipped: 0, Time elapsed: 0.043 sec
Running org.apache.maven.plugin.jar.JarMojoTest
Tests run: 1, Failures: 0, Errors: 0, Skipped: 0, Time elapsed: 0.478 sec
Results :
Tests run: 13, Failures: 0, Errors: 0, Skipped: 0
[HUDSON] Recording test results
[INFO] [jar:jar]
[INFO] Building jar: http://ci.sonatype.org/job/plugins-IT-with-maven-2.0.x/org.apache.maven.plugins$maven-jar-plugin/ws/target/maven-jar-plugin-2.3-SNAPSHOT.jar
[INFO] [plugin:addPluginArtifactMetadata]
[INFO] [invoker:install {execution: integration-test}]
[INFO] Installing http://ci.sonatype.org/job/plugins-IT-with-maven-2.0.x/org.apache.maven.plugins$maven-jar-plugin/ws/pom.xml to http://ci.sonatype.org/job/plugins-IT-with-maven-2.0.x/org.apache.maven.plugins$maven-jar-plugin/ws/target/local-repo/org/apache/maven/plugins/maven-jar-plugin/2.3-SNAPSHOT/maven-jar-plugin-2.3-SNAPSHOT.pom
[INFO] Installing http://ci.sonatype.org/job/plugins-IT-with-maven-2.0.x/org.apache.maven.plugins$maven-jar-plugin/ws/target/maven-jar-plugin-2.3-SNAPSHOT.jar to http://ci.sonatype.org/job/plugins-IT-with-maven-2.0.x/org.apache.maven.plugins$maven-jar-plugin/ws/target/local-repo/org/apache/maven/plugins/maven-jar-plugin/2.3-SNAPSHOT/maven-jar-plugin-2.3-SNAPSHOT.jar
[INFO] [invoker:run {execution: integration-test}]
[INFO] Building: MJAR-80-fullcontent/pom.xml
[INFO] ...SUCCESS.
[INFO] Building: MJAR-70-recreation/pom.xml
[INFO] ...FAILED[verify script returned false].
[INFO] Building: MJAR-30-excludes/pom.xml
[INFO] ...SUCCESS.
[INFO] Building: mjar-90/pom.xml
[INFO] ...SUCCESS.
[INFO] Building: MJAR-75/pom.xml
[INFO] ...FAILED[code=1]. See http://ci.sonatype.org/job/plugins-IT-with-maven-2.0.x/org.apache.maven.plugins$maven-jar-plugin/ws/target/it/MJAR-75/build.log for details.
[INFO] Building: MJAR-60/pom.xml
[INFO] ...SUCCESS.
[INFO] Building: MJAR-30-fullcontent/pom.xml
[INFO] ...SUCCESS.
[INFO] Building: MJAR-30-include/pom.xml
[INFO] ...SUCCESS.
[INFO] Building: manifest-content/pom.xml
[INFO] ...SUCCESS.
[INFO] Building: project-004/pom.xml
[INFO] ...SUCCESS.
[INFO] Building: MJAR-80-include/pom.xml
[INFO] ...SUCCESS.
[INFO] Building: mjar-71-02/pom.xml
[INFO] ...SUCCESS.
[INFO] Building: MJAR-70-no-recreation/pom.xml
[INFO] ...FAILED[verify script returned false].
[INFO] Building: MJAR-82/pom.xml
[INFO] ...SUCCESS.
[INFO] Building: mjar-71-01/pom.xml
[INFO] ...SUCCESS.
[INFO] Building: MJAR-80-exclude/pom.xml
[INFO] ...SUCCESS.
[INFO]
---------------------------------------
Execution Summary:
Builds Passing: 13
Builds Failing: 3
---------------------------------------
The following builds failed:
* MJAR-70-recreation/pom.xml
* MJAR-75/pom.xml
* MJAR-70-no-recreation/pom.xml
[HUDSON] Archiving http://ci.sonatype.org/job/plugins-IT-with-maven-2.0.x/org.apache.maven.plugins$maven-jar-plugin/ws/pom.xml to /home/j2ee-hudson/.hudson/jobs/plugins-IT-with-maven-2.0.x/modules/org.apache.maven.plugins$maven-jar-plugin/builds/2008-11-19_00-09-42/archive/org.apache.maven.plugins/maven-jar-plugin/2.3-SNAPSHOT/pom.xml
[HUDSON] Archiving http://ci.sonatype.org/job/plugins-IT-with-maven-2.0.x/org.apache.maven.plugins$maven-jar-plugin/ws/target/maven-jar-plugin-2.3-SNAPSHOT.jar to /home/j2ee-hudson/.hudson/jobs/plugins-IT-with-maven-2.0.x/modules/org.apache.maven.plugins$maven-jar-plugin/builds/2008-11-19_00-09-42/archive/org.apache.maven.plugins/maven-jar-plugin/2.3-SNAPSHOT/maven-jar-plugin-2.3-SNAPSHOT.jar
Build failed in Hudson: plugins-IT-with-maven-2.0.x » Maven JAR Plugin #565
Posted by Hudson <Hu...@sonatype.org>.
See http://ci.sonatype.org/job/plugins-IT-with-maven-2.0.x/org.apache.maven.plugins$maven-jar-plugin/565/changes
------------------------------------------
[INFO] ------------------------------------------------------------------------
[INFO] Building Maven JAR Plugin
[INFO] task-segment: [clean, deploy]
[INFO] ------------------------------------------------------------------------
[INFO] [clean:clean]
[INFO] Deleting directory http://ci.sonatype.org/job/plugins-IT-with-maven-2.0.x/org.apache.maven.plugins$maven-jar-plugin/ws/target
Downloading: http://localhost:8081/content/groups/public/org/apache/maven/maven-project/2.0.7/maven-project-2.0.7.jar
113K downloaded
Downloading: http://localhost:8081/content/groups/public/org/apache/maven/maven-settings/2.0.7/maven-settings-2.0.7.jar
47K downloaded
Downloading: http://localhost:8081/content/groups/public/org/apache/maven/maven-model/2.0.7/maven-model-2.0.7.jar
84K downloaded
Downloading: http://localhost:8081/content/groups/public/org/apache/maven/maven-profile/2.0.7/maven-profile-2.0.7.jar
34K downloaded
Downloading: http://localhost:8081/content/groups/public/org/apache/maven/maven-artifact-manager/2.0.7/maven-artifact-manager-2.0.7.jar
55K downloaded
Downloading: http://localhost:8081/content/groups/public/org/apache/maven/maven-repository-metadata/2.0.7/maven-repository-metadata-2.0.7.jar
23K downloaded
Downloading: http://localhost:8081/content/groups/public/org/apache/maven/maven-artifact/2.0.7/maven-artifact-2.0.7.jar
85K downloaded
Downloading: http://localhost:8081/content/groups/public/org/apache/maven/maven-plugin-registry/2.0.7/maven-plugin-registry-2.0.7.jar
28K downloaded
Downloading: http://localhost:8081/content/groups/public/org/codehaus/plexus/plexus-interpolation/1.5/plexus-interpolation-1.5.jar
40K downloaded
[INFO] [enforcer:enforce {execution: ensure-no-container-api}]
[INFO] [plugin:helpmojo {execution: generated-helpmojo}]
[INFO] Using 2 extractors.
[INFO] Applying extractor for language: java
[INFO] Extractor for language: java found 4 mojo descriptors.
[INFO] Applying extractor for language: bsh
[INFO] Extractor for language: bsh found 0 mojo descriptors.
[INFO] [plugin:descriptor]
[INFO] Using 2 extractors.
[INFO] Applying extractor for language: java
[INFO] Extractor for language: java found 5 mojo descriptors.
[INFO] Applying extractor for language: bsh
[INFO] Extractor for language: bsh found 0 mojo descriptors.
[INFO] [remote-resources:process {execution: default}]
[INFO] [resources:resources]
[INFO] Using encoding: 'UTF-8' to copy filtered resources.
[INFO] [compiler:compile]
[INFO] Compiling 6 source files to http://ci.sonatype.org/job/plugins-IT-with-maven-2.0.x/org.apache.maven.plugins$maven-jar-plugin/ws/target/classes
[INFO] [resources:testResources]
[INFO] Using encoding: 'UTF-8' to copy filtered resources.
[INFO] [compiler:testCompile]
[INFO] Compiling 4 source files to http://ci.sonatype.org/job/plugins-IT-with-maven-2.0.x/org.apache.maven.plugins$maven-jar-plugin/ws/target/test-classes
[INFO] [surefire:test]
[INFO] Surefire report directory: http://ci.sonatype.org/job/plugins-IT-with-maven-2.0.x/org.apache.maven.plugins$maven-jar-plugin/ws/target/surefire-reports
-------------------------------------------------------
T E S T S
-------------------------------------------------------
Running org.apache.maven.plugin.jar.JarSignVerifyMojoTest
[debug] jarsigner executable=[/opt/java/sdk/Sun/jdk1.5.0_12/jre/../bin/jarsigner]
[debug] Executing: /bin/sh -c "cd /tmp && /opt/java/sdk/Sun/jdk1.5.0_12/jre/../bin/jarsigner -verify /tmp/signed/file-version.jar"
[info] jar verified.
[debug] jarsigner executable=[/opt/java/sdk/Sun/jdk1.5.0_12/jre/../bin/jarsigner]
[debug] Executing: /bin/sh -c "cd /tmp && /opt/java/sdk/Sun/jdk1.5.0_12/jre/../bin/jarsigner -verify -verbose -certs /tmp/signed/file-version.jar"
[info] jar verified.
[debug] jarsigner executable=[/opt/java/sdk/Sun/jdk1.5.0_12/jre/../bin/jarsigner]
[debug] Executing: /bin/sh -c "cd /tmp && /opt/java/sdk/Sun/jdk1.5.0_12/jre/../bin/jarsigner -verify /tmp/signed/file-version.jar"
[debug] jarsigner executable=[/opt/java/sdk/Sun/jdk1.5.0_12/jre/../bin/jarsigner]
[debug] Executing: /bin/sh -c "cd /tmp && /opt/java/sdk/Sun/jdk1.5.0_12/jre/../bin/jarsigner -verify /tmp/signed/file-version.jar"
[info] jar is unsigned.
[debug] jarsigner executable=[/opt/java/sdk/Sun/jdk1.5.0_12/jre/../bin/jarsigner]
[debug] Executing: /bin/sh -c "cd /tmp && /opt/java/sdk/Sun/jdk1.5.0_12/jre/../bin/jarsigner -verify /tmp/signed/file-version.jar"
Tests run: 6, Failures: 0, Errors: 0, Skipped: 0, Time elapsed: 0.074 sec
Running org.apache.maven.plugin.jar.JarSignMojoTest
[debug] jarsigner executable=[/opt/java/sdk/Sun/jdk1.5.0_12/jre/../bin/jarsigner]
[debug] mdkirs: false /tmp
[debug] jarsigner executable=[/opt/java/sdk/Sun/jdk1.5.0_12/jre/../bin/jarsigner]
[debug] mdkirs: false /tmp
[debug] jarsigner executable=[/opt/java/sdk/Sun/jdk1.5.0_12/jre/../bin/jarsigner]
[debug] mdkirs: false /tmp
[debug] jarsigner executable=[/opt/java/sdk/Sun/jdk1.5.0_12/jre/../bin/jarsigner]
[debug] Executing: /bin/sh -c "cd /tmp && /opt/java/sdk/Sun/jdk1.5.0_12/jre/../bin/jarsigner -verify /tmp/signed.jar"
[info] jar verified.
[debug] jarsigner executable=[/opt/java/sdk/Sun/jdk1.5.0_12/jre/../bin/jarsigner]
[debug] Signing JAR in-place (overwritting original JAR).
[debug] jarsigner executable=[/opt/java/sdk/Sun/jdk1.5.0_12/jre/../bin/jarsigner]
[debug] Executing: /bin/sh -c "cd /tmp && /opt/java/sdk/Sun/jdk1.5.0_12/jre/../bin/jarsigner -verify /tmp/null.jar"
[info] jar verified.
[debug] jarsigner executable=[/opt/java/sdk/Sun/jdk1.5.0_12/jre/../bin/jarsigner]
[debug] mdkirs: false /tmp
[info] JAR /tmp/signed.jar is already signed. Skipping.
[debug] jarsigner executable=[/opt/java/sdk/Sun/jdk1.5.0_12/jre/../bin/jarsigner]
[debug] mdkirs: false /tmp
Tests run: 6, Failures: 0, Errors: 0, Skipped: 0, Time elapsed: 0.042 sec
Running org.apache.maven.plugin.jar.JarMojoTest
Tests run: 1, Failures: 0, Errors: 0, Skipped: 0, Time elapsed: 0.503 sec
Results :
Tests run: 13, Failures: 0, Errors: 0, Skipped: 0
[HUDSON] Recording test results
[INFO] [jar:jar]
[INFO] Building jar: http://ci.sonatype.org/job/plugins-IT-with-maven-2.0.x/org.apache.maven.plugins$maven-jar-plugin/ws/target/maven-jar-plugin-2.3-SNAPSHOT.jar
[INFO] [plugin:addPluginArtifactMetadata]
[INFO] [invoker:install {execution: integration-test}]
[INFO] Installing http://ci.sonatype.org/job/plugins-IT-with-maven-2.0.x/org.apache.maven.plugins$maven-jar-plugin/ws/pom.xml to http://ci.sonatype.org/job/plugins-IT-with-maven-2.0.x/org.apache.maven.plugins$maven-jar-plugin/ws/target/local-repo/org/apache/maven/plugins/maven-jar-plugin/2.3-SNAPSHOT/maven-jar-plugin-2.3-SNAPSHOT.pom
[INFO] Installing http://ci.sonatype.org/job/plugins-IT-with-maven-2.0.x/org.apache.maven.plugins$maven-jar-plugin/ws/target/maven-jar-plugin-2.3-SNAPSHOT.jar to http://ci.sonatype.org/job/plugins-IT-with-maven-2.0.x/org.apache.maven.plugins$maven-jar-plugin/ws/target/local-repo/org/apache/maven/plugins/maven-jar-plugin/2.3-SNAPSHOT/maven-jar-plugin-2.3-SNAPSHOT.jar
[INFO] [invoker:run {execution: integration-test}]
[INFO] Building: MJAR-80-fullcontent/pom.xml
[INFO] ...SUCCESS.
[INFO] Building: MJAR-70-recreation/pom.xml
[INFO] ...FAILED[verify script returned false].
[INFO] Building: MJAR-30-excludes/pom.xml
[INFO] ...SUCCESS.
[INFO] Building: mjar-90/pom.xml
[INFO] ...SUCCESS.
[INFO] Building: MJAR-75/pom.xml
[INFO] ...FAILED[code=1]. See http://ci.sonatype.org/job/plugins-IT-with-maven-2.0.x/org.apache.maven.plugins$maven-jar-plugin/ws/target/it/MJAR-75/build.log for details.
[INFO] Building: MJAR-60/pom.xml
[INFO] ...SUCCESS.
[INFO] Building: MJAR-30-fullcontent/pom.xml
[INFO] ...SUCCESS.
[INFO] Building: MJAR-30-include/pom.xml
[INFO] ...SUCCESS.
[INFO] Building: manifest-content/pom.xml
[INFO] ...SUCCESS.
[INFO] Building: project-004/pom.xml
[INFO] ...SUCCESS.
[INFO] Building: MJAR-80-include/pom.xml
[INFO] ...SUCCESS.
[INFO] Building: mjar-71-02/pom.xml
[INFO] ...SUCCESS.
[INFO] Building: MJAR-70-no-recreation/pom.xml
[INFO] ...FAILED[verify script returned false].
[INFO] Building: MJAR-82/pom.xml
[INFO] ...SUCCESS.
[INFO] Building: mjar-71-01/pom.xml
[INFO] ...SUCCESS.
[INFO] Building: MJAR-80-exclude/pom.xml
[INFO] ...SUCCESS.
[INFO]
---------------------------------------
Execution Summary:
Builds Passing: 13
Builds Failing: 3
---------------------------------------
The following builds failed:
* MJAR-70-recreation/pom.xml
* MJAR-75/pom.xml
* MJAR-70-no-recreation/pom.xml
[HUDSON] Archiving http://ci.sonatype.org/job/plugins-IT-with-maven-2.0.x/org.apache.maven.plugins$maven-jar-plugin/ws/pom.xml to /home/j2ee-hudson/.hudson/jobs/plugins-IT-with-maven-2.0.x/modules/org.apache.maven.plugins$maven-jar-plugin/builds/2008-11-18_00-09-59/archive/org.apache.maven.plugins/maven-jar-plugin/2.3-SNAPSHOT/pom.xml
[HUDSON] Archiving http://ci.sonatype.org/job/plugins-IT-with-maven-2.0.x/org.apache.maven.plugins$maven-jar-plugin/ws/target/maven-jar-plugin-2.3-SNAPSHOT.jar to /home/j2ee-hudson/.hudson/jobs/plugins-IT-with-maven-2.0.x/modules/org.apache.maven.plugins$maven-jar-plugin/builds/2008-11-18_00-09-59/archive/org.apache.maven.plugins/maven-jar-plugin/2.3-SNAPSHOT/maven-jar-plugin-2.3-SNAPSHOT.jar
Build failed in Hudson: plugins-IT-with-maven-2.0.x » Maven JAR Plugin #564
Posted by Hudson <Hu...@sonatype.org>.
See http://ci.sonatype.org/job/plugins-IT-with-maven-2.0.x/org.apache.maven.plugins$maven-jar-plugin/564/changes
------------------------------------------
[INFO] ------------------------------------------------------------------------
[INFO] Building Maven JAR Plugin
[INFO] task-segment: [clean, deploy]
[INFO] ------------------------------------------------------------------------
[INFO] [clean:clean]
[INFO] Deleting directory http://ci.sonatype.org/job/plugins-IT-with-maven-2.0.x/org.apache.maven.plugins$maven-jar-plugin/ws/target
Downloading: http://localhost:8081/content/groups/public/org/apache/maven/maven-project/2.0.7/maven-project-2.0.7.jar
113K downloaded
Downloading: http://localhost:8081/content/groups/public/org/apache/maven/maven-settings/2.0.7/maven-settings-2.0.7.jar
47K downloaded
Downloading: http://localhost:8081/content/groups/public/org/apache/maven/maven-model/2.0.7/maven-model-2.0.7.jar
84K downloaded
Downloading: http://localhost:8081/content/groups/public/org/apache/maven/maven-profile/2.0.7/maven-profile-2.0.7.jar
34K downloaded
Downloading: http://localhost:8081/content/groups/public/org/apache/maven/maven-artifact-manager/2.0.7/maven-artifact-manager-2.0.7.jar
55K downloaded
Downloading: http://localhost:8081/content/groups/public/org/apache/maven/maven-repository-metadata/2.0.7/maven-repository-metadata-2.0.7.jar
23K downloaded
Downloading: http://localhost:8081/content/groups/public/org/apache/maven/maven-artifact/2.0.7/maven-artifact-2.0.7.jar
85K downloaded
Downloading: http://localhost:8081/content/groups/public/org/apache/maven/maven-plugin-registry/2.0.7/maven-plugin-registry-2.0.7.jar
28K downloaded
Downloading: http://localhost:8081/content/groups/public/org/codehaus/plexus/plexus-interpolation/1.5/plexus-interpolation-1.5.jar
40K downloaded
[INFO] [enforcer:enforce {execution: ensure-no-container-api}]
[INFO] [plugin:helpmojo {execution: generated-helpmojo}]
[INFO] Using 2 extractors.
[INFO] Applying extractor for language: java
[INFO] Extractor for language: java found 4 mojo descriptors.
[INFO] Applying extractor for language: bsh
[INFO] Extractor for language: bsh found 0 mojo descriptors.
[INFO] [plugin:descriptor]
[INFO] Using 2 extractors.
[INFO] Applying extractor for language: java
[INFO] Extractor for language: java found 5 mojo descriptors.
[INFO] Applying extractor for language: bsh
[INFO] Extractor for language: bsh found 0 mojo descriptors.
[INFO] [remote-resources:process {execution: default}]
[INFO] [resources:resources]
[INFO] Using encoding: 'UTF-8' to copy filtered resources.
[INFO] [compiler:compile]
[INFO] Compiling 6 source files to http://ci.sonatype.org/job/plugins-IT-with-maven-2.0.x/org.apache.maven.plugins$maven-jar-plugin/ws/target/classes
[INFO] [resources:testResources]
[INFO] Using encoding: 'UTF-8' to copy filtered resources.
[INFO] [compiler:testCompile]
[INFO] Compiling 4 source files to http://ci.sonatype.org/job/plugins-IT-with-maven-2.0.x/org.apache.maven.plugins$maven-jar-plugin/ws/target/test-classes
[INFO] [surefire:test]
[INFO] Surefire report directory: http://ci.sonatype.org/job/plugins-IT-with-maven-2.0.x/org.apache.maven.plugins$maven-jar-plugin/ws/target/surefire-reports
-------------------------------------------------------
T E S T S
-------------------------------------------------------
Running org.apache.maven.plugin.jar.JarSignVerifyMojoTest
[debug] jarsigner executable=[/opt/java/sdk/Sun/jdk1.5.0_12/jre/../bin/jarsigner]
[debug] Executing: /bin/sh -c "cd /tmp && /opt/java/sdk/Sun/jdk1.5.0_12/jre/../bin/jarsigner -verify /tmp/signed/file-version.jar"
[info] jar verified.
[debug] jarsigner executable=[/opt/java/sdk/Sun/jdk1.5.0_12/jre/../bin/jarsigner]
[debug] Executing: /bin/sh -c "cd /tmp && /opt/java/sdk/Sun/jdk1.5.0_12/jre/../bin/jarsigner -verify -verbose -certs /tmp/signed/file-version.jar"
[info] jar verified.
[debug] jarsigner executable=[/opt/java/sdk/Sun/jdk1.5.0_12/jre/../bin/jarsigner]
[debug] Executing: /bin/sh -c "cd /tmp && /opt/java/sdk/Sun/jdk1.5.0_12/jre/../bin/jarsigner -verify /tmp/signed/file-version.jar"
[debug] jarsigner executable=[/opt/java/sdk/Sun/jdk1.5.0_12/jre/../bin/jarsigner]
[debug] Executing: /bin/sh -c "cd /tmp && /opt/java/sdk/Sun/jdk1.5.0_12/jre/../bin/jarsigner -verify /tmp/signed/file-version.jar"
[info] jar is unsigned.
[debug] jarsigner executable=[/opt/java/sdk/Sun/jdk1.5.0_12/jre/../bin/jarsigner]
[debug] Executing: /bin/sh -c "cd /tmp && /opt/java/sdk/Sun/jdk1.5.0_12/jre/../bin/jarsigner -verify /tmp/signed/file-version.jar"
Tests run: 6, Failures: 0, Errors: 0, Skipped: 0, Time elapsed: 0.072 sec
Running org.apache.maven.plugin.jar.JarSignMojoTest
[debug] jarsigner executable=[/opt/java/sdk/Sun/jdk1.5.0_12/jre/../bin/jarsigner]
[debug] mdkirs: false /tmp
[debug] jarsigner executable=[/opt/java/sdk/Sun/jdk1.5.0_12/jre/../bin/jarsigner]
[debug] mdkirs: false /tmp
[debug] jarsigner executable=[/opt/java/sdk/Sun/jdk1.5.0_12/jre/../bin/jarsigner]
[debug] mdkirs: false /tmp
[debug] jarsigner executable=[/opt/java/sdk/Sun/jdk1.5.0_12/jre/../bin/jarsigner]
[debug] Executing: /bin/sh -c "cd /tmp && /opt/java/sdk/Sun/jdk1.5.0_12/jre/../bin/jarsigner -verify /tmp/signed.jar"
[info] jar verified.
[debug] jarsigner executable=[/opt/java/sdk/Sun/jdk1.5.0_12/jre/../bin/jarsigner]
[debug] Signing JAR in-place (overwritting original JAR).
[debug] jarsigner executable=[/opt/java/sdk/Sun/jdk1.5.0_12/jre/../bin/jarsigner]
[debug] Executing: /bin/sh -c "cd /tmp && /opt/java/sdk/Sun/jdk1.5.0_12/jre/../bin/jarsigner -verify /tmp/null.jar"
[info] jar verified.
[debug] jarsigner executable=[/opt/java/sdk/Sun/jdk1.5.0_12/jre/../bin/jarsigner]
[debug] mdkirs: false /tmp
[info] JAR /tmp/signed.jar is already signed. Skipping.
[debug] jarsigner executable=[/opt/java/sdk/Sun/jdk1.5.0_12/jre/../bin/jarsigner]
[debug] mdkirs: false /tmp
Tests run: 6, Failures: 0, Errors: 0, Skipped: 0, Time elapsed: 0.042 sec
Running org.apache.maven.plugin.jar.JarMojoTest
Tests run: 1, Failures: 0, Errors: 0, Skipped: 0, Time elapsed: 0.467 sec
Results :
Tests run: 13, Failures: 0, Errors: 0, Skipped: 0
[HUDSON] Recording test results
[INFO] [jar:jar]
[INFO] Building jar: http://ci.sonatype.org/job/plugins-IT-with-maven-2.0.x/org.apache.maven.plugins$maven-jar-plugin/ws/target/maven-jar-plugin-2.3-SNAPSHOT.jar
[INFO] [plugin:addPluginArtifactMetadata]
[INFO] [invoker:install {execution: integration-test}]
[INFO] Installing http://ci.sonatype.org/job/plugins-IT-with-maven-2.0.x/org.apache.maven.plugins$maven-jar-plugin/ws/pom.xml to http://ci.sonatype.org/job/plugins-IT-with-maven-2.0.x/org.apache.maven.plugins$maven-jar-plugin/ws/target/local-repo/org/apache/maven/plugins/maven-jar-plugin/2.3-SNAPSHOT/maven-jar-plugin-2.3-SNAPSHOT.pom
[INFO] Installing http://ci.sonatype.org/job/plugins-IT-with-maven-2.0.x/org.apache.maven.plugins$maven-jar-plugin/ws/target/maven-jar-plugin-2.3-SNAPSHOT.jar to http://ci.sonatype.org/job/plugins-IT-with-maven-2.0.x/org.apache.maven.plugins$maven-jar-plugin/ws/target/local-repo/org/apache/maven/plugins/maven-jar-plugin/2.3-SNAPSHOT/maven-jar-plugin-2.3-SNAPSHOT.jar
[INFO] [invoker:run {execution: integration-test}]
[INFO] Building: MJAR-80-fullcontent/pom.xml
[INFO] ...SUCCESS.
[INFO] Building: MJAR-70-recreation/pom.xml
[INFO] ...FAILED[verify script returned false].
[INFO] Building: MJAR-30-excludes/pom.xml
[INFO] ...SUCCESS.
[INFO] Building: mjar-90/pom.xml
[INFO] ...SUCCESS.
[INFO] Building: MJAR-75/pom.xml
[INFO] ...FAILED[code=1]. See http://ci.sonatype.org/job/plugins-IT-with-maven-2.0.x/org.apache.maven.plugins$maven-jar-plugin/ws/target/it/MJAR-75/build.log for details.
[INFO] Building: MJAR-60/pom.xml
[INFO] ...SUCCESS.
[INFO] Building: MJAR-30-fullcontent/pom.xml
[INFO] ...SUCCESS.
[INFO] Building: MJAR-30-include/pom.xml
[INFO] ...SUCCESS.
[INFO] Building: manifest-content/pom.xml
[INFO] ...SUCCESS.
[INFO] Building: project-004/pom.xml
[INFO] ...SUCCESS.
[INFO] Building: MJAR-80-include/pom.xml
[INFO] ...SUCCESS.
[INFO] Building: mjar-71-02/pom.xml
[INFO] ...SUCCESS.
[INFO] Building: MJAR-70-no-recreation/pom.xml
[INFO] ...FAILED[verify script returned false].
[INFO] Building: MJAR-82/pom.xml
[INFO] ...SUCCESS.
[INFO] Building: mjar-71-01/pom.xml
[INFO] ...SUCCESS.
[INFO] Building: MJAR-80-exclude/pom.xml
[INFO] ...SUCCESS.
[INFO]
---------------------------------------
Execution Summary:
Builds Passing: 13
Builds Failing: 3
---------------------------------------
The following builds failed:
* MJAR-70-recreation/pom.xml
* MJAR-75/pom.xml
* MJAR-70-no-recreation/pom.xml
[HUDSON] Archiving http://ci.sonatype.org/job/plugins-IT-with-maven-2.0.x/org.apache.maven.plugins$maven-jar-plugin/ws/pom.xml to /home/j2ee-hudson/.hudson/jobs/plugins-IT-with-maven-2.0.x/modules/org.apache.maven.plugins$maven-jar-plugin/builds/2008-11-17_00-13-40/archive/org.apache.maven.plugins/maven-jar-plugin/2.3-SNAPSHOT/pom.xml
[HUDSON] Archiving http://ci.sonatype.org/job/plugins-IT-with-maven-2.0.x/org.apache.maven.plugins$maven-jar-plugin/ws/target/maven-jar-plugin-2.3-SNAPSHOT.jar to /home/j2ee-hudson/.hudson/jobs/plugins-IT-with-maven-2.0.x/modules/org.apache.maven.plugins$maven-jar-plugin/builds/2008-11-17_00-13-40/archive/org.apache.maven.plugins/maven-jar-plugin/2.3-SNAPSHOT/maven-jar-plugin-2.3-SNAPSHOT.jar
Build failed in Hudson: plugins-IT-with-maven-2.0.x » Maven JAR Plugin #563
Posted by Hudson <Hu...@sonatype.org>.
See http://ci.sonatype.org/job/plugins-IT-with-maven-2.0.x/org.apache.maven.plugins$maven-jar-plugin/563/changes
------------------------------------------
[INFO] ------------------------------------------------------------------------
[INFO] Building Maven JAR Plugin
[INFO] task-segment: [clean, deploy]
[INFO] ------------------------------------------------------------------------
[INFO] [clean:clean]
[INFO] Deleting directory http://ci.sonatype.org/job/plugins-IT-with-maven-2.0.x/org.apache.maven.plugins$maven-jar-plugin/ws/target
Downloading: http://localhost:8081/content/groups/public/org/apache/maven/maven-project/2.0.7/maven-project-2.0.7.jar
113K downloaded
Downloading: http://localhost:8081/content/groups/public/org/apache/maven/maven-settings/2.0.7/maven-settings-2.0.7.jar
47K downloaded
Downloading: http://localhost:8081/content/groups/public/org/apache/maven/maven-model/2.0.7/maven-model-2.0.7.jar
84K downloaded
Downloading: http://localhost:8081/content/groups/public/org/apache/maven/maven-profile/2.0.7/maven-profile-2.0.7.jar
34K downloaded
Downloading: http://localhost:8081/content/groups/public/org/apache/maven/maven-artifact-manager/2.0.7/maven-artifact-manager-2.0.7.jar
55K downloaded
Downloading: http://localhost:8081/content/groups/public/org/apache/maven/maven-repository-metadata/2.0.7/maven-repository-metadata-2.0.7.jar
23K downloaded
Downloading: http://localhost:8081/content/groups/public/org/apache/maven/maven-artifact/2.0.7/maven-artifact-2.0.7.jar
85K downloaded
Downloading: http://localhost:8081/content/groups/public/org/apache/maven/maven-plugin-registry/2.0.7/maven-plugin-registry-2.0.7.jar
28K downloaded
Downloading: http://localhost:8081/content/groups/public/org/codehaus/plexus/plexus-interpolation/1.5/plexus-interpolation-1.5.jar
40K downloaded
[INFO] [enforcer:enforce {execution: ensure-no-container-api}]
[INFO] [plugin:helpmojo {execution: generated-helpmojo}]
[INFO] Using 2 extractors.
[INFO] Applying extractor for language: java
[INFO] Extractor for language: java found 4 mojo descriptors.
[INFO] Applying extractor for language: bsh
[INFO] Extractor for language: bsh found 0 mojo descriptors.
[INFO] [plugin:descriptor]
[INFO] Using 2 extractors.
[INFO] Applying extractor for language: java
[INFO] Extractor for language: java found 5 mojo descriptors.
[INFO] Applying extractor for language: bsh
[INFO] Extractor for language: bsh found 0 mojo descriptors.
[INFO] [remote-resources:process {execution: default}]
[INFO] [resources:resources]
[INFO] Using encoding: 'UTF-8' to copy filtered resources.
[INFO] [compiler:compile]
[INFO] Compiling 6 source files to http://ci.sonatype.org/job/plugins-IT-with-maven-2.0.x/org.apache.maven.plugins$maven-jar-plugin/ws/target/classes
[INFO] [resources:testResources]
[INFO] Using encoding: 'UTF-8' to copy filtered resources.
[INFO] [compiler:testCompile]
[INFO] Compiling 4 source files to http://ci.sonatype.org/job/plugins-IT-with-maven-2.0.x/org.apache.maven.plugins$maven-jar-plugin/ws/target/test-classes
[INFO] [surefire:test]
[INFO] Surefire report directory: http://ci.sonatype.org/job/plugins-IT-with-maven-2.0.x/org.apache.maven.plugins$maven-jar-plugin/ws/target/surefire-reports
-------------------------------------------------------
T E S T S
-------------------------------------------------------
Running org.apache.maven.plugin.jar.JarSignVerifyMojoTest
[debug] jarsigner executable=[/opt/java/sdk/Sun/jdk1.5.0_12/jre/../bin/jarsigner]
[debug] Executing: /bin/sh -c "cd /tmp && /opt/java/sdk/Sun/jdk1.5.0_12/jre/../bin/jarsigner -verify /tmp/signed/file-version.jar"
[info] jar verified.
[debug] jarsigner executable=[/opt/java/sdk/Sun/jdk1.5.0_12/jre/../bin/jarsigner]
[debug] Executing: /bin/sh -c "cd /tmp && /opt/java/sdk/Sun/jdk1.5.0_12/jre/../bin/jarsigner -verify -verbose -certs /tmp/signed/file-version.jar"
[info] jar verified.
[debug] jarsigner executable=[/opt/java/sdk/Sun/jdk1.5.0_12/jre/../bin/jarsigner]
[debug] Executing: /bin/sh -c "cd /tmp && /opt/java/sdk/Sun/jdk1.5.0_12/jre/../bin/jarsigner -verify /tmp/signed/file-version.jar"
[debug] jarsigner executable=[/opt/java/sdk/Sun/jdk1.5.0_12/jre/../bin/jarsigner]
[debug] Executing: /bin/sh -c "cd /tmp && /opt/java/sdk/Sun/jdk1.5.0_12/jre/../bin/jarsigner -verify /tmp/signed/file-version.jar"
[info] jar is unsigned.
[debug] jarsigner executable=[/opt/java/sdk/Sun/jdk1.5.0_12/jre/../bin/jarsigner]
[debug] Executing: /bin/sh -c "cd /tmp && /opt/java/sdk/Sun/jdk1.5.0_12/jre/../bin/jarsigner -verify /tmp/signed/file-version.jar"
Tests run: 6, Failures: 0, Errors: 0, Skipped: 0, Time elapsed: 0.072 sec
Running org.apache.maven.plugin.jar.JarSignMojoTest
[debug] jarsigner executable=[/opt/java/sdk/Sun/jdk1.5.0_12/jre/../bin/jarsigner]
[debug] mdkirs: false /tmp
[debug] jarsigner executable=[/opt/java/sdk/Sun/jdk1.5.0_12/jre/../bin/jarsigner]
[debug] mdkirs: false /tmp
[debug] jarsigner executable=[/opt/java/sdk/Sun/jdk1.5.0_12/jre/../bin/jarsigner]
[debug] mdkirs: false /tmp
[debug] jarsigner executable=[/opt/java/sdk/Sun/jdk1.5.0_12/jre/../bin/jarsigner]
[debug] Executing: /bin/sh -c "cd /tmp && /opt/java/sdk/Sun/jdk1.5.0_12/jre/../bin/jarsigner -verify /tmp/signed.jar"
[info] jar verified.
[debug] jarsigner executable=[/opt/java/sdk/Sun/jdk1.5.0_12/jre/../bin/jarsigner]
[debug] Signing JAR in-place (overwritting original JAR).
[debug] jarsigner executable=[/opt/java/sdk/Sun/jdk1.5.0_12/jre/../bin/jarsigner]
[debug] Executing: /bin/sh -c "cd /tmp && /opt/java/sdk/Sun/jdk1.5.0_12/jre/../bin/jarsigner -verify /tmp/null.jar"
[info] jar verified.
[debug] jarsigner executable=[/opt/java/sdk/Sun/jdk1.5.0_12/jre/../bin/jarsigner]
[debug] mdkirs: false /tmp
[info] JAR /tmp/signed.jar is already signed. Skipping.
[debug] jarsigner executable=[/opt/java/sdk/Sun/jdk1.5.0_12/jre/../bin/jarsigner]
[debug] mdkirs: false /tmp
Tests run: 6, Failures: 0, Errors: 0, Skipped: 0, Time elapsed: 0.042 sec
Running org.apache.maven.plugin.jar.JarMojoTest
Tests run: 1, Failures: 0, Errors: 0, Skipped: 0, Time elapsed: 0.512 sec
Results :
Tests run: 13, Failures: 0, Errors: 0, Skipped: 0
[HUDSON] Recording test results
[INFO] [jar:jar]
[INFO] Building jar: http://ci.sonatype.org/job/plugins-IT-with-maven-2.0.x/org.apache.maven.plugins$maven-jar-plugin/ws/target/maven-jar-plugin-2.3-SNAPSHOT.jar
[INFO] [plugin:addPluginArtifactMetadata]
[INFO] [invoker:install {execution: integration-test}]
[INFO] Installing http://ci.sonatype.org/job/plugins-IT-with-maven-2.0.x/org.apache.maven.plugins$maven-jar-plugin/ws/pom.xml to http://ci.sonatype.org/job/plugins-IT-with-maven-2.0.x/org.apache.maven.plugins$maven-jar-plugin/ws/target/local-repo/org/apache/maven/plugins/maven-jar-plugin/2.3-SNAPSHOT/maven-jar-plugin-2.3-SNAPSHOT.pom
[INFO] Installing http://ci.sonatype.org/job/plugins-IT-with-maven-2.0.x/org.apache.maven.plugins$maven-jar-plugin/ws/target/maven-jar-plugin-2.3-SNAPSHOT.jar to http://ci.sonatype.org/job/plugins-IT-with-maven-2.0.x/org.apache.maven.plugins$maven-jar-plugin/ws/target/local-repo/org/apache/maven/plugins/maven-jar-plugin/2.3-SNAPSHOT/maven-jar-plugin-2.3-SNAPSHOT.jar
[INFO] [invoker:run {execution: integration-test}]
[INFO] Building: MJAR-80-fullcontent/pom.xml
[INFO] ...SUCCESS.
[INFO] Building: MJAR-70-recreation/pom.xml
[INFO] ...FAILED[verify script returned false].
[INFO] Building: MJAR-30-excludes/pom.xml
[INFO] ...SUCCESS.
[INFO] Building: mjar-90/pom.xml
[INFO] ...SUCCESS.
[INFO] Building: MJAR-75/pom.xml
[INFO] ...FAILED[code=1]. See http://ci.sonatype.org/job/plugins-IT-with-maven-2.0.x/org.apache.maven.plugins$maven-jar-plugin/ws/target/it/MJAR-75/build.log for details.
[INFO] Building: MJAR-60/pom.xml
[INFO] ...SUCCESS.
[INFO] Building: MJAR-30-fullcontent/pom.xml
[INFO] ...SUCCESS.
[INFO] Building: MJAR-30-include/pom.xml
[INFO] ...SUCCESS.
[INFO] Building: manifest-content/pom.xml
[INFO] ...SUCCESS.
[INFO] Building: project-004/pom.xml
[INFO] ...SUCCESS.
[INFO] Building: MJAR-80-include/pom.xml
[INFO] ...SUCCESS.
[INFO] Building: mjar-71-02/pom.xml
[INFO] ...SUCCESS.
[INFO] Building: MJAR-70-no-recreation/pom.xml
[INFO] ...FAILED[verify script returned false].
[INFO] Building: MJAR-82/pom.xml
[INFO] ...SUCCESS.
[INFO] Building: mjar-71-01/pom.xml
[INFO] ...SUCCESS.
[INFO] Building: MJAR-80-exclude/pom.xml
[INFO] ...SUCCESS.
[INFO]
---------------------------------------
Execution Summary:
Builds Passing: 13
Builds Failing: 3
---------------------------------------
The following builds failed:
* MJAR-70-recreation/pom.xml
* MJAR-75/pom.xml
* MJAR-70-no-recreation/pom.xml
[HUDSON] Archiving http://ci.sonatype.org/job/plugins-IT-with-maven-2.0.x/org.apache.maven.plugins$maven-jar-plugin/ws/pom.xml to /home/j2ee-hudson/.hudson/jobs/plugins-IT-with-maven-2.0.x/modules/org.apache.maven.plugins$maven-jar-plugin/builds/2008-11-16_00-11-47/archive/org.apache.maven.plugins/maven-jar-plugin/2.3-SNAPSHOT/pom.xml
[HUDSON] Archiving http://ci.sonatype.org/job/plugins-IT-with-maven-2.0.x/org.apache.maven.plugins$maven-jar-plugin/ws/target/maven-jar-plugin-2.3-SNAPSHOT.jar to /home/j2ee-hudson/.hudson/jobs/plugins-IT-with-maven-2.0.x/modules/org.apache.maven.plugins$maven-jar-plugin/builds/2008-11-16_00-11-47/archive/org.apache.maven.plugins/maven-jar-plugin/2.3-SNAPSHOT/maven-jar-plugin-2.3-SNAPSHOT.jar
Build failed in Hudson: plugins-IT-with-maven-2.0.x » Maven JAR Plugin #562
Posted by Hudson <Hu...@sonatype.org>.
See http://ci.sonatype.org/job/plugins-IT-with-maven-2.0.x/org.apache.maven.plugins$maven-jar-plugin/562/changes
------------------------------------------
[INFO] ------------------------------------------------------------------------
[INFO] Building Maven JAR Plugin
[INFO] task-segment: [clean, deploy]
[INFO] ------------------------------------------------------------------------
[INFO] [clean:clean]
[INFO] Deleting directory http://ci.sonatype.org/job/plugins-IT-with-maven-2.0.x/org.apache.maven.plugins$maven-jar-plugin/ws/target
Downloading: http://localhost:8081/content/groups/public/org/apache/maven/maven-project/2.0.7/maven-project-2.0.7.jar
113K downloaded
Downloading: http://localhost:8081/content/groups/public/org/apache/maven/maven-settings/2.0.7/maven-settings-2.0.7.jar
47K downloaded
Downloading: http://localhost:8081/content/groups/public/org/apache/maven/maven-model/2.0.7/maven-model-2.0.7.jar
84K downloaded
Downloading: http://localhost:8081/content/groups/public/org/apache/maven/maven-profile/2.0.7/maven-profile-2.0.7.jar
34K downloaded
Downloading: http://localhost:8081/content/groups/public/org/apache/maven/maven-artifact-manager/2.0.7/maven-artifact-manager-2.0.7.jar
55K downloaded
Downloading: http://localhost:8081/content/groups/public/org/apache/maven/maven-repository-metadata/2.0.7/maven-repository-metadata-2.0.7.jar
23K downloaded
Downloading: http://localhost:8081/content/groups/public/org/apache/maven/maven-artifact/2.0.7/maven-artifact-2.0.7.jar
85K downloaded
Downloading: http://localhost:8081/content/groups/public/org/apache/maven/maven-plugin-registry/2.0.7/maven-plugin-registry-2.0.7.jar
28K downloaded
Downloading: http://localhost:8081/content/groups/public/org/codehaus/plexus/plexus-interpolation/1.5/plexus-interpolation-1.5.jar
40K downloaded
[INFO] [enforcer:enforce {execution: ensure-no-container-api}]
[INFO] [plugin:helpmojo {execution: generated-helpmojo}]
[INFO] Using 2 extractors.
[INFO] Applying extractor for language: java
[INFO] Extractor for language: java found 4 mojo descriptors.
[INFO] Applying extractor for language: bsh
[INFO] Extractor for language: bsh found 0 mojo descriptors.
[INFO] [plugin:descriptor]
[INFO] Using 2 extractors.
[INFO] Applying extractor for language: java
[INFO] Extractor for language: java found 5 mojo descriptors.
[INFO] Applying extractor for language: bsh
[INFO] Extractor for language: bsh found 0 mojo descriptors.
[INFO] [remote-resources:process {execution: default}]
[INFO] [resources:resources]
[INFO] Using encoding: 'UTF-8' to copy filtered resources.
[INFO] [compiler:compile]
[INFO] Compiling 6 source files to http://ci.sonatype.org/job/plugins-IT-with-maven-2.0.x/org.apache.maven.plugins$maven-jar-plugin/ws/target/classes
[INFO] [resources:testResources]
[INFO] Using encoding: 'UTF-8' to copy filtered resources.
[INFO] [compiler:testCompile]
[INFO] Compiling 4 source files to http://ci.sonatype.org/job/plugins-IT-with-maven-2.0.x/org.apache.maven.plugins$maven-jar-plugin/ws/target/test-classes
[INFO] [surefire:test]
[INFO] Surefire report directory: http://ci.sonatype.org/job/plugins-IT-with-maven-2.0.x/org.apache.maven.plugins$maven-jar-plugin/ws/target/surefire-reports
-------------------------------------------------------
T E S T S
-------------------------------------------------------
Running org.apache.maven.plugin.jar.JarSignVerifyMojoTest
[debug] jarsigner executable=[/opt/java/sdk/Sun/jdk1.5.0_12/jre/../bin/jarsigner]
[debug] Executing: /bin/sh -c "cd /tmp && /opt/java/sdk/Sun/jdk1.5.0_12/jre/../bin/jarsigner -verify /tmp/signed/file-version.jar"
[info] jar verified.
[debug] jarsigner executable=[/opt/java/sdk/Sun/jdk1.5.0_12/jre/../bin/jarsigner]
[debug] Executing: /bin/sh -c "cd /tmp && /opt/java/sdk/Sun/jdk1.5.0_12/jre/../bin/jarsigner -verify -verbose -certs /tmp/signed/file-version.jar"
[info] jar verified.
[debug] jarsigner executable=[/opt/java/sdk/Sun/jdk1.5.0_12/jre/../bin/jarsigner]
[debug] Executing: /bin/sh -c "cd /tmp && /opt/java/sdk/Sun/jdk1.5.0_12/jre/../bin/jarsigner -verify /tmp/signed/file-version.jar"
[debug] jarsigner executable=[/opt/java/sdk/Sun/jdk1.5.0_12/jre/../bin/jarsigner]
[debug] Executing: /bin/sh -c "cd /tmp && /opt/java/sdk/Sun/jdk1.5.0_12/jre/../bin/jarsigner -verify /tmp/signed/file-version.jar"
[info] jar is unsigned.
[debug] jarsigner executable=[/opt/java/sdk/Sun/jdk1.5.0_12/jre/../bin/jarsigner]
[debug] Executing: /bin/sh -c "cd /tmp && /opt/java/sdk/Sun/jdk1.5.0_12/jre/../bin/jarsigner -verify /tmp/signed/file-version.jar"
Tests run: 6, Failures: 0, Errors: 0, Skipped: 0, Time elapsed: 0.07 sec
Running org.apache.maven.plugin.jar.JarSignMojoTest
[debug] jarsigner executable=[/opt/java/sdk/Sun/jdk1.5.0_12/jre/../bin/jarsigner]
[debug] mdkirs: false /tmp
[debug] jarsigner executable=[/opt/java/sdk/Sun/jdk1.5.0_12/jre/../bin/jarsigner]
[debug] mdkirs: false /tmp
[debug] jarsigner executable=[/opt/java/sdk/Sun/jdk1.5.0_12/jre/../bin/jarsigner]
[debug] mdkirs: false /tmp
[debug] jarsigner executable=[/opt/java/sdk/Sun/jdk1.5.0_12/jre/../bin/jarsigner]
[debug] Executing: /bin/sh -c "cd /tmp && /opt/java/sdk/Sun/jdk1.5.0_12/jre/../bin/jarsigner -verify /tmp/signed.jar"
[info] jar verified.
[debug] jarsigner executable=[/opt/java/sdk/Sun/jdk1.5.0_12/jre/../bin/jarsigner]
[debug] Signing JAR in-place (overwritting original JAR).
[debug] jarsigner executable=[/opt/java/sdk/Sun/jdk1.5.0_12/jre/../bin/jarsigner]
[debug] Executing: /bin/sh -c "cd /tmp && /opt/java/sdk/Sun/jdk1.5.0_12/jre/../bin/jarsigner -verify /tmp/null.jar"
[info] jar verified.
[debug] jarsigner executable=[/opt/java/sdk/Sun/jdk1.5.0_12/jre/../bin/jarsigner]
[debug] mdkirs: false /tmp
[info] JAR /tmp/signed.jar is already signed. Skipping.
[debug] jarsigner executable=[/opt/java/sdk/Sun/jdk1.5.0_12/jre/../bin/jarsigner]
[debug] mdkirs: false /tmp
Tests run: 6, Failures: 0, Errors: 0, Skipped: 0, Time elapsed: 0.041 sec
Running org.apache.maven.plugin.jar.JarMojoTest
Tests run: 1, Failures: 0, Errors: 0, Skipped: 0, Time elapsed: 0.472 sec
Results :
Tests run: 13, Failures: 0, Errors: 0, Skipped: 0
[HUDSON] Recording test results
[INFO] [jar:jar]
[INFO] Building jar: http://ci.sonatype.org/job/plugins-IT-with-maven-2.0.x/org.apache.maven.plugins$maven-jar-plugin/ws/target/maven-jar-plugin-2.3-SNAPSHOT.jar
[INFO] [plugin:addPluginArtifactMetadata]
[INFO] [invoker:install {execution: integration-test}]
[INFO] Installing http://ci.sonatype.org/job/plugins-IT-with-maven-2.0.x/org.apache.maven.plugins$maven-jar-plugin/ws/pom.xml to http://ci.sonatype.org/job/plugins-IT-with-maven-2.0.x/org.apache.maven.plugins$maven-jar-plugin/ws/target/local-repo/org/apache/maven/plugins/maven-jar-plugin/2.3-SNAPSHOT/maven-jar-plugin-2.3-SNAPSHOT.pom
[INFO] Installing http://ci.sonatype.org/job/plugins-IT-with-maven-2.0.x/org.apache.maven.plugins$maven-jar-plugin/ws/target/maven-jar-plugin-2.3-SNAPSHOT.jar to http://ci.sonatype.org/job/plugins-IT-with-maven-2.0.x/org.apache.maven.plugins$maven-jar-plugin/ws/target/local-repo/org/apache/maven/plugins/maven-jar-plugin/2.3-SNAPSHOT/maven-jar-plugin-2.3-SNAPSHOT.jar
[INFO] [invoker:run {execution: integration-test}]
[INFO] Building: MJAR-80-fullcontent/pom.xml
[INFO] ...SUCCESS.
[INFO] Building: MJAR-70-recreation/pom.xml
[INFO] ...FAILED[verify script returned false].
[INFO] Building: MJAR-30-excludes/pom.xml
[INFO] ...SUCCESS.
[INFO] Building: mjar-90/pom.xml
[INFO] ...SUCCESS.
[INFO] Building: MJAR-75/pom.xml
[INFO] ...FAILED[code=1]. See http://ci.sonatype.org/job/plugins-IT-with-maven-2.0.x/org.apache.maven.plugins$maven-jar-plugin/ws/target/it/MJAR-75/build.log for details.
[INFO] Building: MJAR-60/pom.xml
[INFO] ...SUCCESS.
[INFO] Building: MJAR-30-fullcontent/pom.xml
[INFO] ...SUCCESS.
[INFO] Building: MJAR-30-include/pom.xml
[INFO] ...SUCCESS.
[INFO] Building: manifest-content/pom.xml
[INFO] ...SUCCESS.
[INFO] Building: project-004/pom.xml
[INFO] ...SUCCESS.
[INFO] Building: MJAR-80-include/pom.xml
[INFO] ...SUCCESS.
[INFO] Building: mjar-71-02/pom.xml
[INFO] ...SUCCESS.
[INFO] Building: MJAR-70-no-recreation/pom.xml
[INFO] ...FAILED[verify script returned false].
[INFO] Building: MJAR-82/pom.xml
[INFO] ...SUCCESS.
[INFO] Building: mjar-71-01/pom.xml
[INFO] ...SUCCESS.
[INFO] Building: MJAR-80-exclude/pom.xml
[INFO] ...SUCCESS.
[INFO]
---------------------------------------
Execution Summary:
Builds Passing: 13
Builds Failing: 3
---------------------------------------
The following builds failed:
* MJAR-70-recreation/pom.xml
* MJAR-75/pom.xml
* MJAR-70-no-recreation/pom.xml
[HUDSON] Archiving http://ci.sonatype.org/job/plugins-IT-with-maven-2.0.x/org.apache.maven.plugins$maven-jar-plugin/ws/pom.xml to /home/j2ee-hudson/.hudson/jobs/plugins-IT-with-maven-2.0.x/modules/org.apache.maven.plugins$maven-jar-plugin/builds/2008-11-15_00-10-15/archive/org.apache.maven.plugins/maven-jar-plugin/2.3-SNAPSHOT/pom.xml
[HUDSON] Archiving http://ci.sonatype.org/job/plugins-IT-with-maven-2.0.x/org.apache.maven.plugins$maven-jar-plugin/ws/target/maven-jar-plugin-2.3-SNAPSHOT.jar to /home/j2ee-hudson/.hudson/jobs/plugins-IT-with-maven-2.0.x/modules/org.apache.maven.plugins$maven-jar-plugin/builds/2008-11-15_00-10-15/archive/org.apache.maven.plugins/maven-jar-plugin/2.3-SNAPSHOT/maven-jar-plugin-2.3-SNAPSHOT.jar
Build failed in Hudson: plugins-IT-with-maven-2.0.x » Maven JAR Plugin #561
Posted by Hudson <Hu...@sonatype.org>.
See http://ci.sonatype.org/job/plugins-IT-with-maven-2.0.x/org.apache.maven.plugins$maven-jar-plugin/561/changes
------------------------------------------
[INFO] ------------------------------------------------------------------------
[INFO] Building Maven JAR Plugin
[INFO] task-segment: [clean, deploy]
[INFO] ------------------------------------------------------------------------
[INFO] [clean:clean]
[INFO] Deleting directory http://ci.sonatype.org/job/plugins-IT-with-maven-2.0.x/org.apache.maven.plugins$maven-jar-plugin/ws/target
Downloading: http://localhost:8081/content/groups/public/org/apache/maven/maven-project/2.0.7/maven-project-2.0.7.jar
113K downloaded
Downloading: http://localhost:8081/content/groups/public/org/apache/maven/maven-settings/2.0.7/maven-settings-2.0.7.jar
47K downloaded
Downloading: http://localhost:8081/content/groups/public/org/apache/maven/maven-model/2.0.7/maven-model-2.0.7.jar
84K downloaded
Downloading: http://localhost:8081/content/groups/public/org/apache/maven/maven-profile/2.0.7/maven-profile-2.0.7.jar
34K downloaded
Downloading: http://localhost:8081/content/groups/public/org/apache/maven/maven-artifact-manager/2.0.7/maven-artifact-manager-2.0.7.jar
55K downloaded
Downloading: http://localhost:8081/content/groups/public/org/apache/maven/maven-repository-metadata/2.0.7/maven-repository-metadata-2.0.7.jar
23K downloaded
Downloading: http://localhost:8081/content/groups/public/org/apache/maven/maven-artifact/2.0.7/maven-artifact-2.0.7.jar
85K downloaded
Downloading: http://localhost:8081/content/groups/public/org/apache/maven/maven-plugin-registry/2.0.7/maven-plugin-registry-2.0.7.jar
28K downloaded
Downloading: http://localhost:8081/content/groups/public/org/codehaus/plexus/plexus-interpolation/1.5/plexus-interpolation-1.5.jar
40K downloaded
[INFO] [enforcer:enforce {execution: ensure-no-container-api}]
[INFO] [plugin:helpmojo {execution: generated-helpmojo}]
[INFO] Using 2 extractors.
[INFO] Applying extractor for language: java
[INFO] Extractor for language: java found 4 mojo descriptors.
[INFO] Applying extractor for language: bsh
[INFO] Extractor for language: bsh found 0 mojo descriptors.
[INFO] [plugin:descriptor]
[INFO] Using 2 extractors.
[INFO] Applying extractor for language: java
[INFO] Extractor for language: java found 5 mojo descriptors.
[INFO] Applying extractor for language: bsh
[INFO] Extractor for language: bsh found 0 mojo descriptors.
[INFO] [remote-resources:process {execution: default}]
[INFO] [resources:resources]
[INFO] Using encoding: 'UTF-8' to copy filtered resources.
[INFO] [compiler:compile]
[INFO] Compiling 6 source files to http://ci.sonatype.org/job/plugins-IT-with-maven-2.0.x/org.apache.maven.plugins$maven-jar-plugin/ws/target/classes
[INFO] [resources:testResources]
[INFO] Using encoding: 'UTF-8' to copy filtered resources.
[INFO] [compiler:testCompile]
[INFO] Compiling 4 source files to http://ci.sonatype.org/job/plugins-IT-with-maven-2.0.x/org.apache.maven.plugins$maven-jar-plugin/ws/target/test-classes
[INFO] [surefire:test]
[INFO] Surefire report directory: http://ci.sonatype.org/job/plugins-IT-with-maven-2.0.x/org.apache.maven.plugins$maven-jar-plugin/ws/target/surefire-reports
-------------------------------------------------------
T E S T S
-------------------------------------------------------
Running org.apache.maven.plugin.jar.JarSignVerifyMojoTest
[debug] jarsigner executable=[/opt/java/sdk/Sun/jdk1.5.0_12/jre/../bin/jarsigner]
[debug] Executing: /bin/sh -c "cd /tmp && /opt/java/sdk/Sun/jdk1.5.0_12/jre/../bin/jarsigner -verify /tmp/signed/file-version.jar"
[info] jar verified.
[debug] jarsigner executable=[/opt/java/sdk/Sun/jdk1.5.0_12/jre/../bin/jarsigner]
[debug] Executing: /bin/sh -c "cd /tmp && /opt/java/sdk/Sun/jdk1.5.0_12/jre/../bin/jarsigner -verify -verbose -certs /tmp/signed/file-version.jar"
[info] jar verified.
[debug] jarsigner executable=[/opt/java/sdk/Sun/jdk1.5.0_12/jre/../bin/jarsigner]
[debug] Executing: /bin/sh -c "cd /tmp && /opt/java/sdk/Sun/jdk1.5.0_12/jre/../bin/jarsigner -verify /tmp/signed/file-version.jar"
[debug] jarsigner executable=[/opt/java/sdk/Sun/jdk1.5.0_12/jre/../bin/jarsigner]
[debug] Executing: /bin/sh -c "cd /tmp && /opt/java/sdk/Sun/jdk1.5.0_12/jre/../bin/jarsigner -verify /tmp/signed/file-version.jar"
[info] jar is unsigned.
[debug] jarsigner executable=[/opt/java/sdk/Sun/jdk1.5.0_12/jre/../bin/jarsigner]
[debug] Executing: /bin/sh -c "cd /tmp && /opt/java/sdk/Sun/jdk1.5.0_12/jre/../bin/jarsigner -verify /tmp/signed/file-version.jar"
Tests run: 6, Failures: 0, Errors: 0, Skipped: 0, Time elapsed: 0.072 sec
Running org.apache.maven.plugin.jar.JarSignMojoTest
[debug] jarsigner executable=[/opt/java/sdk/Sun/jdk1.5.0_12/jre/../bin/jarsigner]
[debug] mdkirs: false /tmp
[debug] jarsigner executable=[/opt/java/sdk/Sun/jdk1.5.0_12/jre/../bin/jarsigner]
[debug] mdkirs: false /tmp
[debug] jarsigner executable=[/opt/java/sdk/Sun/jdk1.5.0_12/jre/../bin/jarsigner]
[debug] mdkirs: false /tmp
[debug] jarsigner executable=[/opt/java/sdk/Sun/jdk1.5.0_12/jre/../bin/jarsigner]
[debug] Executing: /bin/sh -c "cd /tmp && /opt/java/sdk/Sun/jdk1.5.0_12/jre/../bin/jarsigner -verify /tmp/signed.jar"
[info] jar verified.
[debug] jarsigner executable=[/opt/java/sdk/Sun/jdk1.5.0_12/jre/../bin/jarsigner]
[debug] Signing JAR in-place (overwritting original JAR).
[debug] jarsigner executable=[/opt/java/sdk/Sun/jdk1.5.0_12/jre/../bin/jarsigner]
[debug] Executing: /bin/sh -c "cd /tmp && /opt/java/sdk/Sun/jdk1.5.0_12/jre/../bin/jarsigner -verify /tmp/null.jar"
[info] jar verified.
[debug] jarsigner executable=[/opt/java/sdk/Sun/jdk1.5.0_12/jre/../bin/jarsigner]
[debug] mdkirs: false /tmp
[info] JAR /tmp/signed.jar is already signed. Skipping.
[debug] jarsigner executable=[/opt/java/sdk/Sun/jdk1.5.0_12/jre/../bin/jarsigner]
[debug] mdkirs: false /tmp
Tests run: 6, Failures: 0, Errors: 0, Skipped: 0, Time elapsed: 0.041 sec
Running org.apache.maven.plugin.jar.JarMojoTest
Tests run: 1, Failures: 0, Errors: 0, Skipped: 0, Time elapsed: 0.469 sec
Results :
Tests run: 13, Failures: 0, Errors: 0, Skipped: 0
[HUDSON] Recording test results
[INFO] [jar:jar]
[INFO] Building jar: http://ci.sonatype.org/job/plugins-IT-with-maven-2.0.x/org.apache.maven.plugins$maven-jar-plugin/ws/target/maven-jar-plugin-2.3-SNAPSHOT.jar
[INFO] [plugin:addPluginArtifactMetadata]
[INFO] [invoker:install {execution: integration-test}]
[INFO] Installing http://ci.sonatype.org/job/plugins-IT-with-maven-2.0.x/org.apache.maven.plugins$maven-jar-plugin/ws/pom.xml to http://ci.sonatype.org/job/plugins-IT-with-maven-2.0.x/org.apache.maven.plugins$maven-jar-plugin/ws/target/local-repo/org/apache/maven/plugins/maven-jar-plugin/2.3-SNAPSHOT/maven-jar-plugin-2.3-SNAPSHOT.pom
[INFO] Installing http://ci.sonatype.org/job/plugins-IT-with-maven-2.0.x/org.apache.maven.plugins$maven-jar-plugin/ws/target/maven-jar-plugin-2.3-SNAPSHOT.jar to http://ci.sonatype.org/job/plugins-IT-with-maven-2.0.x/org.apache.maven.plugins$maven-jar-plugin/ws/target/local-repo/org/apache/maven/plugins/maven-jar-plugin/2.3-SNAPSHOT/maven-jar-plugin-2.3-SNAPSHOT.jar
[INFO] [invoker:run {execution: integration-test}]
[INFO] Building: MJAR-80-fullcontent/pom.xml
[INFO] ...SUCCESS.
[INFO] Building: MJAR-70-recreation/pom.xml
[INFO] ...FAILED[verify script returned false].
[INFO] Building: MJAR-30-excludes/pom.xml
[INFO] ...SUCCESS.
[INFO] Building: mjar-90/pom.xml
[INFO] ...SUCCESS.
[INFO] Building: MJAR-75/pom.xml
[INFO] ...FAILED[code=1]. See http://ci.sonatype.org/job/plugins-IT-with-maven-2.0.x/org.apache.maven.plugins$maven-jar-plugin/ws/target/it/MJAR-75/build.log for details.
[INFO] Building: MJAR-60/pom.xml
[INFO] ...SUCCESS.
[INFO] Building: MJAR-30-fullcontent/pom.xml
[INFO] ...SUCCESS.
[INFO] Building: MJAR-30-include/pom.xml
[INFO] ...SUCCESS.
[INFO] Building: manifest-content/pom.xml
[INFO] ...SUCCESS.
[INFO] Building: project-004/pom.xml
[INFO] ...SUCCESS.
[INFO] Building: MJAR-80-include/pom.xml
[INFO] ...SUCCESS.
[INFO] Building: mjar-71-02/pom.xml
[INFO] ...SUCCESS.
[INFO] Building: MJAR-70-no-recreation/pom.xml
[INFO] ...FAILED[verify script returned false].
[INFO] Building: MJAR-82/pom.xml
[INFO] ...SUCCESS.
[INFO] Building: mjar-71-01/pom.xml
[INFO] ...SUCCESS.
[INFO] Building: MJAR-80-exclude/pom.xml
[INFO] ...SUCCESS.
[INFO]
---------------------------------------
Execution Summary:
Builds Passing: 13
Builds Failing: 3
---------------------------------------
The following builds failed:
* MJAR-70-recreation/pom.xml
* MJAR-75/pom.xml
* MJAR-70-no-recreation/pom.xml
[HUDSON] Archiving http://ci.sonatype.org/job/plugins-IT-with-maven-2.0.x/org.apache.maven.plugins$maven-jar-plugin/ws/pom.xml to /home/j2ee-hudson/.hudson/jobs/plugins-IT-with-maven-2.0.x/modules/org.apache.maven.plugins$maven-jar-plugin/builds/2008-11-14_00-08-09/archive/org.apache.maven.plugins/maven-jar-plugin/2.3-SNAPSHOT/pom.xml
[HUDSON] Archiving http://ci.sonatype.org/job/plugins-IT-with-maven-2.0.x/org.apache.maven.plugins$maven-jar-plugin/ws/target/maven-jar-plugin-2.3-SNAPSHOT.jar to /home/j2ee-hudson/.hudson/jobs/plugins-IT-with-maven-2.0.x/modules/org.apache.maven.plugins$maven-jar-plugin/builds/2008-11-14_00-08-09/archive/org.apache.maven.plugins/maven-jar-plugin/2.3-SNAPSHOT/maven-jar-plugin-2.3-SNAPSHOT.jar
Build failed in Hudson: plugins-IT-with-maven-2.0.x » Maven JAR Plugin #560
Posted by Hudson <Hu...@sonatype.org>.
See http://ci.sonatype.org/job/plugins-IT-with-maven-2.0.x/org.apache.maven.plugins$maven-jar-plugin/560/changes
------------------------------------------
[INFO] ------------------------------------------------------------------------
[INFO] Building Maven JAR Plugin
[INFO] task-segment: [clean, deploy]
[INFO] ------------------------------------------------------------------------
[INFO] [clean:clean]
[INFO] Deleting directory http://ci.sonatype.org/job/plugins-IT-with-maven-2.0.x/org.apache.maven.plugins$maven-jar-plugin/ws/target
Downloading: http://localhost:8081/content/groups/public/org/apache/maven/maven-project/2.0.7/maven-project-2.0.7.jar
113K downloaded
Downloading: http://localhost:8081/content/groups/public/org/apache/maven/maven-settings/2.0.7/maven-settings-2.0.7.jar
47K downloaded
Downloading: http://localhost:8081/content/groups/public/org/apache/maven/maven-model/2.0.7/maven-model-2.0.7.jar
84K downloaded
Downloading: http://localhost:8081/content/groups/public/org/apache/maven/maven-profile/2.0.7/maven-profile-2.0.7.jar
34K downloaded
Downloading: http://localhost:8081/content/groups/public/org/apache/maven/maven-artifact-manager/2.0.7/maven-artifact-manager-2.0.7.jar
55K downloaded
Downloading: http://localhost:8081/content/groups/public/org/apache/maven/maven-repository-metadata/2.0.7/maven-repository-metadata-2.0.7.jar
23K downloaded
Downloading: http://localhost:8081/content/groups/public/org/apache/maven/maven-artifact/2.0.7/maven-artifact-2.0.7.jar
85K downloaded
Downloading: http://localhost:8081/content/groups/public/org/apache/maven/maven-plugin-registry/2.0.7/maven-plugin-registry-2.0.7.jar
28K downloaded
Downloading: http://localhost:8081/content/groups/public/org/codehaus/plexus/plexus-interpolation/1.5/plexus-interpolation-1.5.jar
40K downloaded
[INFO] [enforcer:enforce {execution: ensure-no-container-api}]
[INFO] [plugin:helpmojo {execution: generated-helpmojo}]
[INFO] Using 2 extractors.
[INFO] Applying extractor for language: java
[INFO] Extractor for language: java found 4 mojo descriptors.
[INFO] Applying extractor for language: bsh
[INFO] Extractor for language: bsh found 0 mojo descriptors.
[INFO] [plugin:descriptor]
[INFO] Using 2 extractors.
[INFO] Applying extractor for language: java
[INFO] Extractor for language: java found 5 mojo descriptors.
[INFO] Applying extractor for language: bsh
[INFO] Extractor for language: bsh found 0 mojo descriptors.
[INFO] [remote-resources:process {execution: default}]
[INFO] [resources:resources]
[INFO] Using encoding: 'UTF-8' to copy filtered resources.
[INFO] [compiler:compile]
[INFO] Compiling 6 source files to http://ci.sonatype.org/job/plugins-IT-with-maven-2.0.x/org.apache.maven.plugins$maven-jar-plugin/ws/target/classes
[INFO] [resources:testResources]
[INFO] Using encoding: 'UTF-8' to copy filtered resources.
[INFO] [compiler:testCompile]
[INFO] Compiling 4 source files to http://ci.sonatype.org/job/plugins-IT-with-maven-2.0.x/org.apache.maven.plugins$maven-jar-plugin/ws/target/test-classes
[INFO] [surefire:test]
[INFO] Surefire report directory: http://ci.sonatype.org/job/plugins-IT-with-maven-2.0.x/org.apache.maven.plugins$maven-jar-plugin/ws/target/surefire-reports
-------------------------------------------------------
T E S T S
-------------------------------------------------------
Running org.apache.maven.plugin.jar.JarSignVerifyMojoTest
[debug] jarsigner executable=[/opt/java/sdk/Sun/jdk1.5.0_12/jre/../bin/jarsigner]
[debug] Executing: /bin/sh -c "cd /tmp && /opt/java/sdk/Sun/jdk1.5.0_12/jre/../bin/jarsigner -verify /tmp/signed/file-version.jar"
[info] jar verified.
[debug] jarsigner executable=[/opt/java/sdk/Sun/jdk1.5.0_12/jre/../bin/jarsigner]
[debug] Executing: /bin/sh -c "cd /tmp && /opt/java/sdk/Sun/jdk1.5.0_12/jre/../bin/jarsigner -verify -verbose -certs /tmp/signed/file-version.jar"
[info] jar verified.
[debug] jarsigner executable=[/opt/java/sdk/Sun/jdk1.5.0_12/jre/../bin/jarsigner]
[debug] Executing: /bin/sh -c "cd /tmp && /opt/java/sdk/Sun/jdk1.5.0_12/jre/../bin/jarsigner -verify /tmp/signed/file-version.jar"
[debug] jarsigner executable=[/opt/java/sdk/Sun/jdk1.5.0_12/jre/../bin/jarsigner]
[debug] Executing: /bin/sh -c "cd /tmp && /opt/java/sdk/Sun/jdk1.5.0_12/jre/../bin/jarsigner -verify /tmp/signed/file-version.jar"
[info] jar is unsigned.
[debug] jarsigner executable=[/opt/java/sdk/Sun/jdk1.5.0_12/jre/../bin/jarsigner]
[debug] Executing: /bin/sh -c "cd /tmp && /opt/java/sdk/Sun/jdk1.5.0_12/jre/../bin/jarsigner -verify /tmp/signed/file-version.jar"
Tests run: 6, Failures: 0, Errors: 0, Skipped: 0, Time elapsed: 0.071 sec
Running org.apache.maven.plugin.jar.JarSignMojoTest
[debug] jarsigner executable=[/opt/java/sdk/Sun/jdk1.5.0_12/jre/../bin/jarsigner]
[debug] mdkirs: false /tmp
[debug] jarsigner executable=[/opt/java/sdk/Sun/jdk1.5.0_12/jre/../bin/jarsigner]
[debug] mdkirs: false /tmp
[debug] jarsigner executable=[/opt/java/sdk/Sun/jdk1.5.0_12/jre/../bin/jarsigner]
[debug] mdkirs: false /tmp
[debug] jarsigner executable=[/opt/java/sdk/Sun/jdk1.5.0_12/jre/../bin/jarsigner]
[debug] Executing: /bin/sh -c "cd /tmp && /opt/java/sdk/Sun/jdk1.5.0_12/jre/../bin/jarsigner -verify /tmp/signed.jar"
[info] jar verified.
[debug] jarsigner executable=[/opt/java/sdk/Sun/jdk1.5.0_12/jre/../bin/jarsigner]
[debug] Signing JAR in-place (overwritting original JAR).
[debug] jarsigner executable=[/opt/java/sdk/Sun/jdk1.5.0_12/jre/../bin/jarsigner]
[debug] Executing: /bin/sh -c "cd /tmp && /opt/java/sdk/Sun/jdk1.5.0_12/jre/../bin/jarsigner -verify /tmp/null.jar"
[info] jar verified.
[debug] jarsigner executable=[/opt/java/sdk/Sun/jdk1.5.0_12/jre/../bin/jarsigner]
[debug] mdkirs: false /tmp
[info] JAR /tmp/signed.jar is already signed. Skipping.
[debug] jarsigner executable=[/opt/java/sdk/Sun/jdk1.5.0_12/jre/../bin/jarsigner]
[debug] mdkirs: false /tmp
Tests run: 6, Failures: 0, Errors: 0, Skipped: 0, Time elapsed: 0.042 sec
Running org.apache.maven.plugin.jar.JarMojoTest
Tests run: 1, Failures: 0, Errors: 0, Skipped: 0, Time elapsed: 0.469 sec
Results :
Tests run: 13, Failures: 0, Errors: 0, Skipped: 0
[HUDSON] Recording test results
[INFO] [jar:jar]
[INFO] Building jar: http://ci.sonatype.org/job/plugins-IT-with-maven-2.0.x/org.apache.maven.plugins$maven-jar-plugin/ws/target/maven-jar-plugin-2.3-SNAPSHOT.jar
[INFO] [plugin:addPluginArtifactMetadata]
[INFO] [invoker:install {execution: integration-test}]
[INFO] Installing http://ci.sonatype.org/job/plugins-IT-with-maven-2.0.x/org.apache.maven.plugins$maven-jar-plugin/ws/pom.xml to http://ci.sonatype.org/job/plugins-IT-with-maven-2.0.x/org.apache.maven.plugins$maven-jar-plugin/ws/target/local-repo/org/apache/maven/plugins/maven-jar-plugin/2.3-SNAPSHOT/maven-jar-plugin-2.3-SNAPSHOT.pom
[INFO] Installing http://ci.sonatype.org/job/plugins-IT-with-maven-2.0.x/org.apache.maven.plugins$maven-jar-plugin/ws/target/maven-jar-plugin-2.3-SNAPSHOT.jar to http://ci.sonatype.org/job/plugins-IT-with-maven-2.0.x/org.apache.maven.plugins$maven-jar-plugin/ws/target/local-repo/org/apache/maven/plugins/maven-jar-plugin/2.3-SNAPSHOT/maven-jar-plugin-2.3-SNAPSHOT.jar
[INFO] [invoker:run {execution: integration-test}]
[INFO] Building: MJAR-80-fullcontent/pom.xml
[INFO] ...SUCCESS.
[INFO] Building: MJAR-70-recreation/pom.xml
[INFO] ...FAILED[verify script returned false].
[INFO] Building: MJAR-30-excludes/pom.xml
[INFO] ...SUCCESS.
[INFO] Building: mjar-90/pom.xml
[INFO] ...SUCCESS.
[INFO] Building: MJAR-75/pom.xml
[INFO] ...FAILED[code=1]. See http://ci.sonatype.org/job/plugins-IT-with-maven-2.0.x/org.apache.maven.plugins$maven-jar-plugin/ws/target/it/MJAR-75/build.log for details.
[INFO] Building: MJAR-60/pom.xml
[INFO] ...SUCCESS.
[INFO] Building: MJAR-30-fullcontent/pom.xml
[INFO] ...SUCCESS.
[INFO] Building: MJAR-30-include/pom.xml
[INFO] ...SUCCESS.
[INFO] Building: manifest-content/pom.xml
[INFO] ...SUCCESS.
[INFO] Building: project-004/pom.xml
[INFO] ...SUCCESS.
[INFO] Building: MJAR-80-include/pom.xml
[INFO] ...SUCCESS.
[INFO] Building: mjar-71-02/pom.xml
[INFO] ...SUCCESS.
[INFO] Building: MJAR-70-no-recreation/pom.xml
[INFO] ...FAILED[verify script returned false].
[INFO] Building: MJAR-82/pom.xml
[INFO] ...SUCCESS.
[INFO] Building: mjar-71-01/pom.xml
[INFO] ...SUCCESS.
[INFO] Building: MJAR-80-exclude/pom.xml
[INFO] ...SUCCESS.
[INFO]
---------------------------------------
Execution Summary:
Builds Passing: 13
Builds Failing: 3
---------------------------------------
The following builds failed:
* MJAR-70-recreation/pom.xml
* MJAR-75/pom.xml
* MJAR-70-no-recreation/pom.xml
[HUDSON] Archiving http://ci.sonatype.org/job/plugins-IT-with-maven-2.0.x/org.apache.maven.plugins$maven-jar-plugin/ws/pom.xml to /home/j2ee-hudson/.hudson/jobs/plugins-IT-with-maven-2.0.x/modules/org.apache.maven.plugins$maven-jar-plugin/builds/2008-11-10_00-07-29/archive/org.apache.maven.plugins/maven-jar-plugin/2.3-SNAPSHOT/pom.xml
[HUDSON] Archiving http://ci.sonatype.org/job/plugins-IT-with-maven-2.0.x/org.apache.maven.plugins$maven-jar-plugin/ws/target/maven-jar-plugin-2.3-SNAPSHOT.jar to /home/j2ee-hudson/.hudson/jobs/plugins-IT-with-maven-2.0.x/modules/org.apache.maven.plugins$maven-jar-plugin/builds/2008-11-10_00-07-29/archive/org.apache.maven.plugins/maven-jar-plugin/2.3-SNAPSHOT/maven-jar-plugin-2.3-SNAPSHOT.jar