You are viewing a plain text version of this content. The canonical link for it is here.
- [jira] [Commented] (DERBY-5415) Memory leak in statement cache of PreparedStatement - posted by "Dag H. Wanvik (Commented) (JIRA)" <ji...@apache.org> on 2012/03/01 02:27:57 UTC, 0 replies.
- [jira] [Commented] (DERBY-5631) Extend SecurityManagerSetup to add extra privileges to the set of default privileges (merge two policy files) - posted by "Dag H. Wanvik (Commented) (JIRA)" <ji...@apache.org> on 2012/03/01 02:33:58 UTC, 2 replies.
- Re: [jira] [Commented] (DERBY-866) Derby User Management Enhancements - posted by "Dag H. Wanvik" <da...@oracle.com> on 2012/03/01 02:43:53 UTC, 5 replies.
- [jira] [Commented] (DERBY-2031) Convert derbynet/testProtocol.java to JUnit - posted by "Dag H. Wanvik (Commented) (JIRA)" <ji...@apache.org> on 2012/03/01 03:17:58 UTC, 3 replies.
- [jira] [Commented] (DERBY-5624) System can run out of stack space while processing DropOnCommit requests. - posted by "Dag H. Wanvik (Commented) (JIRA)" <ji...@apache.org> on 2012/03/01 03:31:59 UTC, 0 replies.
- [jira] [Updated] (DERBY-5631) Extend SecurityManagerSetup to add extra privileges to the set of default privileges (merge two policy files) - posted by "Kristian Waagan (Updated) (JIRA)" <ji...@apache.org> on 2012/03/01 08:08:00 UTC, 4 replies.
- [jira] [Resolved] (DERBY-5631) Extend SecurityManagerSetup to add extra privileges to the set of default privileges (merge two policy files) - posted by "Kristian Waagan (Resolved) (JIRA)" <ji...@apache.org> on 2012/03/01 08:08:01 UTC, 1 replies.
- Build failed in Jenkins: Derby-trunk #1235 - posted by Apache Jenkins Server <je...@builds.apache.org> on 2012/03/01 09:03:03 UTC, 0 replies.
- Build failed in Jenkins: Derby-trunk #1236 - posted by Apache Jenkins Server <je...@builds.apache.org> on 2012/03/01 09:06:31 UTC, 0 replies.
- [jira] [Commented] (DERBY-4620) Query optimizer causes OOM error on a complex query - posted by "Knut Anders Hatlen (Commented) (JIRA)" <ji...@apache.org> on 2012/03/01 09:52:05 UTC, 1 replies.
- Regression Test Report - tinderbox_trunk16 1295438 - Sun Database Engineering - posted by ol...@oracle.com on 2012/03/01 10:45:28 UTC, 1 replies.
- [jira] [Created] (DERBY-5635) Provide implementation for getMetaData() in VTITemplate - posted by "Knut Anders Hatlen (Created) (JIRA)" <ji...@apache.org> on 2012/03/01 10:49:59 UTC, 0 replies.
- Jenkins build is back to normal : Derby-trunk #1237 - posted by Apache Jenkins Server <je...@builds.apache.org> on 2012/03/01 12:27:38 UTC, 0 replies.
- Regression Test Report - tinderbox_trunk16 1295509 - Sun Database Engineering - posted by ol...@oracle.com on 2012/03/01 13:50:31 UTC, 0 replies.
- [jira] [Updated] (DERBY-866) Derby User Management Enhancements - posted by "Rick Hillegas (Updated) (JIRA)" <ji...@apache.org> on 2012/03/01 14:55:59 UTC, 5 replies.
- How to present a heap dump to the list - Was: Had Derby 10.8.2.2 fail today and need some thoughts - posted by "Bergquist, Brett" <BB...@canoga.com> on 2012/03/01 15:00:45 UTC, 6 replies.
- [jira] [Created] (DERBY-5636) Improve the overview of Derby's security mechanisms - posted by "Rick Hillegas (Created) (JIRA)" <ji...@apache.org> on 2012/03/01 16:59:58 UTC, 0 replies.
- [jira] [Created] (DERBY-5637) Document Derby's JMX capabilities and how to disable them - posted by "Rick Hillegas (Created) (JIRA)" <ji...@apache.org> on 2012/03/01 17:11:57 UTC, 0 replies.
- Can someone look at the screen shot of a heap dump and tell me if it looks normal? - posted by "Bergquist, Brett" <BB...@canoga.com> on 2012/03/01 17:49:18 UTC, 0 replies.
- Regression Test Report - Daily 1295186 - Sun DBTG - posted by Ol...@Oracle.COM on 2012/03/01 17:55:20 UTC, 0 replies.
- Another question regarding memory and queries not using prepared statements - posted by "Bergquist, Brett" <BB...@canoga.com> on 2012/03/01 18:44:01 UTC, 2 replies.
- [jira] [Assigned] (DERBY-5636) Improve the overview of Derby's security mechanisms - posted by "Kim Haase (Assigned) (JIRA)" <ji...@apache.org> on 2012/03/01 18:49:59 UTC, 0 replies.
- [jira] [Assigned] (DERBY-5637) Document Derby's JMX capabilities and how to disable them - posted by "Kim Haase (Assigned) (JIRA)" <ji...@apache.org> on 2012/03/01 18:49:59 UTC, 0 replies.
- [jira] [Commented] (DERBY-5637) Document Derby's JMX capabilities and how to disable them - posted by "Kim Haase (Commented) (JIRA)" <ji...@apache.org> on 2012/03/01 18:49:59 UTC, 3 replies.
- RE: Had Derby 10.8.2.2 fail today and need some thoughts - posted by "Bergquist, Brett" <BB...@canoga.com> on 2012/03/01 19:21:34 UTC, 0 replies.
- [jira] [Updated] (DERBY-5632) Logical deadlock happened when freezing/unfreezing the database - posted by "Rick Hillegas (Updated) (JIRA)" <ji...@apache.org> on 2012/03/01 20:21:58 UTC, 0 replies.
- [jira] [Updated] (DERBY-5576) derby can't start or open in applet on safari 5.1.2 - posted by "Rick Hillegas (Updated) (JIRA)" <ji...@apache.org> on 2012/03/01 20:25:58 UTC, 0 replies.
- [jira] [Created] (DERBY-5638) intermittent test failure in test_05_ClobNegative when running full largedata._Suite; LobLimitsTestjava.sql.SQLException: Table/View 'BLOBTBL' already exists in Schema 'APP'. - posted by "Myrna van Lunteren (Created) (JIRA)" <ji...@apache.org> on 2012/03/01 20:43:59 UTC, 0 replies.
- [jira] [Updated] (DERBY-5635) Provide implementation for getMetaData() in VTITemplate - posted by "Knut Anders Hatlen (Updated) (JIRA)" <ji...@apache.org> on 2012/03/01 21:09:59 UTC, 1 replies.
- [jira] [Assigned] (DERBY-5586) Remove the fo2html.xsl script from the docs repository and fix the docs and release builds so that they don't build monohtml versions of the Derby manuals. - posted by "Knut Anders Hatlen (Assigned) (JIRA)" <ji...@apache.org> on 2012/03/01 21:39:57 UTC, 0 replies.
- [jira] [Closed] (DERBY-5360) HTML book variants of the docs don't pass as valid HTML - posted by "Knut Anders Hatlen (Closed) (JIRA)" <ji...@apache.org> on 2012/03/01 21:45:58 UTC, 0 replies.
- [jira] [Commented] (DERBY-5635) Provide implementation for getMetaData() in VTITemplate - posted by "Rick Hillegas (Commented) (JIRA)" <ji...@apache.org> on 2012/03/01 21:51:58 UTC, 0 replies.
- [jira] [Closed] (DERBY-4922) failure in tests using encryption - fails to rename certain database files - posted by "Myrna van Lunteren (Closed) (JIRA)" <ji...@apache.org> on 2012/03/01 22:28:01 UTC, 0 replies.
- [jira] [Updated] (DERBY-5586) Remove the fo2html.xsl script from the docs repository and fix the docs and release builds so that they don't build monohtml versions of the Derby manuals. - posted by "Knut Anders Hatlen (Updated) (JIRA)" <ji...@apache.org> on 2012/03/01 22:55:58 UTC, 4 replies.
- [jira] [Assigned] (DERBY-5442) Create documentation for restrictive file permissions feature - posted by "Kim Haase (Assigned) (JIRA)" <ji...@apache.org> on 2012/03/01 23:05:59 UTC, 0 replies.
- [jira] [Closed] (DERBY-5188) error XBM0S in nstest on attempting re-encryption - posted by "Myrna van Lunteren (Closed) (JIRA)" <ji...@apache.org> on 2012/03/01 23:44:57 UTC, 0 replies.
- [jira] [Updated] (DERBY-5357) SQLJ.INSTALL_JAR shouldn't use identifier as file name - posted by "Dag H. Wanvik (Updated) (JIRA)" <ji...@apache.org> on 2012/03/02 02:32:57 UTC, 11 replies.
- [jira] [Assigned] (DERBY-5357) SQLJ.INSTALL_JAR shouldn't use identifier as file name - posted by "Dag H. Wanvik (Assigned) (JIRA)" <ji...@apache.org> on 2012/03/02 02:34:57 UTC, 0 replies.
- [jira] [Commented] (DERBY-5328) The private fields of the NetServlet can be changed by multiple threads, giving rise to race conditions and corruptions. - posted by "Kristian Waagan (Commented) (JIRA)" <ji...@apache.org> on 2012/03/02 10:21:59 UTC, 2 replies.
- [jira] [Commented] (DERBY-5357) SQLJ.INSTALL_JAR shouldn't use identifier as file name - posted by "Rick Hillegas (Commented) (JIRA)" <ji...@apache.org> on 2012/03/02 16:05:57 UTC, 14 replies.
- [jira] [Commented] (DERBY-5586) Remove the fo2html.xsl script from the docs repository and fix the docs and release builds so that they don't build monohtml versions of the Derby manuals. - posted by "Rick Hillegas (Commented) (JIRA)" <ji...@apache.org> on 2012/03/02 16:19:58 UTC, 0 replies.
- Regression Test Report - Daily 1295673 - Sun DBTG - posted by Ol...@Oracle.COM on 2012/03/02 17:55:24 UTC, 0 replies.
- [jira] [Updated] (DERBY-4631) Wrong join column returned by right outer join with NATURAL or USING and territory-based collation - posted by "Mamta A. Satoor (Updated) (JIRA)" <ji...@apache.org> on 2012/03/02 19:05:59 UTC, 2 replies.
- Regression Test Report - Daily 1296310 - Sun DBTG - posted by Ol...@Oracle.COM on 2012/03/03 17:55:22 UTC, 0 replies.
- Regression Test Report - Daily 1296668 - Sun DBTG - posted by Ol...@Oracle.COM on 2012/03/04 17:55:21 UTC, 0 replies.
- [jira] [Created] (DERBY-5639) Minor code cleanup for NetServlet - posted by "Kristian Waagan (Created) (JIRA)" <ji...@apache.org> on 2012/03/05 12:07:57 UTC, 0 replies.
- [jira] [Updated] (DERBY-5639) Minor code cleanup for NetServlet - posted by "Kristian Waagan (Updated) (JIRA)" <ji...@apache.org> on 2012/03/05 13:06:57 UTC, 4 replies.
- [jira] [Reopened] (DERBY-5135) Derby documentation needs accessibility improvements - posted by "Kim Haase (Reopened) (JIRA)" <ji...@apache.org> on 2012/03/05 16:59:56 UTC, 0 replies.
- [jira] [Created] (DERBY-5640) Use element for table summary - posted by "Kim Haase (Created) (JIRA)" <ji...@apache.org> on 2012/03/05 17:19:57 UTC, 0 replies.
- [jira] [Commented] (DERBY-5640) Use element for table summary - posted by "Kim Haase (Commented) (JIRA)" <ji...@apache.org> on 2012/03/05 17:51:58 UTC, 10 replies.
- Regression Test Report - Daily 1296834 - Sun DBTG - posted by Ol...@Oracle.COM on 2012/03/05 17:55:24 UTC, 0 replies.
- Fwd: Google Summer of Code 2012 upcoming - posted by Katherine Marsden <km...@sbcglobal.net> on 2012/03/05 17:57:36 UTC, 0 replies.
- [jira] [Reopened] (DERBY-5271) Client may hang if the server crashes due to a java.lang.Error - posted by "Kathey Marsden (Reopened) (JIRA)" <ji...@apache.org> on 2012/03/05 20:01:58 UTC, 0 replies.
- [jira] [Resolved] (DERBY-5271) Client may hang if the server crashes due to a java.lang.Error - posted by "Kathey Marsden (Resolved) (JIRA)" <ji...@apache.org> on 2012/03/05 20:03:59 UTC, 0 replies.
- [jira] [Updated] (DERBY-5271) Client may hang if the server crashes due to a java.lang.Error - posted by "Kathey Marsden (Updated) (JIRA)" <ji...@apache.org> on 2012/03/05 20:03:59 UTC, 0 replies.
- [jira] [Reopened] (DERBY-5457) Memory is not freed after OutOfMemoryError, thus preventing Derby from recovering - posted by "Kathey Marsden (Reopened) (JIRA)" <ji...@apache.org> on 2012/03/05 20:13:57 UTC, 0 replies.
- [jira] [Closed] (DERBY-5457) Memory is not freed after OutOfMemoryError, thus preventing Derby from recovering - posted by "Kathey Marsden (Closed) (JIRA)" <ji...@apache.org> on 2012/03/05 20:13:58 UTC, 0 replies.
- Backport analysis - posted by Katherine Marsden <km...@sbcglobal.net> on 2012/03/05 20:50:09 UTC, 5 replies.
- [jira] [Commented] (DERBY-5369) Restricted Table Function support should pass NOT EQUAL restrictions to initScan - posted by "Rick Hillegas (Commented) (JIRA)" <ji...@apache.org> on 2012/03/05 21:09:57 UTC, 8 replies.
- [jira] [Commented] (DERBY-2515) Network client does not retain the INOUT parameter value change for subsequent execution - posted by "Rick Hillegas (Commented) (JIRA)" <ji...@apache.org> on 2012/03/05 21:15:58 UTC, 0 replies.
- [jira] [Commented] (DERBY-2254) Assert during log file switch: log file position exceeded max log file size - posted by "Rick Hillegas (Commented) (JIRA)" <ji...@apache.org> on 2012/03/05 21:19:59 UTC, 0 replies.
- [jira] [Updated] (DERBY-5640) Use element for table summary - posted by "Kim Haase (Updated) (JIRA)" <ji...@apache.org> on 2012/03/05 21:53:58 UTC, 6 replies.
- [jira] [Updated] (DERBY-1016) javax.transaction.xa.forget (Xid) raises XAER_NOTA exception instead of XA_PROTO on a prepared transaction - posted by "Kathey Marsden (Updated) (JIRA)" <ji...@apache.org> on 2012/03/05 21:53:58 UTC, 0 replies.
- [jira] [Commented] (DERBY-5638) intermittent test failure in test_05_ClobNegative when running full largedata._Suite; LobLimitsTestjava.sql.SQLException: Table/View 'BLOBTBL' already exists in Schema 'APP'. - posted by "Myrna van Lunteren (Commented) (JIRA)" <ji...@apache.org> on 2012/03/05 22:33:57 UTC, 21 replies.
- Are devs interested in adding spatial support (Spatial4j)? - posted by "David Smiley @MITRE.org" <DS...@mitre.org> on 2012/03/06 07:13:16 UTC, 2 replies.
- [jira] [Updated] (DERBY-4915) test failure in OSReadOnlyTest in assertDirectoryDeleted - posted by "Kristian Waagan (Updated) (JIRA)" <ji...@apache.org> on 2012/03/06 07:31:25 UTC, 0 replies.
- [jira] [Commented] (DERBY-398) Exclude tests for J2ME/CDC/Foundation platform - posted by "Knut Anders Hatlen (Commented) (JIRA)" <ji...@apache.org> on 2012/03/06 10:24:56 UTC, 0 replies.
- [jira] [Closed] (DERBY-5635) Provide implementation for getMetaData() in VTITemplate - posted by "Knut Anders Hatlen (Closed) (JIRA)" <ji...@apache.org> on 2012/03/06 10:26:57 UTC, 0 replies.
- Build failed in Jenkins: Derby-trunk #1241 - posted by Apache Jenkins Server <je...@builds.apache.org> on 2012/03/06 11:03:56 UTC, 0 replies.
- [jira] [Commented] (DERBY-5617) Improve process handling in SpawnedProcess - posted by "Kristian Waagan (Commented) (JIRA)" <ji...@apache.org> on 2012/03/06 13:18:57 UTC, 0 replies.
- [jira] [Updated] (DERBY-3670) Add spatial datatypes to Derby - posted by "Rick Hillegas (Updated) (JIRA)" <ji...@apache.org> on 2012/03/06 15:57:57 UTC, 0 replies.
- [jira] [Updated] (DERBY-2031) Convert derbynet/testProtocol.java to JUnit - posted by "Kristian Waagan (Updated) (JIRA)" <ji...@apache.org> on 2012/03/06 16:08:02 UTC, 1 replies.
- [jira] [Commented] (DERBY-3670) Add spatial datatypes to Derby - posted by "Rick Hillegas (Commented) (JIRA)" <ji...@apache.org> on 2012/03/06 16:09:57 UTC, 0 replies.
- Jenkins build is back to normal : Derby-trunk #1242 - posted by Apache Jenkins Server <je...@builds.apache.org> on 2012/03/06 16:25:53 UTC, 0 replies.
- [jira] [Resolved] (DERBY-5586) Remove the fo2html.xsl script from the docs repository and fix the docs and release builds so that they don't build monohtml versions of the Derby manuals. - posted by "Knut Anders Hatlen (Resolved) (JIRA)" <ji...@apache.org> on 2012/03/06 17:01:55 UTC, 0 replies.
- Regression Test Report - Daily 1297129 - Sun DBTG - posted by Ol...@Oracle.COM on 2012/03/06 17:55:19 UTC, 0 replies.
- Regression Test Report - tinderbox_trunk16 1297517 - Sun Database Engineering - posted by ol...@oracle.com on 2012/03/06 18:01:51 UTC, 1 replies.
- [jira] [Updated] (DERBY-4617) Sysinfo.testSysinfoLocale failed with IB47 M 1.6 on Windows 7 64bit - posted by "Kathey Marsden (Updated) (JIRA)" <ji...@apache.org> on 2012/03/06 18:44:57 UTC, 0 replies.
- [jira] [Updated] (DERBY-4319) hang in suites.all with ibm 1.5 on AIX after ttestDefaultProperties - posted by "Kathey Marsden (Updated) (JIRA)" <ji...@apache.org> on 2012/03/06 18:54:58 UTC, 0 replies.
- [jira] [Reopened] (DERBY-4319) hang in suites.all with ibm 1.5 on AIX after ttestDefaultProperties - posted by "Kathey Marsden (Reopened) (JIRA)" <ji...@apache.org> on 2012/03/06 18:54:58 UTC, 0 replies.
- [jira] [Resolved] (DERBY-4319) hang in suites.all with ibm 1.5 on AIX after ttestDefaultProperties - posted by "Kathey Marsden (Resolved) (JIRA)" <ji...@apache.org> on 2012/03/06 19:05:04 UTC, 0 replies.
- [jira] [Commented] (DERBY-5428) ns test error: ERROR 38000: The exception 'org.apache.derby.shared.common.sanity.AssertFailure: ASSERT FAILED Identity being changed on a live cacheable. Old uuidString = 846c00a0-0132-88d8-fec0-000000080920' was thrown while evaluating an expression - posted by "Myrna van Lunteren (Commented) (JIRA)" <ji...@apache.org> on 2012/03/06 19:25:10 UTC, 1 replies.
- [jira] [Commented] (DERBY-5443) reduce number of times sequence updater does it work on user thread rather than nested user thread. - posted by "Rick Hillegas (Commented) (JIRA)" <ji...@apache.org> on 2012/03/06 21:49:59 UTC, 18 replies.
- Saving test results of all the tests rather than successful runs getting deleted - posted by Mamta Satoor <ms...@gmail.com> on 2012/03/07 03:07:31 UTC, 2 replies.
- [jira] [Reopened] (DERBY-5631) Extend SecurityManagerSetup to add extra privileges to the set of default privileges (merge two policy files) - posted by "Kristian Waagan (Reopened) (JIRA)" <ji...@apache.org> on 2012/03/07 08:25:57 UTC, 0 replies.
- [jira] [Updated] (DERBY-5603) EmbedConnection.clearLOBMapping() incorrectly clears lobFiles causing a ConcurrentModificationException - posted by "Kristian Waagan (Updated) (JIRA)" <ji...@apache.org> on 2012/03/07 10:56:57 UTC, 0 replies.
- [jira] [Created] (DERBY-5641) Remove unused BaseDataFileFactory methods plus minor cleanups - posted by "Kristian Waagan (Created) (JIRA)" <ji...@apache.org> on 2012/03/07 12:36:57 UTC, 0 replies.
- [jira] [Updated] (DERBY-5641) Remove unused BaseDataFileFactory methods plus minor cleanups - posted by "Kristian Waagan (Updated) (JIRA)" <ji...@apache.org> on 2012/03/07 12:38:58 UTC, 1 replies.
- [jira] [Commented] (DERBY-5603) EmbedConnection.clearLOBMapping() incorrectly clears lobFiles causing a ConcurrentModificationException - posted by "Kristian Waagan (Commented) (JIRA)" <ji...@apache.org> on 2012/03/07 12:52:57 UTC, 0 replies.
- [jira] [Commented] (DERBY-5641) Remove unused BaseDataFileFactory methods plus minor cleanups - posted by "Knut Anders Hatlen (Commented) (JIRA)" <ji...@apache.org> on 2012/03/07 14:50:57 UTC, 0 replies.
- Regression Test Report - Daily 1297575 - Sun DBTG - posted by Ol...@Oracle.COM on 2012/03/07 17:55:24 UTC, 0 replies.
- outstanding data corruptions for 10.9.1 - posted by Rick Hillegas <ri...@oracle.com> on 2012/03/07 18:21:22 UTC, 2 replies.
- [Starting] - posted by Gayan Dhanushka <ga...@gmail.com> on 2012/03/07 18:47:55 UTC, 1 replies.
- [jira] [Commented] (DERBY-5489) getBinary() returns incorrect data after getObject() call on BLOB column - posted by "Kristian Waagan (Commented) (JIRA)" <ji...@apache.org> on 2012/03/07 21:14:58 UTC, 5 replies.
- [jira] [Updated] (DERBY-5489) getBinary() returns incorrect data after getObject() call on BLOB column - posted by "Dag H. Wanvik (Updated) (JIRA)" <ji...@apache.org> on 2012/03/08 02:56:57 UTC, 0 replies.
- [jira] [Issue Comment Edited] (DERBY-5357) SQLJ.INSTALL_JAR shouldn't use identifier as file name - posted by "Dag H. Wanvik (Issue Comment Edited) (JIRA)" <ji...@apache.org> on 2012/03/08 03:12:57 UTC, 3 replies.
- Regression Test Report - Daily 1297575S1 - Sun DBTG - posted by Ol...@Oracle.COM on 2012/03/08 17:55:06 UTC, 1 replies.
- [jira] [Updated] (DERBY-5638) intermittent test failure in test_05_ClobNegative when running full largedata._Suite; LobLimitsTestjava.sql.SQLException: Table/View 'BLOBTBL' already exists in Schema 'APP'. - posted by "Mamta A. Satoor (Updated) (JIRA)" <ji...@apache.org> on 2012/03/08 18:19:57 UTC, 8 replies.
- [jira] [Commented] (DERBY-5522) Document the NATIVE authentication scheme. - posted by "Kim Haase (Commented) (JIRA)" <ji...@apache.org> on 2012/03/08 18:55:57 UTC, 40 replies.
- [jira] [Updated] (DERBY-5443) reduce number of times sequence updater does it work on user thread rather than nested user thread. - posted by "Rick Hillegas (Updated) (JIRA)" <ji...@apache.org> on 2012/03/08 19:52:06 UTC, 0 replies.
- [jira] [Updated] (DERBY-5522) Document the NATIVE authentication scheme. - posted by "Kim Haase (Updated) (JIRA)" <ji...@apache.org> on 2012/03/08 21:59:58 UTC, 18 replies.
- [jira] [Resolved] (DERBY-5641) Remove unused BaseDataFileFactory methods plus minor cleanups - posted by "Kristian Waagan (Resolved) (JIRA)" <ji...@apache.org> on 2012/03/09 07:29:59 UTC, 0 replies.
- [jira] [Created] (DERBY-5642) OutOfMemoryError in OCRecoveryTest on phoneME - posted by "Knut Anders Hatlen (Created) (JIRA)" <ji...@apache.org> on 2012/03/09 07:40:00 UTC, 0 replies.
- [jira] [Commented] (DERBY-5642) OutOfMemoryError in OCRecoveryTest on phoneME - posted by "Knut Anders Hatlen (Commented) (JIRA)" <ji...@apache.org> on 2012/03/09 07:48:00 UTC, 0 replies.
- [jira] [Updated] (DERBY-5642) OutOfMemoryError in OCRecoveryTest on phoneME - posted by "Knut Anders Hatlen (Updated) (JIRA)" <ji...@apache.org> on 2012/03/09 08:15:56 UTC, 0 replies.
- [jira] [Created] (DERBY-5643) Occasional hangs in replication tests on Linux - posted by "Knut Anders Hatlen (Created) (JIRA)" <ji...@apache.org> on 2012/03/09 09:38:56 UTC, 0 replies.
- [jira] [Updated] (DERBY-5643) Occasional hangs in replication tests on Linux - posted by "Knut Anders Hatlen (Updated) (JIRA)" <ji...@apache.org> on 2012/03/09 09:40:56 UTC, 5 replies.
- [jira] [Resolved] (DERBY-5603) EmbedConnection.clearLOBMapping() incorrectly clears lobFiles causing a ConcurrentModificationException - posted by "Kristian Waagan (Resolved) (JIRA)" <ji...@apache.org> on 2012/03/09 09:44:55 UTC, 0 replies.
- [jira] [Closed] (DERBY-5642) OutOfMemoryError in OCRecoveryTest on phoneME - posted by "Knut Anders Hatlen (Closed) (JIRA)" <ji...@apache.org> on 2012/03/09 10:29:56 UTC, 0 replies.
- [jira] [Commented] (DERBY-5643) Occasional hangs in replication tests on Linux - posted by "Kristian Waagan (Commented) (JIRA)" <ji...@apache.org> on 2012/03/09 10:49:57 UTC, 9 replies.
- Regression Test Report - Daily 1298470 - Sun DBTG - posted by Ol...@Oracle.COM on 2012/03/09 17:55:24 UTC, 0 replies.
- [jira] [Assigned] (DERBY-5638) intermittent test failure in test_05_ClobNegative when running full largedata._Suite; LobLimitsTestjava.sql.SQLException: Table/View 'BLOBTBL' already exists in Schema 'APP'. - posted by "Mamta A. Satoor (Assigned) (JIRA)" <ji...@apache.org> on 2012/03/09 19:30:57 UTC, 0 replies.
- [jira] [Created] (DERBY-5644) Type in error message for NATIVE authentication - posted by "Rick Hillegas (Created) (JIRA)" <ji...@apache.org> on 2012/03/09 21:52:57 UTC, 0 replies.
- [jira] [Updated] (DERBY-5644) Typo in error message for NATIVE authentication - posted by "Rick Hillegas (Updated) (JIRA)" <ji...@apache.org> on 2012/03/09 21:52:57 UTC, 2 replies.
- Regression Test Report - Daily 1298925 - Sun DBTG - posted by Ol...@Oracle.COM on 2012/03/10 17:55:22 UTC, 0 replies.
- Regression Test Report - Daily 1299232 - Sun DBTG - posted by Ol...@Oracle.COM on 2012/03/11 17:55:21 UTC, 0 replies.
- [jira] [Created] (DERBY-5645) Reference manual says setBlob()/setClob()/getBlob()/getClob() are not supported on CallableStatement - posted by "Knut Anders Hatlen (Created) (JIRA)" <ji...@apache.org> on 2012/03/12 10:30:38 UTC, 0 replies.
- [jira] [Updated] (DERBY-5645) Reference manual says setBlob()/setClob()/getBlob()/getClob() are not supported on CallableStatement - posted by "Knut Anders Hatlen (Updated) (JIRA)" <ji...@apache.org> on 2012/03/12 10:32:38 UTC, 0 replies.
- [jira] [Commented] (DERBY-5419) Make Derby run on Oracle Java ME Embedded Client - posted by "Knut Anders Hatlen (Commented) (JIRA)" <ji...@apache.org> on 2012/03/12 10:52:39 UTC, 0 replies.
- [jira] [Closed] (DERBY-5419) Make Derby run on Oracle Java ME Embedded Client - posted by "Knut Anders Hatlen (Closed) (JIRA)" <ji...@apache.org> on 2012/03/12 10:52:39 UTC, 0 replies.
- [jira] [Created] (DERBY-5646) Get upgrade tests to pass on OJEC 1.1 - posted by "Knut Anders Hatlen (Created) (JIRA)" <ji...@apache.org> on 2012/03/12 11:04:38 UTC, 0 replies.
- [jira] [Commented] (DERBY-5639) Minor code cleanup for NetServlet - posted by "Kristian Waagan (Commented) (JIRA)" <ji...@apache.org> on 2012/03/12 11:10:38 UTC, 0 replies.
- [jira] [Resolved] (DERBY-5646) Get upgrade tests to pass on OJEC 1.1 - posted by "Knut Anders Hatlen (Resolved) (JIRA)" <ji...@apache.org> on 2012/03/12 11:59:38 UTC, 0 replies.
- [jira] [Updated] (DERBY-5646) Get upgrade tests to pass on OJEC 1.1 - posted by "Knut Anders Hatlen (Updated) (JIRA)" <ji...@apache.org> on 2012/03/12 11:59:38 UTC, 0 replies.
- [jira] [Assigned] (DERBY-5645) Reference manual says setBlob()/setClob()/getBlob()/getClob() are not supported on CallableStatement - posted by "Kim Haase (Assigned) (JIRA)" <ji...@apache.org> on 2012/03/12 14:14:40 UTC, 0 replies.
- [jira] [Created] (DERBY-5647) NATIVE warns about password expiry for DBO - posted by "Knut Anders Hatlen (Created) (JIRA)" <ji...@apache.org> on 2012/03/12 15:24:38 UTC, 0 replies.
- [jira] [Updated] (DERBY-5647) NATIVE warns about password expiry for DBO - posted by "Knut Anders Hatlen (Updated) (JIRA)" <ji...@apache.org> on 2012/03/12 15:30:38 UTC, 1 replies.
- [jira] [Created] (DERBY-5648) Unclear password expiry warning when using separate credentials db - posted by "Knut Anders Hatlen (Created) (JIRA)" <ji...@apache.org> on 2012/03/12 15:44:42 UTC, 0 replies.
- [jira] [Commented] (DERBY-5647) NATIVE warns about password expiry for DBO - posted by "Rick Hillegas (Commented) (JIRA)" <ji...@apache.org> on 2012/03/12 16:08:46 UTC, 4 replies.
- [jira] [Commented] (DERBY-5648) Unclear password expiry warning when using separate credentials db - posted by "Rick Hillegas (Commented) (JIRA)" <ji...@apache.org> on 2012/03/12 16:20:37 UTC, 3 replies.
- Regression Test Report - Daily 1299396 - Sun DBTG - posted by Ol...@Oracle.COM on 2012/03/12 17:55:24 UTC, 0 replies.
- [jira] [Created] (DERBY-5649) make improvements to nstest so it's easier to run/analyze/debug - posted by "Myrna van Lunteren (Created) (JIRA)" <ji...@apache.org> on 2012/03/13 02:00:52 UTC, 0 replies.
- [jira] [Commented] (DERBY-5649) make improvements to nstest so it's easier to run/analyze/debug - posted by "Myrna van Lunteren (Commented) (JIRA)" <ji...@apache.org> on 2012/03/13 02:42:37 UTC, 4 replies.
- [jira] [Updated] (DERBY-5649) make improvements to nstest so it's easier to run/analyze/debug - posted by "Myrna van Lunteren (Updated) (JIRA)" <ji...@apache.org> on 2012/03/13 02:46:38 UTC, 0 replies.
- [jira] [Created] (DERBY-5650) ERROR XSDBB: Unknown page format at page Page(1936,Container(0, 1009)), page dump follows: Hex dump: 00000000: - posted by "Deepika Kochhar (Created) (JIRA)" <ji...@apache.org> on 2012/03/13 13:19:37 UTC, 0 replies.
- [jira] [Resolved] (DERBY-5644) Typo in error message for NATIVE authentication - posted by "Rick Hillegas (Resolved) (JIRA)" <ji...@apache.org> on 2012/03/13 13:21:37 UTC, 0 replies.
- [jira] [Updated] (DERBY-5650) ERROR XSDBB: Unknown page format at page Page(1936,Container(0, 1009)), page dump follows: Hex dump: 00000000: - posted by "Rick Hillegas (Updated) (JIRA)" <ji...@apache.org> on 2012/03/13 14:23:38 UTC, 2 replies.
- [jira] [Commented] (DERBY-5650) ERROR XSDBB: Unknown page format at page Page(1936,Container(0, 1009)), page dump follows: Hex dump: 00000000: - posted by "Rick Hillegas (Commented) (JIRA)" <ji...@apache.org> on 2012/03/13 14:23:38 UTC, 5 replies.
- [jira] [Updated] (DERBY-5648) Unclear password expiry warning when using separate credentials db - posted by "Rick Hillegas (Updated) (JIRA)" <ji...@apache.org> on 2012/03/13 16:22:40 UTC, 1 replies.
- Regression Test Report - Daily 1299396S1 - Sun DBTG - posted by Ol...@Oracle.COM on 2012/03/13 17:55:06 UTC, 0 replies.
- [jira] [Assigned] (DERBY-5648) Unclear password expiry warning when using separate credentials db - posted by "Rick Hillegas (Assigned) (JIRA)" <ji...@apache.org> on 2012/03/13 18:28:40 UTC, 0 replies.
- [jira] [Resolved] (DERBY-5648) Unclear password expiry warning when using separate credentials db - posted by "Rick Hillegas (Resolved) (JIRA)" <ji...@apache.org> on 2012/03/13 18:30:37 UTC, 0 replies.
- [jira] [Resolved] (DERBY-5647) NATIVE warns about password expiry for DBO - posted by "Rick Hillegas (Resolved) (JIRA)" <ji...@apache.org> on 2012/03/13 18:30:39 UTC, 0 replies.
- [jira] [Assigned] (DERBY-5647) NATIVE warns about password expiry for DBO - posted by "Rick Hillegas (Assigned) (JIRA)" <ji...@apache.org> on 2012/03/13 18:30:39 UTC, 0 replies.
- [jira] [Updated] (DERBY-5422) IndexOutOfBoundsException followed by NullPointerException in cleanup during system.nstest - posted by "Myrna van Lunteren (Updated) (JIRA)" <ji...@apache.org> on 2012/03/13 22:58:39 UTC, 0 replies.
- [jira] [Resolved] (DERBY-5643) Occasional hangs in replication tests on Linux - posted by "Knut Anders Hatlen (Resolved) (JIRA)" <ji...@apache.org> on 2012/03/14 08:47:52 UTC, 1 replies.
- [jira] [Created] (DERBY-5651) Protocol error when connecting to db with NATIVE authentication using strong password substitution - posted by "Knut Anders Hatlen (Created) (JIRA)" <ji...@apache.org> on 2012/03/14 11:34:37 UTC, 0 replies.
- [jira] [Closed] (DERBY-5271) Client may hang if the server crashes due to a java.lang.Error - posted by "Kristian Waagan (Closed) (JIRA)" <ji...@apache.org> on 2012/03/14 13:34:38 UTC, 0 replies.
- [jira] [Created] (DERBY-5652) Assert failure when bootstrapping NATIVE with invalid provider string - posted by "Knut Anders Hatlen (Created) (JIRA)" <ji...@apache.org> on 2012/03/14 15:38:38 UTC, 0 replies.
- [jira] [Created] (DERBY-5653) We should document that the NetServlet is a testing tool and not appropriate for production use. - posted by "Rick Hillegas (Created) (JIRA)" <ji...@apache.org> on 2012/03/14 17:26:39 UTC, 0 replies.
- [jira] [Updated] (DERBY-5584) Select statement with subqueries with group by and count distinct statements returns wrong number of results - posted by "Kathey Marsden (Updated) (JIRA)" <ji...@apache.org> on 2012/03/14 17:34:42 UTC, 1 replies.
- [jira] [Resolved] (DERBY-5614) NullPointerException with INSERT INTO [global temporary table] SELECT ... FROM [VTI] - posted by "Kristian Waagan (Resolved) (JIRA)" <ji...@apache.org> on 2012/03/14 17:38:40 UTC, 0 replies.
- [jira] [Commented] (DERBY-5519) Update code in JVMInfo#derbyVMLevel to give correct results for Java 7 and provisionally for 8. - posted by "Kathey Marsden (Commented) (JIRA)" <ji...@apache.org> on 2012/03/14 17:42:40 UTC, 1 replies.
- [jira] [Updated] (DERBY-5614) NullPointerException with INSERT INTO [global temporary table] SELECT ... FROM [VTI] - posted by "Kristian Waagan (Updated) (JIRA)" <ji...@apache.org> on 2012/03/14 17:42:41 UTC, 0 replies.
- [jira] [Reopened] (DERBY-2687) store/encryptDatabase.sql fails intermittently with ClassNotFoundException, Log Corrupted - posted by "Kathey Marsden (Reopened) (JIRA)" <ji...@apache.org> on 2012/03/14 17:46:49 UTC, 0 replies.
- Regression Test Report - Daily 1300236 - Sun DBTG - posted by Ol...@Oracle.COM on 2012/03/14 17:55:23 UTC, 0 replies.
- [jira] [Commented] (DERBY-5653) We should document that the NetServlet is a testing tool and not appropriate for production use. - posted by "Myrna van Lunteren (Commented) (JIRA)" <ji...@apache.org> on 2012/03/14 18:04:41 UTC, 3 replies.
- [jira] [Created] (DERBY-5654) 10.5 Backport issue (2012) - posted by "Kathey Marsden (Created) (JIRA)" <ji...@apache.org> on 2012/03/14 18:04:41 UTC, 0 replies.
- [jira] [Commented] (DERBY-5654) 10.5 Backport issue (2012) - posted by "Kathey Marsden (Commented) (JIRA)" <ji...@apache.org> on 2012/03/14 18:22:44 UTC, 0 replies.
- [jira] [Assigned] (DERBY-5653) We should document that the NetServlet is a testing tool and not appropriate for production use. - posted by "Kim Haase (Assigned) (JIRA)" <ji...@apache.org> on 2012/03/14 18:26:41 UTC, 0 replies.
- [jira] [Resolved] (DERBY-5091) Derby Test and Fix 2011 GSoC Project - posted by "Myrna van Lunteren (Resolved) (JIRA)" <ji...@apache.org> on 2012/03/14 18:28:40 UTC, 0 replies.
- [jira] [Resolved] (DERBY-5127) Convert madhare.sql to JUnit - posted by "Myrna van Lunteren (Resolved) (JIRA)" <ji...@apache.org> on 2012/03/14 18:34:39 UTC, 0 replies.
- emma nightly runs - are they insane only? - posted by Mike Matrigali <mi...@sbcglobal.net> on 2012/03/14 19:36:38 UTC, 2 replies.
- [jira] [Issue Comment Edited] (DERBY-5649) make improvements to nstest so it's easier to run/analyze/debug - posted by "Myrna van Lunteren (Issue Comment Edited) (JIRA)" <ji...@apache.org> on 2012/03/14 19:40:39 UTC, 0 replies.
- [jira] [Closed] (DERBY-5649) make improvements to nstest so it's easier to run/analyze/debug - posted by "Myrna van Lunteren (Closed) (JIRA)" <ji...@apache.org> on 2012/03/14 19:40:40 UTC, 1 replies.
- [jira] [Created] (DERBY-5655) Preformatted text should not be used for graphic - posted by "Kim Haase (Created) (JIRA)" <ji...@apache.org> on 2012/03/14 19:52:40 UTC, 0 replies.
- [jira] [Commented] (DERBY-5651) Protocol error when connecting to db with NATIVE authentication using strong password substitution - posted by "Rick Hillegas (Commented) (JIRA)" <ji...@apache.org> on 2012/03/14 20:28:42 UTC, 7 replies.
- [jira] [Resolved] (DERBY-2687) store/encryptDatabase.sql fails intermittently with ClassNotFoundException, Log Corrupted - posted by "Kathey Marsden (Resolved) (JIRA)" <ji...@apache.org> on 2012/03/14 23:16:40 UTC, 0 replies.
- [jira] [Assigned] (DERBY-3009) Out of memory error when creating a very large table - posted by "Kathey Marsden (Assigned) (JIRA)" <ji...@apache.org> on 2012/03/14 23:20:40 UTC, 0 replies.
- [jira] [Created] (DERBY-5656) Bring master based unit tests T_* into Suites.All - posted by "Kathey Marsden (Created) (JIRA)" <ji...@apache.org> on 2012/03/15 00:04:40 UTC, 0 replies.
- [jira] [Commented] (DERBY-5656) Bring master based unit tests T_* into Suites.All - posted by "Mike Matrigali (Commented) (JIRA)" <ji...@apache.org> on 2012/03/15 00:18:40 UTC, 0 replies.
- [jira] [Created] (DERBY-5657) Message XCY05 for NATIVE authentication is (too?) complex - posted by "Kristian Waagan (Created) (JIRA)" <ji...@apache.org> on 2012/03/15 08:55:42 UTC, 0 replies.
- [jira] [Created] (DERBY-5658) Regularize capitalization in error messages for NATIVE authentication - posted by "Rick Hillegas (Created) (JIRA)" <ji...@apache.org> on 2012/03/15 13:21:37 UTC, 0 replies.
- GSoC 2012 Ideas - posted by Tiago Espinha <ti...@espinhas.net> on 2012/03/15 15:01:43 UTC, 2 replies.
- [jira] [Created] (DERBY-5659) Database corrupted after delete operation - results in sqlcode XSDB2 - posted by "ratish ram (Created) (JIRA)" <ji...@apache.org> on 2012/03/15 15:25:37 UTC, 0 replies.
- [jira] [Updated] (DERBY-5659) Database corrupted after delete operation - results in sqlcode XSDB2 - posted by "ratish ram (Updated) (JIRA)" <ji...@apache.org> on 2012/03/15 15:29:38 UTC, 7 replies.
- [jira] [Commented] (DERBY-5659) Database corrupted after delete operation - results in sqlcode XSDB2 - posted by "Rick Hillegas (Commented) (JIRA)" <ji...@apache.org> on 2012/03/15 15:33:38 UTC, 4 replies.
- [jira] [Updated] (DERBY-5658) Regularize capitalization in error messages for NATIVE authentication - posted by "Rick Hillegas (Updated) (JIRA)" <ji...@apache.org> on 2012/03/15 15:45:37 UTC, 0 replies.
- [jira] [Resolved] (DERBY-5658) Regularize capitalization in error messages for NATIVE authentication - posted by "Rick Hillegas (Resolved) (JIRA)" <ji...@apache.org> on 2012/03/15 15:45:37 UTC, 0 replies.
- [jira] [Updated] (DERBY-5657) Message XCY05 for NATIVE authentication is (too?) complex - posted by "Rick Hillegas (Updated) (JIRA)" <ji...@apache.org> on 2012/03/15 17:09:38 UTC, 0 replies.
- [jira] [Resolved] (DERBY-5657) Message XCY05 for NATIVE authentication is (too?) complex - posted by "Rick Hillegas (Resolved) (JIRA)" <ji...@apache.org> on 2012/03/15 17:09:38 UTC, 0 replies.
- Regression Test Report - Daily 1300236S1 - Sun DBTG - posted by Ol...@Oracle.COM on 2012/03/15 17:55:06 UTC, 0 replies.
- [jira] [Commented] (DERBY-5377) AssertionFailedError in testCaseCS4595B_NonUniqueIndex in AccessTest - posted by "Kathey Marsden (Commented) (JIRA)" <ji...@apache.org> on 2012/03/15 18:53:42 UTC, 3 replies.
- [jira] [Updated] (DERBY-3009) Out of memory error when creating a very large table - posted by "Kathey Marsden (Updated) (JIRA)" <ji...@apache.org> on 2012/03/15 18:59:38 UTC, 0 replies.
- [jira] [Created] (DERBY-5660) CleanDatabaseTestSetup should report the errors if the database object dropping does not succeed. An alternative could be to drop and create a brand new db if db objects from existing datbase runs into errors. - posted by "Mamta A. Satoor (Created) (JIRA)" <ji...@apache.org> on 2012/03/15 19:45:35 UTC, 0 replies.
- [jira] [Updated] (DERBY-3519) junit regression test failure in testInertTime(org.apache.derbyTesting.functionTests.tests.lang.TimeHandlingTest)junit.framework.AssertionFailedError: expected:<2> but was:<3> - posted by "Mike Matrigali (Updated) (JIRA)" <ji...@apache.org> on 2012/03/15 20:24:38 UTC, 0 replies.
- [jira] [Commented] (DERBY-5197) AssertionFailedError: Could not connect in 20000 ms in ReplicationRun_Local_3_p2.testReplication_Local_3_p2_StateTests_bigInsert_immediateStopMaster - posted by "Mike Matrigali (Commented) (JIRA)" <ji...@apache.org> on 2012/03/15 20:30:39 UTC, 1 replies.
- [jira] [Commented] (DERBY-5594) SecureServerTest java.io.IOException: Interrupted system call - posted by "Mike Matrigali (Commented) (JIRA)" <ji...@apache.org> on 2012/03/15 20:50:38 UTC, 3 replies.
- [jira] [Reopened] (DERBY-5649) make improvements to nstest so it's easier to run/analyze/debug - posted by "Myrna van Lunteren (Reopened) (JIRA)" <ji...@apache.org> on 2012/03/15 23:34:38 UTC, 0 replies.
- [jira] [Created] (DERBY-5661) ASSERT failure in nstest; Exception in thread "derby.index-stat-thread" org.apache.derby.shared.common.sanity.AssertFailure: ASSERT FAILED transaction not pristine - posted by "Myrna van Lunteren (Created) (JIRA)" <ji...@apache.org> on 2012/03/16 00:54:37 UTC, 0 replies.
- [jira] [Updated] (DERBY-5661) ASSERT failure in nstest; Exception in thread "derby.index-stat-thread" org.apache.derby.shared.common.sanity.AssertFailure: ASSERT FAILED transaction not pristine - posted by "Myrna van Lunteren (Updated) (JIRA)" <ji...@apache.org> on 2012/03/16 00:58:38 UTC, 2 replies.
- [jira] [Commented] (DERBY-5661) ASSERT failure in nstest; Exception in thread "derby.index-stat-thread" org.apache.derby.shared.common.sanity.AssertFailure: ASSERT FAILED transaction not pristine - posted by "Myrna van Lunteren (Commented) (JIRA)" <ji...@apache.org> on 2012/03/16 01:06:49 UTC, 2 replies.
- [jira] [Created] (DERBY-5662) nstest causes ERROR X0X03: Invalid transaction state - held cursor requires same isolation level - posted by "Kristian Waagan (Created) (JIRA)" <ji...@apache.org> on 2012/03/16 11:23:40 UTC, 0 replies.
- [jira] [Commented] (DERBY-5660) CleanDatabaseTestSetup should report the errors if the database object dropping does not succeed. An alternative could be to drop and create a brand new db if db objects from existing datbase runs into errors. - posted by "Kathey Marsden (Commented) (JIRA)" <ji...@apache.org> on 2012/03/16 16:01:40 UTC, 1 replies.
- [jira] [Resolved] (DERBY-3009) Out of memory error when creating a very large table - posted by "Kathey Marsden (Resolved) (JIRA)" <ji...@apache.org> on 2012/03/16 17:21:39 UTC, 0 replies.
- [jira] [Updated] (DERBY-3870) Concurrent Inserts of rows with XML data results in an exception - posted by "Kathey Marsden (Updated) (JIRA)" <ji...@apache.org> on 2012/03/16 17:27:39 UTC, 0 replies.
- [jira] [Resolved] (DERBY-3870) Concurrent Inserts of rows with XML data results in an exception - posted by "Kathey Marsden (Resolved) (JIRA)" <ji...@apache.org> on 2012/03/16 17:31:43 UTC, 0 replies.
- [jira] [Assigned] (DERBY-4779) NPE while inserting into a table which has a generated column and an insert trigger - posted by "Kathey Marsden (Assigned) (JIRA)" <ji...@apache.org> on 2012/03/16 17:41:39 UTC, 0 replies.
- Regression Test Report - Daily 1301087 - Sun DBTG - posted by Ol...@Oracle.COM on 2012/03/16 17:55:17 UTC, 0 replies.
- [jira] [Updated] (DERBY-4779) NPE while inserting into a table which has a generated column and an insert trigger - posted by "Kathey Marsden (Updated) (JIRA)" <ji...@apache.org> on 2012/03/16 18:33:44 UTC, 0 replies.
- [jira] [Reopened] (DERBY-5304) test_derby_4779 (lang.GeneratedColumnsTest) fails with ibm 1.4.2; ERROR 42X50; No method was found that matched the method call java.lang.Integer.signum(int) - posted by "Kathey Marsden (Reopened) (JIRA)" <ji...@apache.org> on 2012/03/16 18:51:42 UTC, 0 replies.
- [jira] [Resolved] (DERBY-4779) NPE while inserting into a table which has a generated column and an insert trigger - posted by "Kathey Marsden (Resolved) (JIRA)" <ji...@apache.org> on 2012/03/16 22:21:41 UTC, 0 replies.
- [jira] [Resolved] (DERBY-5304) test_derby_4779 (lang.GeneratedColumnsTest) fails with ibm 1.4.2; ERROR 42X50; No method was found that matched the method call java.lang.Integer.signum(int) - posted by "Kathey Marsden (Resolved) (JIRA)" <ji...@apache.org> on 2012/03/16 22:23:41 UTC, 0 replies.
- [jira] [Assigned] (DERBY-2515) Network client does not retain the INOUT parameter value change for subsequent execution - posted by "Kathey Marsden (Assigned) (JIRA)" <ji...@apache.org> on 2012/03/16 22:35:34 UTC, 0 replies.
- [jira] [Reopened] (DERBY-5018) [patch] remove erroneous throws clauses on non derivable methods that don't throw - posted by "Kathey Marsden (Reopened) (JIRA)" <ji...@apache.org> on 2012/03/16 23:22:48 UTC, 0 replies.
- [jira] [Resolved] (DERBY-5018) [patch] remove erroneous throws clauses on non derivable methods that don't throw - posted by "Kathey Marsden (Resolved) (JIRA)" <ji...@apache.org> on 2012/03/16 23:50:38 UTC, 0 replies.
- [jira] [Updated] (DERBY-2254) Assert during log file switch: log file position exceeded max log file size - posted by "Mike Matrigali (Updated) (JIRA)" <ji...@apache.org> on 2012/03/17 01:36:39 UTC, 1 replies.
- [jira] [Updated] (DERBY-3823) NullPointerException in stress.multi test - posted by "Mike Matrigali (Updated) (JIRA)" <ji...@apache.org> on 2012/03/17 01:54:38 UTC, 1 replies.
- [jira] [Updated] (DERBY-4291) Intermittent failure in 'store/updatelocks.sql' on Windows Vista - posted by "Mike Matrigali (Updated) (JIRA)" <ji...@apache.org> on 2012/03/17 02:04:38 UTC, 0 replies.
- [jira] [Resolved] (DERBY-4291) Intermittent failure in 'store/updatelocks.sql' on Windows Vista - posted by "Mike Matrigali (Resolved) (JIRA)" <ji...@apache.org> on 2012/03/17 02:04:38 UTC, 0 replies.
- [jira] [Updated] (DERBY-5074) test failure(s) with IBM 1.4.2 in store.InterruptResilienceTest.testRAFWriteInterrupted: java.sql.SQLException: The exception 'junit.framework.AssertionFailedError: interrupt flag lost' was thrown while evaluating an expression. - posted by "Mike Matrigali (Updated) (JIRA)" <ji...@apache.org> on 2012/03/17 02:18:38 UTC, 0 replies.
- [jira] [Resolved] (DERBY-5074) test failure(s) with IBM 1.4.2 in store.InterruptResilienceTest.testRAFWriteInterrupted: java.sql.SQLException: The exception 'junit.framework.AssertionFailedError: interrupt flag lost' was thrown while evaluating an expression. - posted by "Mike Matrigali (Resolved) (JIRA)" <ji...@apache.org> on 2012/03/17 02:18:39 UTC, 0 replies.
- Regression Test Report - Daily 1301647 - Sun DBTG - posted by Ol...@Oracle.COM on 2012/03/17 17:55:11 UTC, 0 replies.
- [GSoC 2012] - posted by Gayan Dhanushka <ga...@gmail.com> on 2012/03/18 04:17:53 UTC, 0 replies.
- [jira] [Created] (DERBY-5663) Getting NPE when trying to set derby.language.logStatementText property to true inside a junit suite. - posted by "Mamta A. Satoor (Created) (JIRA)" <ji...@apache.org> on 2012/03/18 05:45:52 UTC, 0 replies.
- [jira] [Updated] (DERBY-5663) Getting NPE when trying to set derby.language.logStatementText property to true inside a junit suite. - posted by "Mamta A. Satoor (Updated) (JIRA)" <ji...@apache.org> on 2012/03/18 05:49:47 UTC, 4 replies.
- [jira] [Updated] (DERBY-4544) Referencing streaming CLOBs in (some) generated column clauses fails - posted by "Mike Matrigali (Updated) (JIRA)" <ji...@apache.org> on 2012/03/18 17:26:40 UTC, 1 replies.
- Regression Test Report - Daily 1301963 - Sun DBTG - posted by Ol...@Oracle.COM on 2012/03/18 17:55:14 UTC, 0 replies.
- [jira] [Reopened] (DERBY-5643) Occasional hangs in replication tests on Linux - posted by "Knut Anders Hatlen (Reopened) (JIRA)" <ji...@apache.org> on 2012/03/19 11:37:38 UTC, 0 replies.
- [jira] [Created] (DERBY-5664) Include driver tests in jdbcapi suite - posted by "Knut Anders Hatlen (Created) (JIRA)" <ji...@apache.org> on 2012/03/19 12:27:37 UTC, 0 replies.
- [jira] [Commented] (DERBY-5044) ALTER TABLE DROP COLUMN will not detect triggers defined on other tables with their trigger action using the column being dropped - posted by "Mamta A. Satoor (Commented) (JIRA)" <ji...@apache.org> on 2012/03/19 15:34:38 UTC, 0 replies.
- [jira] [Updated] (DERBY-5044) ALTER TABLE DROP COLUMN will not detect triggers defined on other tables with their trigger action using the column being dropped - posted by "Mamta A. Satoor (Updated) (JIRA)" <ji...@apache.org> on 2012/03/19 16:58:38 UTC, 0 replies.
- [jira] [Updated] (DERBY-4984) ALTER TABLE DROP COLUMN may leave triggers invalid even if they are not using the column getting dropped. - posted by "Mamta A. Satoor (Updated) (JIRA)" <ji...@apache.org> on 2012/03/19 17:00:38 UTC, 0 replies.
- [jira] [Commented] (DERBY-4984) ALTER TABLE DROP COLUMN may leave triggers invalid even if they are not using the column getting dropped. - posted by "Mamta A. Satoor (Commented) (JIRA)" <ji...@apache.org> on 2012/03/19 17:18:40 UTC, 0 replies.
- Regression Test Report - Daily 1302166 - Sun DBTG - posted by Ol...@Oracle.COM on 2012/03/19 17:55:13 UTC, 0 replies.
- [jira] [Resolved] (DERBY-4984) ALTER TABLE DROP COLUMN may leave triggers invalid even if they are not using the column getting dropped. - posted by "Mamta A. Satoor (Resolved) (JIRA)" <ji...@apache.org> on 2012/03/19 18:04:38 UTC, 0 replies.
- [jira] [Resolved] (DERBY-5044) ALTER TABLE DROP COLUMN will not detect triggers defined on other tables with their trigger action using the column being dropped - posted by "Mamta A. Satoor (Resolved) (JIRA)" <ji...@apache.org> on 2012/03/19 18:06:41 UTC, 0 replies.
- [jira] [Updated] (DERBY-5611) We don't provide any advice about what permissions are required to run ij under a Java security manager. - posted by "Mamta A. Satoor (Updated) (JIRA)" <ji...@apache.org> on 2012/03/19 19:11:39 UTC, 0 replies.
- [jira] [Updated] (DERBY-5570) dblook should not swallow ClassNotFoundException regardless of -verbose setting - posted by "Mamta A. Satoor (Updated) (JIRA)" <ji...@apache.org> on 2012/03/19 19:15:38 UTC, 0 replies.
- [jira] [Updated] (DERBY-5432) Space in default installation directory makes tools (e.g. dblook) unrunnable - posted by "Mamta A. Satoor (Updated) (JIRA)" <ji...@apache.org> on 2012/03/19 19:17:39 UTC, 0 replies.
- [jira] [Updated] (DERBY-5407) When run across the network, dblook produces unusable DDL for VARCHAR FOR BIT DATA columns. - posted by "Mamta A. Satoor (Updated) (JIRA)" <ji...@apache.org> on 2012/03/19 19:19:39 UTC, 0 replies.
- [jira] [Updated] (DERBY-5662) nstest causes ERROR X0X03: Invalid transaction state - held cursor requires same isolation level - posted by "Mamta A. Satoor (Updated) (JIRA)" <ji...@apache.org> on 2012/03/19 19:33:38 UTC, 0 replies.
- [jira] [Commented] (DERBY-5663) Getting NPE when trying to set derby.language.logStatementText property to true inside a junit suite. - posted by "Kathey Marsden (Commented) (JIRA)" <ji...@apache.org> on 2012/03/19 22:03:41 UTC, 7 replies.
- [jira] [Resolved] (DERBY-5357) SQLJ.INSTALL_JAR shouldn't use identifier as file name - posted by "Dag H. Wanvik (Resolved) (JIRA)" <ji...@apache.org> on 2012/03/20 12:07:38 UTC, 0 replies.
- [jira] [Updated] (DERBY-5664) Include driver tests in jdbcapi suite - posted by "Knut Anders Hatlen (Updated) (JIRA)" <ji...@apache.org> on 2012/03/20 12:15:39 UTC, 3 replies.
- [jira] [Commented] (DERBY-5636) Improve the overview of Derby's security mechanisms - posted by "Kim Haase (Commented) (JIRA)" <ji...@apache.org> on 2012/03/20 14:57:39 UTC, 6 replies.
- Regression Test Report - Daily 1302166S1 - Sun DBTG - posted by Ol...@Oracle.COM on 2012/03/20 17:55:07 UTC, 0 replies.
- [jira] [Assigned] (DERBY-4443) Wrap rollback in exception handlers in try-catch - posted by "Myrna van Lunteren (Assigned) (JIRA)" <ji...@apache.org> on 2012/03/20 22:11:41 UTC, 0 replies.
- [jira] [Commented] (DERBY-4443) Wrap rollback in exception handlers in try-catch - posted by "Myrna van Lunteren (Commented) (JIRA)" <ji...@apache.org> on 2012/03/20 22:11:42 UTC, 0 replies.
- [jira] [Created] (DERBY-5665) nightly regression test failure in rollForwardBackup: ERROR XSRS4: Error renaming file (during backup) from extinout\mybackup\wombat to extinout\mybackup\wombat.OLD. - posted by "Mike Matrigali (Created) (JIRA)" <ji...@apache.org> on 2012/03/20 22:39:38 UTC, 0 replies.
- [jira] [Commented] (DERBY-5665) nightly regression test failure in rollForwardBackup: ERROR XSRS4: Error renaming file (during backup) from extinout\mybackup\wombat to extinout\mybackup\wombat.OLD. - posted by "Mike Matrigali (Commented) (JIRA)" <ji...@apache.org> on 2012/03/20 22:41:40 UTC, 0 replies.
- [jira] [Created] (DERBY-5666) nightly suite error in NativeAuthenticationServiceTest : Database restoration unexpectedly failed. - posted by "Mike Matrigali (Created) (JIRA)" <ji...@apache.org> on 2012/03/20 22:59:37 UTC, 0 replies.
- [jira] [Updated] (DERBY-5666) nightly suite error in NativeAuthenticationServiceTest : Database restoration unexpectedly failed. - posted by "Mike Matrigali (Updated) (JIRA)" <ji...@apache.org> on 2012/03/20 23:07:39 UTC, 0 replies.
- [jira] [Commented] (DERBY-3624) testfailure in storetests/st_derby715 with ibm 1.5 on iseries machine; one deadlock message missing - posted by "Mike Matrigali (Commented) (JIRA)" <ji...@apache.org> on 2012/03/20 23:11:39 UTC, 1 replies.
- [jira] [Created] (DERBY-5667) testReadCommitted(org.apache.derbyTesting.functionTests.tests.store.UpdateLocksTest)junit.framework.AssertionFailedError: Missing rows in ResultSet - posted by "Mike Matrigali (Created) (JIRA)" <ji...@apache.org> on 2012/03/20 23:23:39 UTC, 0 replies.
- [jira] [Resolved] (DERBY-2254) Assert during log file switch: log file position exceeded max log file size - posted by "Mike Matrigali (Resolved) (JIRA)" <ji...@apache.org> on 2012/03/21 01:05:35 UTC, 0 replies.
- [jira] [Resolved] (DERBY-3823) NullPointerException in stress.multi test - posted by "Mike Matrigali (Resolved) (JIRA)" <ji...@apache.org> on 2012/03/21 01:08:43 UTC, 0 replies.
- [jira] [Commented] (DERBY-5430) Embedded nstest shows ERROR 40001: A lock could not be obtained due to a deadlock, in nstest - posted by "Myrna van Lunteren (Commented) (JIRA)" <ji...@apache.org> on 2012/03/21 02:04:38 UTC, 0 replies.
- [jira] [Commented] (DERBY-5422) IndexOutOfBoundsException followed by NullPointerException in cleanup during system.nstest - posted by "Myrna van Lunteren (Commented) (JIRA)" <ji...@apache.org> on 2012/03/21 02:14:38 UTC, 0 replies.
- [jira] [Updated] (DERBY-4275) Query executions fail when compressing a table using SYSCS_UTIL.SYSCS_COMPRESS_TABLE - posted by "Mike Matrigali (Updated) (JIRA)" <ji...@apache.org> on 2012/03/21 02:28:39 UTC, 2 replies.
- [jira] [Assigned] (DERBY-5369) Restricted Table Function support should pass NOT EQUAL restrictions to initScan - posted by "Mamta A. Satoor (Assigned) (JIRA)" <ji...@apache.org> on 2012/03/21 02:42:39 UTC, 1 replies.
- Regression Test Report - tinderbox_trunk16 1301015 - Sun Database Engineering - posted by ol...@oracle.com on 2012/03/21 09:52:41 UTC, 0 replies.
- [jira] [Updated] (DERBY-2515) Network client does not retain the INOUT parameter value change for subsequent execution - posted by "Kathey Marsden (Updated) (JIRA)" <ji...@apache.org> on 2012/03/21 14:03:48 UTC, 0 replies.
- [jira] [Resolved] (DERBY-2515) Network client does not retain the INOUT parameter value change for subsequent execution - posted by "Kathey Marsden (Resolved) (JIRA)" <ji...@apache.org> on 2012/03/21 14:03:48 UTC, 0 replies.
- [jira] [Updated] (DERBY-5369) Restricted Table Function support should pass NOT EQUAL restrictions to initScan - posted by "Mamta A. Satoor (Updated) (JIRA)" <ji...@apache.org> on 2012/03/21 17:21:41 UTC, 1 replies.
- Regression Test Report - Daily 1302996 - Sun DBTG - posted by Ol...@Oracle.COM on 2012/03/21 17:55:24 UTC, 0 replies.
- [jira] [Commented] (DERBY-4201) SecureServerTest AssertionFailedError: Timed out waiting for network server to start - posted by "Mamta A. Satoor (Commented) (JIRA)" <ji...@apache.org> on 2012/03/21 19:11:40 UTC, 0 replies.
- [jira] [Assigned] (DERBY-4201) SecureServerTest AssertionFailedError: Timed out waiting for network server to start - posted by "Mamta A. Satoor (Assigned) (JIRA)" <ji...@apache.org> on 2012/03/21 19:11:41 UTC, 0 replies.
- Question on whether to use multiple databases/multiple network servers or not - posted by "Bergquist, Brett" <BB...@canoga.com> on 2012/03/21 22:51:03 UTC, 3 replies.
- [jira] [Assigned] (DERBY-4669) ClassLoaderBootTest fails if derbyclient.jar comes before derby.jar on the classpath - posted by "Kathey Marsden (Assigned) (JIRA)" <ji...@apache.org> on 2012/03/22 00:44:22 UTC, 0 replies.
- [jira] [Updated] (DERBY-4201) SecureServerTest AssertionFailedError: Timed out waiting for network server to start - posted by "Mamta A. Satoor (Updated) (JIRA)" <ji...@apache.org> on 2012/03/22 05:04:28 UTC, 2 replies.
- [jira] [Resolved] (DERBY-5369) Restricted Table Function support should pass NOT EQUAL restrictions to initScan - posted by "Mamta A. Satoor (Resolved) (JIRA)" <ji...@apache.org> on 2012/03/22 05:42:22 UTC, 0 replies.
- [jira] [Resolved] (DERBY-5664) Include driver tests in jdbcapi suite - posted by "Knut Anders Hatlen (Resolved) (JIRA)" <ji...@apache.org> on 2012/03/22 10:14:22 UTC, 1 replies.
- [jira] [Reopened] (DERBY-5372) Need to document that the != and <> operators are pushed into Restricted table functions (once the work on DERBY-5369 wraps up) - posted by "Kim Haase (Reopened) (JIRA)" <ji...@apache.org> on 2012/03/22 14:30:22 UTC, 0 replies.
- [jira] [Created] (DERBY-5668) Derby does not publish source artifacts to Maven Central - posted by "Martin Todorov (Created) (JIRA)" <ji...@apache.org> on 2012/03/22 16:22:23 UTC, 0 replies.
- [jira] [Updated] (DERBY-5668) Derby does not publish source artifacts to Maven Central - posted by "Knut Anders Hatlen (Updated) (JIRA)" <ji...@apache.org> on 2012/03/22 16:52:23 UTC, 0 replies.
- Regression Test Report - Daily 1303465 - Sun DBTG - posted by Ol...@Oracle.COM on 2012/03/22 17:55:22 UTC, 0 replies.
- [jira] [Created] (DERBY-5669) (net)jdbcapi.DboPowersTest.testHardUpgrade test cleanup fails to delete files/directory - this leads to cascade of 225 errors in test run - posted by "Mike Matrigali (Created) (JIRA)" <ji...@apache.org> on 2012/03/22 22:30:23 UTC, 0 replies.
- [jira] [Commented] (DERBY-5669) (net)jdbcapi.DboPowersTest.testHardUpgrade test cleanup fails to delete files/directory - this leads to cascade of 225 errors in test run - posted by "Mike Matrigali (Commented) (JIRA)" <ji...@apache.org> on 2012/03/22 22:32:24 UTC, 0 replies.
- [jira] [Resolved] (DERBY-4201) SecureServerTest AssertionFailedError: Timed out waiting for network server to start - posted by "Mamta A. Satoor (Resolved) (JIRA)" <ji...@apache.org> on 2012/03/23 00:26:22 UTC, 0 replies.
- The conglomerate (20208) requested does not exist., SQL State: XSAI2, Error Code: -1 [I] - posted by Neena Damodaran <ne...@db.com> on 2012/03/23 09:30:22 UTC, 1 replies.
- Regression Test Report - Daily 1303890 - Sun DBTG - posted by Ol...@Oracle.COM on 2012/03/23 17:55:24 UTC, 0 replies.
- [jira] [Commented] (DERBY-5629) Queries with guarded null Parameter fail - posted by "bernard (Commented) (JIRA)" <ji...@apache.org> on 2012/03/23 19:15:29 UTC, 1 replies.
- [jira] [Updated] (DERBY-5629) Queries with guarded null Parameter fail - posted by "Rick Hillegas (Updated) (JIRA)" <ji...@apache.org> on 2012/03/23 19:45:30 UTC, 0 replies.
- [jira] [Resolved] (DERBY-5522) Document the NATIVE authentication scheme. - posted by "Kim Haase (Resolved) (JIRA)" <ji...@apache.org> on 2012/03/23 20:43:28 UTC, 0 replies.
- [jira] [Updated] (DERBY-5636) Improve the overview of Derby's security mechanisms - posted by "Kim Haase (Updated) (JIRA)" <ji...@apache.org> on 2012/03/23 21:55:25 UTC, 3 replies.
- Why is a very bad query plan being chosen and why did it change from good to bad? - posted by "Bergquist, Brett" <BB...@canoga.com> on 2012/03/23 23:04:29 UTC, 3 replies.
- [jira] [Closed] (DERBY-4443) Wrap rollback in exception handlers in try-catch - posted by "Myrna van Lunteren (Closed) (JIRA)" <ji...@apache.org> on 2012/03/23 23:43:32 UTC, 0 replies.
- [jira] [Created] (DERBY-5670) multiple failures in AutoloadTest, in nightly regression test run - posted by "Mike Matrigali (Created) (JIRA)" <ji...@apache.org> on 2012/03/24 02:13:26 UTC, 0 replies.
- [jira] [Commented] (DERBY-5664) Include driver tests in jdbcapi suite - posted by "Mike Matrigali (Commented) (JIRA)" <ji...@apache.org> on 2012/03/24 02:19:24 UTC, 0 replies.
- Another question on performance/faireness, etc. - posted by "Bergquist, Brett" <BB...@canoga.com> on 2012/03/24 03:15:20 UTC, 1 replies.
- Regression Test Report - Daily 1304482 - Sun DBTG - posted by Ol...@Oracle.COM on 2012/03/24 17:55:21 UTC, 0 replies.
- Regression Test Report - Daily 1304858 - Sun DBTG - posted by Ol...@Oracle.COM on 2012/03/25 17:55:21 UTC, 0 replies.
- [jira] [Created] (DERBY-5671) NsTest does not run on trunk do multiple issues stemming from concurrency improvements - posted by "Kathey Marsden (Created) (JIRA)" <ji...@apache.org> on 2012/03/25 20:53:27 UTC, 0 replies.
- [jira] [Updated] (DERBY-5671) NsTest does not run on trunk do multiple issues stemming from concurrency improvements - posted by "Kathey Marsden (Updated) (JIRA)" <ji...@apache.org> on 2012/03/25 20:57:27 UTC, 0 replies.
- Yet another performance question, this time on derby.storage.pageCacheSize - posted by "Bergquist, Brett" <BB...@canoga.com> on 2012/03/25 20:57:31 UTC, 2 replies.
- [jira] [Commented] (DERBY-5670) multiple failures in AutoloadTest, in nightly regression test run - posted by "Knut Anders Hatlen (Commented) (JIRA)" <ji...@apache.org> on 2012/03/25 21:45:27 UTC, 3 replies.
- [jira] [Reopened] (DERBY-5664) Include driver tests in jdbcapi suite - posted by "Knut Anders Hatlen (Reopened) (JIRA)" <ji...@apache.org> on 2012/03/25 21:51:25 UTC, 0 replies.
- [jira] [Commented] (DERBY-5671) NsTest does not run on trunk do multiple issues stemming from concurrency improvements - posted by "Rick Hillegas (Commented) (JIRA)" <ji...@apache.org> on 2012/03/26 14:40:28 UTC, 1 replies.
- [jira] [Updated] (DERBY-5495) Master issue to track fixes to sequence generators - posted by "Rick Hillegas (Updated) (JIRA)" <ji...@apache.org> on 2012/03/26 14:44:27 UTC, 0 replies.
- [jira] [Commented] (DERBY-5550) Document derby.authentication.builtin.saltLength and derby.authentication.builtin.iterations - posted by "Kim Haase (Commented) (JIRA)" <ji...@apache.org> on 2012/03/26 16:02:27 UTC, 3 replies.
- Regression Test Report - Daily 1305066 - Sun DBTG - posted by Ol...@Oracle.COM on 2012/03/26 17:55:24 UTC, 0 replies.
- [jira] [Commented] (DERBY-5494) Same value returned by successive calls to a sequence generator flanking an unorderly shutdown. - posted by "Rick Hillegas (Commented) (JIRA)" <ji...@apache.org> on 2012/03/26 18:10:37 UTC, 0 replies.
- [jira] [Resolved] (DERBY-4544) Referencing streaming CLOBs in (some) generated column clauses fails - posted by "Mike Matrigali (Resolved) (JIRA)" <ji...@apache.org> on 2012/03/26 19:40:26 UTC, 0 replies.
- [jira] [Updated] (DERBY-5550) Document derby.authentication.builtin.saltLength and derby.authentication.builtin.iterations - posted by "Kim Haase (Updated) (JIRA)" <ji...@apache.org> on 2012/03/26 20:44:26 UTC, 2 replies.
- [jira] [Closed] (DERBY-1903) Convert largedata/LobLimits.java to junit - posted by "Myrna van Lunteren (Closed) (JIRA)" <ji...@apache.org> on 2012/03/27 01:52:29 UTC, 0 replies.
- [jira] [Closed] (DERBY-1888) Convert LOB tests to Junit - posted by "Myrna van Lunteren (Closed) (JIRA)" <ji...@apache.org> on 2012/03/27 01:54:27 UTC, 0 replies.
- [jira] [Updated] (DERBY-5454) ERROR 40001 deadlock in nstest on select max(serialkey) - posted by "Myrna van Lunteren (Updated) (JIRA)" <ji...@apache.org> on 2012/03/27 02:25:25 UTC, 0 replies.
- [jira] [Created] (DERBY-5672) Multiple failures in jdbcapi.XADSAuthenticationTest starting with testUserFunctions(org.apache.derbyTesting.functionTests.tests.jdbcapi.XADSAuthenticajava.sql.SQLException: An SQL data change is not permitted for a read-only connection, user or database. - posted by "Kathey Marsden (Created) (JIRA)" <ji...@apache.org> on 2012/03/27 03:13:24 UTC, 0 replies.
- [jira] [Created] (DERBY-5673) backupRestore1 fails with Error copying file (during backup) ... logctrl.dat - posted by "Kathey Marsden (Created) (JIRA)" <ji...@apache.org> on 2012/03/27 03:17:24 UTC, 0 replies.
- Garbage-collecting Derby classes, was: Can't remove derby from memory - posted by Rick Hillegas <ri...@oracle.com> on 2012/03/27 14:25:16 UTC, 1 replies.
- [jira] [Assigned] (DERBY-5493) Same value returned by successive calls to a sequence generator. - posted by "Rick Hillegas (Assigned) (JIRA)" <ji...@apache.org> on 2012/03/27 16:44:26 UTC, 0 replies.
- [jira] [Updated] (DERBY-5493) Same value returned by successive calls to a sequence generator. - posted by "Rick Hillegas (Updated) (JIRA)" <ji...@apache.org> on 2012/03/27 16:46:25 UTC, 1 replies.
- [jira] [Resolved] (DERBY-5636) Improve the overview of Derby's security mechanisms - posted by "Kim Haase (Resolved) (JIRA)" <ji...@apache.org> on 2012/03/27 16:46:26 UTC, 0 replies.
- Regression Test Report - Daily 1305417 - Sun DBTG - posted by Ol...@Oracle.COM on 2012/03/27 17:55:22 UTC, 0 replies.
- [jira] [Commented] (DERBY-5493) Same value returned by successive calls to a sequence generator. - posted by "Mike Matrigali (Commented) (JIRA)" <ji...@apache.org> on 2012/03/27 18:12:31 UTC, 7 replies.
- Next release - posted by Dmitry <de...@gmail.com> on 2012/03/27 18:55:47 UTC, 1 replies.
- [jira] [Resolved] (DERBY-5550) Document derby.authentication.builtin.saltLength and derby.authentication.builtin.iterations - posted by "Kim Haase (Resolved) (JIRA)" <ji...@apache.org> on 2012/03/27 19:24:26 UTC, 0 replies.
- [jira] [Commented] (DERBY-5083) Document automatic update and creation of index cardinality statistics (istat) - posted by "Kim Haase (Commented) (JIRA)" <ji...@apache.org> on 2012/03/27 20:10:30 UTC, 4 replies.
- Really need some help here please. I think I am having a problem with some sort of caching in Derby - posted by "Bergquist, Brett" <BB...@canoga.com> on 2012/03/27 20:11:41 UTC, 5 replies.
- [jira] [Created] (DERBY-5674) Improve Derby's Code Coverage - GSoC 2012 Project - posted by "Tiago R. Espinha (Created) (JIRA)" <ji...@apache.org> on 2012/03/27 22:54:28 UTC, 0 replies.
- GSoC 2012 - To potential student applicants on the list - posted by Tiago Espinha <ti...@espinha.net> on 2012/03/27 22:57:28 UTC, 0 replies.
- [jira] [Commented] (DERBY-5442) Create documentation for restrictive file permissions feature - posted by "Kim Haase (Commented) (JIRA)" <ji...@apache.org> on 2012/03/27 23:14:28 UTC, 0 replies.
- [jira] [Updated] (DERBY-5377) AssertionFailedError in testCaseCS4595B_NonUniqueIndex in AccessTest - posted by "Myrna van Lunteren (Updated) (JIRA)" <ji...@apache.org> on 2012/03/28 01:44:28 UTC, 1 replies.
- [jira] [Commented] (DERBY-5674) Improve Derby's Code Coverage - GSoC 2012 Project - posted by "Echo (Commented) (JIRA)" <ji...@apache.org> on 2012/03/28 03:57:22 UTC, 1 replies.
- [GSoC2012 Improve Derby's Code Coverage] - posted by echo <ec...@gmail.com> on 2012/03/28 04:23:20 UTC, 0 replies.
- Regression Test Report - Daily 1305879 - Sun DBTG - posted by Ol...@Oracle.COM on 2012/03/28 17:55:25 UTC, 0 replies.
- Re: svn commit: r1305451 - in /db/derby/code/branches/10.3/java: engine/org/apache/derby/impl/sql/compile/ engine/org/apache/derby/impl/sql/execute/ testing/org/apache/derbyTesting/functionTests/tests/lang/ testing/org/apache/derbyTesting/junit/ - posted by Myrna van Lunteren <m....@gmail.com> on 2012/03/28 18:59:39 UTC, 0 replies.
- [jira] [Created] (DERBY-5675) on IBM 1.7 20 failures , 190 errors mostly of the variety Java exception: 'sun.misc.Unsafe incompatible with java.util.concurrent.ConcurrentHashMap$HashEntry: java.lang.ClassCastException'. - posted by "Kathey Marsden (Created) (JIRA)" <ji...@apache.org> on 2012/03/28 19:33:27 UTC, 0 replies.
- [jira] [Commented] (DERBY-5499) Document the new JDBC limit/offset escape syntax - posted by "Kim Haase (Commented) (JIRA)" <ji...@apache.org> on 2012/03/28 19:43:27 UTC, 3 replies.
- [jira] [Created] (DERBY-5676) Database cannot to started - posted by "Ambili (Created) (JIRA)" <ji...@apache.org> on 2012/03/28 22:23:25 UTC, 0 replies.
- [jira] [Updated] (DERBY-5676) Database cannot to started - posted by "Ambili (Updated) (JIRA)" <ji...@apache.org> on 2012/03/28 22:25:25 UTC, 3 replies.
- [jira] [Commented] (DERBY-5676) Database cannot to started - posted by "Ambili (Commented) (JIRA)" <ji...@apache.org> on 2012/03/28 22:25:27 UTC, 11 replies.
- [jira] [Assigned] (DERBY-5663) Getting NPE when trying to set derby.language.logStatementText property to true inside a junit suite. - posted by "Mamta A. Satoor (Assigned) (JIRA)" <ji...@apache.org> on 2012/03/28 22:27:30 UTC, 0 replies.
- [jira] [Updated] (DERBY-5499) Document the new JDBC limit/offset escape syntax - posted by "Kim Haase (Updated) (JIRA)" <ji...@apache.org> on 2012/03/28 22:29:27 UTC, 2 replies.
- [jira] [Issue Comment Edited] (DERBY-5663) Getting NPE when trying to set derby.language.logStatementText property to true inside a junit suite. - posted by "Knut Anders Hatlen (Issue Comment Edited) (JIRA)" <ji...@apache.org> on 2012/03/28 23:37:29 UTC, 0 replies.
- [jira] [Resolved] (DERBY-4540) 'AssertionFailedError' in 'store.AccessTest.testCS4595B_UniqueIndex(AccessTest.java:1729)' on SUSE Linux / IBM JIT - r9 - posted by "Myrna van Lunteren (Resolved) (JIRA)" <ji...@apache.org> on 2012/03/29 00:15:31 UTC, 0 replies.
- [jira] [Resolved] (DERBY-5670) multiple failures in AutoloadTest, in nightly regression test run - posted by "Myrna van Lunteren (Resolved) (JIRA)" <ji...@apache.org> on 2012/03/29 00:43:27 UTC, 0 replies.
- [jira] [Created] (DERBY-5677) ClassNotFoundException when running suites.All without derbynet.jar - posted by "Knut Anders Hatlen (Created) (JIRA)" <ji...@apache.org> on 2012/03/29 10:07:49 UTC, 0 replies.
- [jira] [Updated] (DERBY-5677) ClassNotFoundException when running suites.All without derbynet.jar - posted by "Knut Anders Hatlen (Updated) (JIRA)" <ji...@apache.org> on 2012/03/29 10:31:58 UTC, 1 replies.
- [jira] [Created] (DERBY-5678) LocalizedDisplayScriptTest fails on JVMs that don't support EUC_JP encoding - posted by "Knut Anders Hatlen (Created) (JIRA)" <ji...@apache.org> on 2012/03/29 11:38:33 UTC, 0 replies.
- [jira] [Updated] (DERBY-5678) LocalizedDisplayScriptTest fails on JVMs that don't support EUC_JP encoding - posted by "Knut Anders Hatlen (Updated) (JIRA)" <ji...@apache.org> on 2012/03/29 12:10:27 UTC, 1 replies.
- [jira] [Commented] (DERBY-5678) LocalizedDisplayScriptTest fails on JVMs that don't support EUC_JP encoding - posted by "Kristian Waagan (Commented) (JIRA)" <ji...@apache.org> on 2012/03/29 12:58:25 UTC, 0 replies.
- [jira] [Commented] (DERBY-11) Recursive SQL and WITH A(col list) as (Select col list From Table List) Support. - posted by "Dileepa Sisila Chandrasekera (Commented) (JIRA)" <ji...@apache.org> on 2012/03/29 13:02:30 UTC, 0 replies.
- [jira] [Issue Comment Edited] (DERBY-5083) Document automatic update and creation of index cardinality statistics (istat) - posted by "Kristian Waagan (Issue Comment Edited) (JIRA)" <ji...@apache.org> on 2012/03/29 15:32:27 UTC, 0 replies.
- Regression Test Report - Daily 1306444 - Sun DBTG - posted by Ol...@Oracle.COM on 2012/03/29 17:55:21 UTC, 0 replies.
- [jira] [Resolved] (DERBY-5499) Document the new JDBC limit/offset escape syntax - posted by "Kim Haase (Resolved) (JIRA)" <ji...@apache.org> on 2012/03/29 19:22:28 UTC, 0 replies.
- [jira] [Updated] (DERBY-5083) Document automatic update and creation of index cardinality statistics (istat) - posted by "Kim Haase (Updated) (JIRA)" <ji...@apache.org> on 2012/03/29 22:08:22 UTC, 1 replies.
- [jira] [Created] (DERBY-5679) Rolling back a transaction leads to an inconsistent state - posted by "Brett Mason (Created) (JIRA)" <ji...@apache.org> on 2012/03/29 22:22:22 UTC, 0 replies.
- [jira] [Updated] (DERBY-5679) Rolling back a transaction leads to an inconsistent state - posted by "Brett Mason (Updated) (JIRA)" <ji...@apache.org> on 2012/03/29 22:24:22 UTC, 1 replies.
- [jira] [Commented] (DERBY-5679) Rolling back a transaction leads to an inconsistent state - posted by "Mike Matrigali (Commented) (JIRA)" <ji...@apache.org> on 2012/03/30 00:03:25 UTC, 0 replies.
- Question on why indexStat deamon is being triggered - posted by "Bergquist, Brett" <BB...@canoga.com> on 2012/03/30 01:02:45 UTC, 9 replies.
- [jira] [Resolved] (DERBY-5083) Document automatic update and creation of index cardinality statistics (istat) - posted by "Kim Haase (Resolved) (JIRA)" <ji...@apache.org> on 2012/03/30 15:44:28 UTC, 0 replies.
- Regression Test Report - Daily 1306945 - Sun DBTG - posted by Ol...@Oracle.COM on 2012/03/30 17:55:25 UTC, 0 replies.
- [jira] [Created] (DERBY-5680) indexStat daemon processing tables over an over even when there are no changes in the tables - posted by "Brett Bergquist (Created) (JIRA)" <ji...@apache.org> on 2012/03/30 19:22:26 UTC, 0 replies.
- [jira] [Updated] (DERBY-5675) on IBM 1.7 20 failures , 190 errors mostly of the variety Java exception: 'sun.misc.Unsafe incompatible with java.util.concurrent.ConcurrentHashMap$HashEntry: java.lang.ClassCastException'. - posted by "Kathey Marsden (Updated) (JIRA)" <ji...@apache.org> on 2012/03/30 20:12:28 UTC, 0 replies.
- [jira] [Resolved] (DERBY-4275) Query executions fail when compressing a table using SYSCS_UTIL.SYSCS_COMPRESS_TABLE - posted by "Mike Matrigali (Resolved) (JIRA)" <ji...@apache.org> on 2012/03/30 21:16:35 UTC, 0 replies.
- [jira] [Updated] (DERBY-5624) System can run out of stack space while processing DropOnCommit requests. - posted by "Mike Matrigali (Updated) (JIRA)" <ji...@apache.org> on 2012/03/30 22:55:28 UTC, 0 replies.
- Build failed in Jenkins: Derby-branch-10.8 #153 - posted by Apache Jenkins Server <je...@builds.apache.org> on 2012/03/31 04:01:49 UTC, 0 replies.
- [jira] [Commented] (DERBY-3296) Importing to table in default schema fails when another table with the same name exists in a different schema - posted by "Eric Vergnaud (Commented) (JIRA)" <ji...@apache.org> on 2012/03/31 09:59:09 UTC, 0 replies.
- To solve the issue on MERGE statement in Derby - posted by adeesha wijayasiri <ad...@gmail.com> on 2012/03/31 14:47:03 UTC, 0 replies.
- Regression Test Report - Daily 1307496 - Sun DBTG - posted by Ol...@Oracle.COM on 2012/03/31 17:55:21 UTC, 0 replies.