You are viewing a plain text version of this content. The canonical link for it is here.
- Re: AW: Desparately seeking help with pipeline implementation - posted by Sylvain Wallez <sy...@apache.org> on 2006/05/01 00:01:16 UTC, 4 replies.
- [jira] Updated: (COCOON-398) ConcurrentModificationException in Cocoon.debug() - posted by "Ralph Goers (JIRA)" <ji...@apache.org> on 2006/05/01 00:24:37 UTC, 2 replies.
- [jira] Reopened: (COCOON-398) ConcurrentModificationException in Cocoon.debug() - posted by "Ralph Goers (JIRA)" <ji...@apache.org> on 2006/05/01 00:24:38 UTC, 0 replies.
- [jira] Commented: (COCOON-398) ConcurrentModificationException in Cocoon.debug() - posted by "Antonio Gallardo (JIRA)" <ji...@apache.org> on 2006/05/01 00:35:40 UTC, 1 replies.
- Re: [continuum] BUILD FAILURE: Portal Block Implementation - posted by Jorg Heymans <jh...@domek.be> on 2006/05/01 10:48:58 UTC, 5 replies.
- [RT] Simplifying setup - posted by Daniel Fagerstrom <da...@nada.kth.se> on 2006/05/01 11:05:32 UTC, 28 replies.
- RE: VNU Europe moves to Cocoon... - posted by Arje Cahn <a....@hippo.nl> on 2006/05/01 13:41:00 UTC, 1 replies.
- [GT2006] The 5th Cocoon GetTogether: call for ideas - posted by Arje Cahn <a....@hippo.nl> on 2006/05/01 16:49:39 UTC, 6 replies.
- [jira] Created: (COCOON-1841) strange behavior with sitemaps mounted from within jars - posted by "Harlan Iverson (JIRA)" <ji...@apache.org> on 2006/05/01 17:42:46 UTC, 0 replies.
- [jira] Commented: (COCOON-1841) strange behavior with sitemaps mounted from within jars - posted by "Harlan Iverson (JIRA)" <ji...@apache.org> on 2006/05/01 18:58:46 UTC, 0 replies.
- Re: Template block in ibiblio maven repository - posted by Carsten Ziegeler <cz...@apache.org> on 2006/05/02 08:49:59 UTC, 13 replies.
- Re: Cocoon PMC chair election: proposed resolution - posted by Jeremy Quinn <je...@apache.org> on 2006/05/02 11:10:09 UTC, 0 replies.
- Is It Possible to reload WEB-INF/classes and WEB-INF/lib without restart? - posted by Adrien Guillon <gu...@dainty.ca> on 2006/05/02 17:00:11 UTC, 2 replies.
- Re: svn commit: r398882 -/cocoon/trunk/core/cocoon-core/src/main/java/org/apache/cocoon/transf ormation/EncodeURLTransformer.java - posted by Ralph Goers <Ra...@dslextreme.com> on 2006/05/02 18:12:55 UTC, 4 replies.
- [jira] Subscription: COCOON-open-with-patch - posted by ji...@apache.org on 2006/05/03 11:45:48 UTC, 6 replies.
- [jira] Closed: (COCOON-1511) [Patch] User-Agent is PARAMETER, not HEADER in Command-line interface - posted by "Carsten Ziegeler (JIRA)" <ji...@apache.org> on 2006/05/03 13:51:47 UTC, 0 replies.
- [jira] Commented: (COCOON-1685) Additional ProcessingPhase.READ_FROM_REQUEST_VALUE event sent - posted by "Antonio Gallardo (JIRA)" <ji...@apache.org> on 2006/05/03 16:00:46 UTC, 4 replies.
- [jira] Closed: (COCOON-1685) Additional ProcessingPhase.READ_FROM_REQUEST_VALUE event sent - posted by "Simone Gianni (JIRA)" <ji...@apache.org> on 2006/05/03 16:06:46 UTC, 0 replies.
- [jira] Closed: (COCOON-1781) Processing phase listener cannot be configured from form definitio - posted by "Simone Gianni (JIRA)" <ji...@apache.org> on 2006/05/03 16:08:46 UTC, 0 replies.
- [jira] Closed: (COCOON-1801) [PATCH] Repeater events - posted by "Simone Gianni (JIRA)" <ji...@apache.org> on 2006/05/03 16:08:47 UTC, 0 replies.
- [Fwd: CForms and Uploads?!?!] - posted by Berin Loritsch <bl...@d-haven.com> on 2006/05/03 21:00:51 UTC, 0 replies.
- [RT] Resources Accessible Via Subsitemaps To Enable Better Re-Use - posted by Adrien Guillon <gu...@dainty.ca> on 2006/05/04 07:00:28 UTC, 14 replies.
- [jira] Updated: (COCOON-1493) eclipse-project target not working - posted by "David Crossley (JIRA)" <ji...@apache.org> on 2006/05/04 07:30:20 UTC, 0 replies.
- Cannot compile trunk - posted by Giacomo Pati <gi...@apache.org> on 2006/05/04 11:15:30 UTC, 16 replies.
- [jira] Created: (COCOON-1842) LDAPTransformer: ClassCastException with Binary fields - posted by "Nicola Scendoni (JIRA)" <ji...@apache.org> on 2006/05/04 12:46:17 UTC, 0 replies.
- [jira] Created: (COCOON-1843) LDAPTransformer: add-entry tag doesn't work - posted by "Nicola Scendoni (JIRA)" <ji...@apache.org> on 2006/05/04 15:18:16 UTC, 0 replies.
- ForrestBot build for cocoon-docs FAILED - posted by Fo...@forrest.zones.apache.org on 2006/05/05 02:24:24 UTC, 30 replies.
- [jira] Created: (COCOON-1844) NPE caused by integer fields which have an but no locale attribute - posted by "Dewi Roberts (JIRA)" <ji...@apache.org> on 2006/05/05 12:26:27 UTC, 0 replies.
- [jira] Assigned: (COCOON-1844) NPE caused by integer fields which have an but no locale attribute - posted by "Simone Gianni (JIRA)" <ji...@apache.org> on 2006/05/05 12:49:29 UTC, 0 replies.
- [jira] Commented: (COCOON-1844) NPE caused by integer fields which have an but no locale attribute - posted by "Simone Gianni (JIRA)" <ji...@apache.org> on 2006/05/05 13:02:28 UTC, 1 replies.
- [jira] Closed: (COCOON-1844) NPE caused by integer fields which have an but no locale attribute - posted by "Simone Gianni (JIRA)" <ji...@apache.org> on 2006/05/05 13:13:28 UTC, 0 replies.
- [jira] Created: (COCOON-1845) [PATCH] Add omit-xml-declaration parameter to XHTMLSerializer - posted by "Maurizio Pillitu (JIRA)" <ji...@apache.org> on 2006/05/05 15:36:28 UTC, 0 replies.
- Re: Giving a try to Cocoon 2.2 - posted by Reinhard Poetz <re...@apache.org> on 2006/05/05 15:43:18 UTC, 2 replies.
- [jira] Closed: (COCOON-1742) EncodeURLTransformer can get a StackOverflow in jakarta regexp - posted by "Ralph Goers (JIRA)" <ji...@apache.org> on 2006/05/05 16:01:28 UTC, 0 replies.
- [jira] Closed: (COCOON-1845) [PATCH] Add omit-xml-declaration parameter to XHTMLSerializer - posted by "Andrew Savory (JIRA)" <ji...@apache.org> on 2006/05/05 16:09:29 UTC, 0 replies.
- [jira] Commented: (COCOON-1574) Memory Leak with XMLFileModule - posted by "Ellis Pritchard (JIRA)" <ji...@apache.org> on 2006/05/05 17:14:29 UTC, 4 replies.
- [jira] Commented: (COCOON-1842) LDAPTransformer: ClassCastException with Binary fields - posted by "Antonio Gallardo (JIRA)" <ji...@apache.org> on 2006/05/06 06:54:29 UTC, 1 replies.
- Re: GSoC proposals - posted by Jason Johnston <co...@lojjic.net> on 2006/05/07 01:12:59 UTC, 5 replies.
- Re: GSoC: Cocoon & JMX - posted by Daniel Fagerstrom <da...@nada.kth.se> on 2006/05/08 01:11:35 UTC, 2 replies.
- Daisy admin rights - posted by Reinhard Poetz <re...@apache.org> on 2006/05/08 09:51:30 UTC, 1 replies.
- Finding a name for OSGi based Cocoon - posted by Reinhard Poetz <re...@apache.org> on 2006/05/08 10:05:00 UTC, 7 replies.
- [jira] Closed: (COCOON-1587) [PATCH] Simple i18n support for selectionLists - posted by "Rolf Metternich (JIRA)" <ji...@apache.org> on 2006/05/08 12:12:22 UTC, 0 replies.
- [jira] Assigned: (COCOON-1782) [PATCH] Support for CSS classes in cocoon forms XSL - posted by "Simone Gianni (JIRA)" <ji...@apache.org> on 2006/05/08 13:20:21 UTC, 0 replies.
- Maven dependencies - posted by Reinhard Poetz <re...@apache.org> on 2006/05/08 14:13:57 UTC, 18 replies.
- google summer of code: ajax - posted by Matthias Epheser <ma...@gmx.at> on 2006/05/08 15:09:40 UTC, 4 replies.
- [jira] Closed: (COCOON-1782) [PATCH] Support for CSS classes in cocoon forms XSL - posted by "Simone Gianni (JIRA)" <ji...@apache.org> on 2006/05/08 17:54:21 UTC, 3 replies.
- [continuum] BUILD FAILURE: Cocoon Core - posted by "continuum@cocoon.zones.apache.org" <co...@cocoon.zones.apache.org> on 2006/05/08 18:17:39 UTC, 15 replies.
- [continuum] BUILD FAILURE: Portal Block - posted by "continuum@cocoon.zones.apache.org" <co...@cocoon.zones.apache.org> on 2006/05/08 18:47:55 UTC, 0 replies.
- [continuum] BUILD FAILURE: ojb Block Implementation - posted by "continuum@cocoon.zones.apache.org" <co...@cocoon.zones.apache.org> on 2006/05/08 18:58:30 UTC, 1 replies.
- ApacheCon Hackaton: focus on 2.2? - posted by Bertrand Delacretaz <bd...@apache.org> on 2006/05/09 11:13:44 UTC, 17 replies.
- [jira] Created: (COCOON-1846) [PATCH] BooleanField and radio do not send on-value-changed at the rigth time with IE - posted by "vincent Demay (JIRA)" <ji...@apache.org> on 2006/05/09 15:17:21 UTC, 0 replies.
- Re: LDAPTransformer - posted by Jean-Baptiste Quenot <jb...@apache.org> on 2006/05/09 15:49:03 UTC, 0 replies.
- [jira] Assigned: (COCOON-1846) [PATCH] BooleanField and radio do not send on-value-changed at the rigth time with IE - posted by "Simone Gianni (JIRA)" <ji...@apache.org> on 2006/05/09 18:22:06 UTC, 0 replies.
- [jira] Commented: (COCOON-1846) [PATCH] BooleanField and radio do not send on-value-changed at the rigth time with IE - posted by "Simone Gianni (JIRA)" <ji...@apache.org> on 2006/05/09 18:28:05 UTC, 1 replies.
- [jira] Created: (COCOON-1847) [PATCH] AJAX errors' popup window not resizable/scrollable - posted by "Guillaume Déflache (JIRA)" <ji...@apache.org> on 2006/05/09 20:20:05 UTC, 0 replies.
- Please Ubsubscribe - posted by sr...@tcs.com on 2006/05/10 08:44:14 UTC, 1 replies.
- [jira] Created: (COCOON-1848) [PATCH] using setRequired in Ajax mode does not generate bu:replace - posted by "vincent Demay (JIRA)" <ji...@apache.org> on 2006/05/10 16:31:04 UTC, 0 replies.
- Cocoon CRUD (was GSoC Proposals) - posted by Simone Gianni <s....@thebug.it> on 2006/05/10 17:41:35 UTC, 10 replies.
- [continuum] BUILD ERROR: Apache Cocoon - posted by "continuum@cocoon.zones.apache.org" <co...@cocoon.zones.apache.org> on 2006/05/11 03:17:33 UTC, 0 replies.
- [continuum] BUILD ERROR: Cocoon Blocks [modules] - posted by "continuum@cocoon.zones.apache.org" <co...@cocoon.zones.apache.org> on 2006/05/11 03:20:40 UTC, 0 replies.
- [continuum] BUILD ERROR: Ajax Block - posted by "continuum@cocoon.zones.apache.org" <co...@cocoon.zones.apache.org> on 2006/05/11 03:20:48 UTC, 0 replies.
- [continuum] BUILD ERROR: Cocoon Core [modules] - posted by "continuum@cocoon.zones.apache.org" <co...@cocoon.zones.apache.org> on 2006/05/11 03:21:08 UTC, 0 replies.
- [continuum] BUILD ERROR: Cocoon Licenses - posted by "continuum@cocoon.zones.apache.org" <co...@cocoon.zones.apache.org> on 2006/05/11 03:21:09 UTC, 0 replies.
- [continuum] BUILD ERROR: Cocoon Core - posted by "continuum@cocoon.zones.apache.org" <co...@cocoon.zones.apache.org> on 2006/05/11 03:21:14 UTC, 0 replies.
- [continuum] BUILD ERROR: Ajax Block Implementation - posted by "continuum@cocoon.zones.apache.org" <co...@cocoon.zones.apache.org> on 2006/05/11 03:21:15 UTC, 0 replies.
- [continuum] BUILD ERROR: Ajax Block Sample - posted by "continuum@cocoon.zones.apache.org" <co...@cocoon.zones.apache.org> on 2006/05/11 03:21:16 UTC, 0 replies.
- [continuum] BUILD ERROR: Cocoon Apples Block - posted by "continuum@cocoon.zones.apache.org" <co...@cocoon.zones.apache.org> on 2006/05/11 03:21:18 UTC, 0 replies.
- [continuum] BUILD ERROR: Forms Block - posted by "continuum@cocoon.zones.apache.org" <co...@cocoon.zones.apache.org> on 2006/05/11 03:21:23 UTC, 0 replies.
- [continuum] BUILD ERROR: Forms Block Implementation - posted by "continuum@cocoon.zones.apache.org" <co...@cocoon.zones.apache.org> on 2006/05/11 03:21:47 UTC, 0 replies.
- [continuum] BUILD ERROR: Apples Block Implementation - posted by "continuum@cocoon.zones.apache.org" <co...@cocoon.zones.apache.org> on 2006/05/11 03:21:53 UTC, 0 replies.
- [continuum] BUILD ERROR: Authentication Framework - posted by "continuum@cocoon.zones.apache.org" <co...@cocoon.zones.apache.org> on 2006/05/11 03:22:03 UTC, 0 replies.
- [continuum] BUILD ERROR: Session Framework - posted by "continuum@cocoon.zones.apache.org" <co...@cocoon.zones.apache.org> on 2006/05/11 03:22:16 UTC, 0 replies.
- [continuum] BUILD ERROR: Session Framework Implementation - posted by "continuum@cocoon.zones.apache.org" <co...@cocoon.zones.apache.org> on 2006/05/11 03:22:24 UTC, 0 replies.
- [continuum] BUILD ERROR: Authentication Framework Implementation - posted by "continuum@cocoon.zones.apache.org" <co...@cocoon.zones.apache.org> on 2006/05/11 03:22:25 UTC, 0 replies.
- [continuum] BUILD ERROR: Authentication Framework Sample Application - posted by "continuum@cocoon.zones.apache.org" <co...@cocoon.zones.apache.org> on 2006/05/11 03:22:26 UTC, 0 replies.
- [continuum] BUILD ERROR: axis Block - posted by "continuum@cocoon.zones.apache.org" <co...@cocoon.zones.apache.org> on 2006/05/11 03:22:27 UTC, 0 replies.
- [continuum] BUILD ERROR: Axis Block Implementation - posted by "continuum@cocoon.zones.apache.org" <co...@cocoon.zones.apache.org> on 2006/05/11 03:22:28 UTC, 0 replies.
- [continuum] BUILD ERROR: Blocks Framework - posted by "continuum@cocoon.zones.apache.org" <co...@cocoon.zones.apache.org> on 2006/05/11 03:22:30 UTC, 0 replies.
- [continuum] BUILD ERROR: Blocks Framework Implementation - posted by "continuum@cocoon.zones.apache.org" <co...@cocoon.zones.apache.org> on 2006/05/11 03:22:31 UTC, 0 replies.
- [continuum] BUILD ERROR: Captcha Block - posted by "continuum@cocoon.zones.apache.org" <co...@cocoon.zones.apache.org> on 2006/05/11 03:22:32 UTC, 0 replies.
- [continuum] BUILD ERROR: Captcha Block Implementation - posted by "continuum@cocoon.zones.apache.org" <co...@cocoon.zones.apache.org> on 2006/05/11 03:22:33 UTC, 0 replies.
- [continuum] BUILD ERROR: Captcha Block Sample - posted by "continuum@cocoon.zones.apache.org" <co...@cocoon.zones.apache.org> on 2006/05/11 03:22:34 UTC, 0 replies.
- [continuum] BUILD ERROR: Cocoon Commons - posted by "continuum@cocoon.zones.apache.org" <co...@cocoon.zones.apache.org> on 2006/05/11 03:22:35 UTC, 0 replies.
- [continuum] BUILD ERROR: Cocoon Tools [modules] - posted by "continuum@cocoon.zones.apache.org" <co...@cocoon.zones.apache.org> on 2006/05/11 03:22:40 UTC, 0 replies.
- [continuum] BUILD ERROR: Cocoon Deployer [modules] - posted by "continuum@cocoon.zones.apache.org" <co...@cocoon.zones.apache.org> on 2006/05/11 03:22:43 UTC, 0 replies.
- [continuum] BUILD ERROR: Cocoon Deployer - Core - posted by "continuum@cocoon.zones.apache.org" <co...@cocoon.zones.apache.org> on 2006/05/11 03:22:44 UTC, 0 replies.
- [continuum] BUILD ERROR: Cocoon Deployer - Maven 2 Plugin - posted by "continuum@cocoon.zones.apache.org" <co...@cocoon.zones.apache.org> on 2006/05/11 03:22:45 UTC, 0 replies.
- [continuum] BUILD ERROR: Cocoon default (all blocks to run blocks-fw) - posted by "continuum@cocoon.zones.apache.org" <co...@cocoon.zones.apache.org> on 2006/05/11 03:22:46 UTC, 0 replies.
- [continuum] BUILD ERROR: Cocoon Deployer: Blocks tutorial sample - posted by "continuum@cocoon.zones.apache.org" <co...@cocoon.zones.apache.org> on 2006/05/11 03:22:47 UTC, 0 replies.
- [continuum] BUILD ERROR: Demo of the Cocoon block deployer - posted by "continuum@cocoon.zones.apache.org" <co...@cocoon.zones.apache.org> on 2006/05/11 03:22:48 UTC, 0 replies.
- [continuum] BUILD ERROR: FOP Block - posted by "continuum@cocoon.zones.apache.org" <co...@cocoon.zones.apache.org> on 2006/05/11 03:22:49 UTC, 0 replies.
- [continuum] BUILD ERROR: FOP Block Implementation - posted by "continuum@cocoon.zones.apache.org" <co...@cocoon.zones.apache.org> on 2006/05/11 03:22:50 UTC, 0 replies.
- [continuum] BUILD ERROR: FOP Block Samples - posted by "continuum@cocoon.zones.apache.org" <co...@cocoon.zones.apache.org> on 2006/05/11 03:22:51 UTC, 0 replies.
- [continuum] BUILD ERROR: Core Webapp - posted by "continuum@cocoon.zones.apache.org" <co...@cocoon.zones.apache.org> on 2006/05/11 03:22:53 UTC, 0 replies.
- [continuum] BUILD ERROR: Cron Block - posted by "continuum@cocoon.zones.apache.org" <co...@cocoon.zones.apache.org> on 2006/05/11 03:22:55 UTC, 0 replies.
- [continuum] BUILD ERROR: Cron block implementation - posted by "continuum@cocoon.zones.apache.org" <co...@cocoon.zones.apache.org> on 2006/05/11 03:22:56 UTC, 0 replies.
- [continuum] BUILD ERROR: deli Block - posted by "continuum@cocoon.zones.apache.org" <co...@cocoon.zones.apache.org> on 2006/05/11 03:22:57 UTC, 0 replies.
- [continuum] BUILD ERROR: deli Block Implementation - posted by "continuum@cocoon.zones.apache.org" <co...@cocoon.zones.apache.org> on 2006/05/11 03:22:58 UTC, 0 replies.
- [continuum] BUILD ERROR: Deli Block Samples - posted by "continuum@cocoon.zones.apache.org" <co...@cocoon.zones.apache.org> on 2006/05/11 03:22:59 UTC, 0 replies.
- [continuum] BUILD ERROR: Forms Block Samples - posted by "continuum@cocoon.zones.apache.org" <co...@cocoon.zones.apache.org> on 2006/05/11 03:23:01 UTC, 0 replies.
- [continuum] BUILD ERROR: javaflow Block - posted by "continuum@cocoon.zones.apache.org" <co...@cocoon.zones.apache.org> on 2006/05/11 03:23:02 UTC, 0 replies.
- [continuum] BUILD ERROR: Javaflow Block - posted by "continuum@cocoon.zones.apache.org" <co...@cocoon.zones.apache.org> on 2006/05/11 03:23:03 UTC, 0 replies.
- [continuum] BUILD ERROR: Jms Block - posted by "continuum@cocoon.zones.apache.org" <co...@cocoon.zones.apache.org> on 2006/05/11 03:23:04 UTC, 0 replies.
- [continuum] BUILD ERROR: Jms Block Implementation - posted by "continuum@cocoon.zones.apache.org" <co...@cocoon.zones.apache.org> on 2006/05/11 03:23:05 UTC, 0 replies.
- [continuum] BUILD ERROR: Jms Block Samples - posted by "continuum@cocoon.zones.apache.org" <co...@cocoon.zones.apache.org> on 2006/05/11 03:23:06 UTC, 0 replies.
- [continuum] BUILD ERROR: Maven Eclipse Plugin - posted by "continuum@cocoon.zones.apache.org" <co...@cocoon.zones.apache.org> on 2006/05/11 03:23:08 UTC, 0 replies.
- [continuum] BUILD ERROR: Minimal Cocoon web application - posted by "continuum@cocoon.zones.apache.org" <co...@cocoon.zones.apache.org> on 2006/05/11 03:23:09 UTC, 0 replies.
- [continuum] BUILD ERROR: OSGi Demo Block 1 - posted by "continuum@cocoon.zones.apache.org" <co...@cocoon.zones.apache.org> on 2006/05/11 03:23:10 UTC, 0 replies.
- [continuum] BUILD ERROR: OSGi Demo Block 2 - posted by "continuum@cocoon.zones.apache.org" <co...@cocoon.zones.apache.org> on 2006/05/11 03:23:11 UTC, 0 replies.
- [continuum] BUILD ERROR: Portal Block - posted by "continuum@cocoon.zones.apache.org" <co...@cocoon.zones.apache.org> on 2006/05/11 03:23:15 UTC, 0 replies.
- [continuum] BUILD ERROR: Portal Block Implementation - posted by "continuum@cocoon.zones.apache.org" <co...@cocoon.zones.apache.org> on 2006/05/11 03:23:18 UTC, 0 replies.
- [continuum] BUILD ERROR: ojb Block - posted by "continuum@cocoon.zones.apache.org" <co...@cocoon.zones.apache.org> on 2006/05/11 03:23:20 UTC, 0 replies.
- [continuum] BUILD ERROR: ojb Block Mocks - posted by "continuum@cocoon.zones.apache.org" <co...@cocoon.zones.apache.org> on 2006/05/11 03:23:21 UTC, 0 replies.
- [continuum] BUILD ERROR: ojb Block Implementation - posted by "continuum@cocoon.zones.apache.org" <co...@cocoon.zones.apache.org> on 2006/05/11 03:23:22 UTC, 0 replies.
- [continuum] BUILD ERROR: Portal Block Sample - posted by "continuum@cocoon.zones.apache.org" <co...@cocoon.zones.apache.org> on 2006/05/11 03:23:26 UTC, 0 replies.
- [continuum] BUILD ERROR: profiler Block - posted by "continuum@cocoon.zones.apache.org" <co...@cocoon.zones.apache.org> on 2006/05/11 03:23:27 UTC, 0 replies.
- [continuum] BUILD ERROR: Profiler Block - posted by "continuum@cocoon.zones.apache.org" <co...@cocoon.zones.apache.org> on 2006/05/11 03:23:28 UTC, 0 replies.
- [continuum] BUILD ERROR: Scratchpad Block - posted by "continuum@cocoon.zones.apache.org" <co...@cocoon.zones.apache.org> on 2006/05/11 03:23:30 UTC, 0 replies.
- [continuum] BUILD ERROR: repository Block - posted by "continuum@cocoon.zones.apache.org" <co...@cocoon.zones.apache.org> on 2006/05/11 03:23:31 UTC, 0 replies.
- [continuum] BUILD ERROR: eventcache Block - posted by "continuum@cocoon.zones.apache.org" <co...@cocoon.zones.apache.org> on 2006/05/11 03:23:32 UTC, 0 replies.
- [continuum] BUILD ERROR: Template framework - posted by "continuum@cocoon.zones.apache.org" <co...@cocoon.zones.apache.org> on 2006/05/11 03:23:34 UTC, 0 replies.
- [continuum] BUILD ERROR: Template framework implementation - posted by "continuum@cocoon.zones.apache.org" <co...@cocoon.zones.apache.org> on 2006/05/11 03:23:36 UTC, 0 replies.
- [continuum] BUILD ERROR: eventcache Block Implementation - posted by "continuum@cocoon.zones.apache.org" <co...@cocoon.zones.apache.org> on 2006/05/11 03:23:37 UTC, 0 replies.
- [continuum] BUILD ERROR: repository Block Implementation - posted by "continuum@cocoon.zones.apache.org" <co...@cocoon.zones.apache.org> on 2006/05/11 03:23:38 UTC, 0 replies.
- [continuum] BUILD ERROR: Scratchpad Block Implementation - posted by "continuum@cocoon.zones.apache.org" <co...@cocoon.zones.apache.org> on 2006/05/11 03:23:40 UTC, 0 replies.
- [continuum] BUILD ERROR: Session Framework Sample Application - posted by "continuum@cocoon.zones.apache.org" <co...@cocoon.zones.apache.org> on 2006/05/11 03:23:41 UTC, 0 replies.
- [continuum] BUILD ERROR: apples Block Samples - posted by "continuum@cocoon.zones.apache.org" <co...@cocoon.zones.apache.org> on 2006/05/11 03:23:42 UTC, 0 replies.
- [continuum] BUILD ERROR: asciiart Block - posted by "continuum@cocoon.zones.apache.org" <co...@cocoon.zones.apache.org> on 2006/05/11 03:23:44 UTC, 0 replies.
- [continuum] BUILD ERROR: asciiart Block Implementation - posted by "continuum@cocoon.zones.apache.org" <co...@cocoon.zones.apache.org> on 2006/05/11 03:23:45 UTC, 0 replies.
- [continuum] BUILD ERROR: asciiart Block Samples - posted by "continuum@cocoon.zones.apache.org" <co...@cocoon.zones.apache.org> on 2006/05/11 03:23:46 UTC, 0 replies.
- [continuum] BUILD ERROR: axis Block Samples - posted by "continuum@cocoon.zones.apache.org" <co...@cocoon.zones.apache.org> on 2006/05/11 03:23:47 UTC, 0 replies.
- [continuum] BUILD ERROR: batik Block - posted by "continuum@cocoon.zones.apache.org" <co...@cocoon.zones.apache.org> on 2006/05/11 03:23:48 UTC, 0 replies.
- [continuum] BUILD ERROR: batik Block Implementation - posted by "continuum@cocoon.zones.apache.org" <co...@cocoon.zones.apache.org> on 2006/05/11 03:23:49 UTC, 0 replies.
- [continuum] BUILD ERROR: batik Block Samples - posted by "continuum@cocoon.zones.apache.org" <co...@cocoon.zones.apache.org> on 2006/05/11 03:23:50 UTC, 0 replies.
- [continuum] BUILD ERROR: bsf Block - posted by "continuum@cocoon.zones.apache.org" <co...@cocoon.zones.apache.org> on 2006/05/11 03:23:51 UTC, 0 replies.
- [continuum] BUILD ERROR: bsf Block Implementation - posted by "continuum@cocoon.zones.apache.org" <co...@cocoon.zones.apache.org> on 2006/05/11 03:23:52 UTC, 0 replies.
- [continuum] BUILD ERROR: bsf Block Samples - posted by "continuum@cocoon.zones.apache.org" <co...@cocoon.zones.apache.org> on 2006/05/11 03:23:53 UTC, 0 replies.
- [continuum] BUILD ERROR: chaperon Block - posted by "continuum@cocoon.zones.apache.org" <co...@cocoon.zones.apache.org> on 2006/05/11 03:23:56 UTC, 0 replies.
- [continuum] BUILD ERROR: chaperon Block Implementation - posted by "continuum@cocoon.zones.apache.org" <co...@cocoon.zones.apache.org> on 2006/05/11 03:23:58 UTC, 0 replies.
- [continuum] BUILD ERROR: chaperon Block Samples - posted by "continuum@cocoon.zones.apache.org" <co...@cocoon.zones.apache.org> on 2006/05/11 03:23:59 UTC, 0 replies.
- [continuum] BUILD ERROR: cron Block Samples - posted by "continuum@cocoon.zones.apache.org" <co...@cocoon.zones.apache.org> on 2006/05/11 03:24:00 UTC, 0 replies.
- [continuum] BUILD ERROR: eventcache Block Samples - posted by "continuum@cocoon.zones.apache.org" <co...@cocoon.zones.apache.org> on 2006/05/11 03:24:01 UTC, 0 replies.
- [continuum] BUILD ERROR: faces Block - posted by "continuum@cocoon.zones.apache.org" <co...@cocoon.zones.apache.org> on 2006/05/11 03:24:03 UTC, 0 replies.
- [continuum] BUILD ERROR: taglib Block - posted by "continuum@cocoon.zones.apache.org" <co...@cocoon.zones.apache.org> on 2006/05/11 03:24:06 UTC, 0 replies.
- [continuum] BUILD ERROR: taglib Block Implementation - posted by "continuum@cocoon.zones.apache.org" <co...@cocoon.zones.apache.org> on 2006/05/11 03:24:08 UTC, 0 replies.
- [continuum] BUILD ERROR: faces Block Implementation - posted by "continuum@cocoon.zones.apache.org" <co...@cocoon.zones.apache.org> on 2006/05/11 03:24:09 UTC, 0 replies.
- [continuum] BUILD ERROR: faces Block Samples - posted by "continuum@cocoon.zones.apache.org" <co...@cocoon.zones.apache.org> on 2006/05/11 03:24:10 UTC, 0 replies.
- [continuum] BUILD ERROR: hsqldb Block - posted by "continuum@cocoon.zones.apache.org" <co...@cocoon.zones.apache.org> on 2006/05/11 03:24:11 UTC, 0 replies.
- [continuum] BUILD ERROR: hsqldb Block Implementation - posted by "continuum@cocoon.zones.apache.org" <co...@cocoon.zones.apache.org> on 2006/05/11 03:24:12 UTC, 0 replies.
- [continuum] BUILD ERROR: html Block - posted by "continuum@cocoon.zones.apache.org" <co...@cocoon.zones.apache.org> on 2006/05/11 03:24:13 UTC, 0 replies.
- [continuum] BUILD ERROR: html Block Implementation - posted by "continuum@cocoon.zones.apache.org" <co...@cocoon.zones.apache.org> on 2006/05/11 03:24:14 UTC, 0 replies.
- [continuum] BUILD ERROR: html Block Samples - posted by "continuum@cocoon.zones.apache.org" <co...@cocoon.zones.apache.org> on 2006/05/11 03:24:15 UTC, 0 replies.
- [continuum] BUILD ERROR: itext Block - posted by "continuum@cocoon.zones.apache.org" <co...@cocoon.zones.apache.org> on 2006/05/11 03:24:16 UTC, 0 replies.
- [continuum] BUILD ERROR: itext Block Implementation - posted by "continuum@cocoon.zones.apache.org" <co...@cocoon.zones.apache.org> on 2006/05/11 03:24:17 UTC, 0 replies.
- [continuum] BUILD ERROR: itext Block Samples - posted by "continuum@cocoon.zones.apache.org" <co...@cocoon.zones.apache.org> on 2006/05/11 03:24:18 UTC, 0 replies.
- [continuum] BUILD ERROR: javaflow Block Samples - posted by "continuum@cocoon.zones.apache.org" <co...@cocoon.zones.apache.org> on 2006/05/11 03:24:19 UTC, 0 replies.
- [continuum] BUILD ERROR: jfor Block - posted by "continuum@cocoon.zones.apache.org" <co...@cocoon.zones.apache.org> on 2006/05/11 03:24:20 UTC, 0 replies.
- [continuum] BUILD ERROR: jfor Block Implementation - posted by "continuum@cocoon.zones.apache.org" <co...@cocoon.zones.apache.org> on 2006/05/11 03:24:21 UTC, 0 replies.
- [continuum] BUILD ERROR: jfor Block Samples - posted by "continuum@cocoon.zones.apache.org" <co...@cocoon.zones.apache.org> on 2006/05/11 03:24:22 UTC, 0 replies.
- [continuum] BUILD ERROR: jsp Block - posted by "continuum@cocoon.zones.apache.org" <co...@cocoon.zones.apache.org> on 2006/05/11 03:24:25 UTC, 0 replies.
- [continuum] BUILD ERROR: jsp Block Mocks - posted by "continuum@cocoon.zones.apache.org" <co...@cocoon.zones.apache.org> on 2006/05/11 03:24:26 UTC, 0 replies.
- [continuum] BUILD ERROR: jsp Block Implementation - posted by "continuum@cocoon.zones.apache.org" <co...@cocoon.zones.apache.org> on 2006/05/11 03:24:30 UTC, 0 replies.
- [continuum] BUILD ERROR: jsp Block Samples - posted by "continuum@cocoon.zones.apache.org" <co...@cocoon.zones.apache.org> on 2006/05/11 03:24:31 UTC, 0 replies.
- [continuum] BUILD ERROR: linkrewriter Block - posted by "continuum@cocoon.zones.apache.org" <co...@cocoon.zones.apache.org> on 2006/05/11 03:24:33 UTC, 0 replies.
- [continuum] BUILD ERROR: linkrewriter Block Implementation - posted by "continuum@cocoon.zones.apache.org" <co...@cocoon.zones.apache.org> on 2006/05/11 03:24:37 UTC, 0 replies.
- [continuum] BUILD ERROR: linkrewriter Block Samples - posted by "continuum@cocoon.zones.apache.org" <co...@cocoon.zones.apache.org> on 2006/05/11 03:24:38 UTC, 0 replies.
- [continuum] BUILD ERROR: lucene Block - posted by "continuum@cocoon.zones.apache.org" <co...@cocoon.zones.apache.org> on 2006/05/11 03:24:40 UTC, 0 replies.
- [continuum] BUILD ERROR: lucene Block Implementation - posted by "continuum@cocoon.zones.apache.org" <co...@cocoon.zones.apache.org> on 2006/05/11 03:24:42 UTC, 0 replies.
- [continuum] BUILD ERROR: lucene Block Samples - posted by "continuum@cocoon.zones.apache.org" <co...@cocoon.zones.apache.org> on 2006/05/11 03:24:43 UTC, 0 replies.
- [continuum] BUILD ERROR: mail Block - posted by "continuum@cocoon.zones.apache.org" <co...@cocoon.zones.apache.org> on 2006/05/11 03:24:45 UTC, 0 replies.
- [continuum] BUILD ERROR: mail Block Implementation - posted by "continuum@cocoon.zones.apache.org" <co...@cocoon.zones.apache.org> on 2006/05/11 03:24:47 UTC, 0 replies.
- [continuum] BUILD ERROR: mail Block Samples - posted by "continuum@cocoon.zones.apache.org" <co...@cocoon.zones.apache.org> on 2006/05/11 03:24:48 UTC, 0 replies.
- [continuum] BUILD ERROR: midi Block - posted by "continuum@cocoon.zones.apache.org" <co...@cocoon.zones.apache.org> on 2006/05/11 03:24:50 UTC, 0 replies.
- [continuum] BUILD ERROR: midi Block Implementation - posted by "continuum@cocoon.zones.apache.org" <co...@cocoon.zones.apache.org> on 2006/05/11 03:24:52 UTC, 0 replies.
- [continuum] BUILD ERROR: midi Block Samples - posted by "continuum@cocoon.zones.apache.org" <co...@cocoon.zones.apache.org> on 2006/05/11 03:24:53 UTC, 0 replies.
- [continuum] BUILD ERROR: naming Block - posted by "continuum@cocoon.zones.apache.org" <co...@cocoon.zones.apache.org> on 2006/05/11 03:24:56 UTC, 0 replies.
- [continuum] BUILD ERROR: naming Block Implementation - posted by "continuum@cocoon.zones.apache.org" <co...@cocoon.zones.apache.org> on 2006/05/11 03:24:58 UTC, 0 replies.
- [continuum] BUILD ERROR: naming Block Samples - posted by "continuum@cocoon.zones.apache.org" <co...@cocoon.zones.apache.org> on 2006/05/11 03:24:59 UTC, 0 replies.
- [continuum] BUILD ERROR: ojb Block Samples - posted by "continuum@cocoon.zones.apache.org" <co...@cocoon.zones.apache.org> on 2006/05/11 03:25:00 UTC, 0 replies.
- [continuum] BUILD ERROR: paranoid Block - posted by "continuum@cocoon.zones.apache.org" <co...@cocoon.zones.apache.org> on 2006/05/11 03:25:02 UTC, 1 replies.
- [continuum] BUILD ERROR: paranoid Block Implementation - posted by "continuum@cocoon.zones.apache.org" <co...@cocoon.zones.apache.org> on 2006/05/11 03:25:03 UTC, 1 replies.
- [continuum] BUILD ERROR: petstore Block - posted by "continuum@cocoon.zones.apache.org" <co...@cocoon.zones.apache.org> on 2006/05/11 03:25:08 UTC, 0 replies.
- [continuum] BUILD ERROR: petstore Block Implementation - posted by "continuum@cocoon.zones.apache.org" <co...@cocoon.zones.apache.org> on 2006/05/11 03:25:13 UTC, 0 replies.
- [continuum] BUILD ERROR: petstore Block Samples - posted by "continuum@cocoon.zones.apache.org" <co...@cocoon.zones.apache.org> on 2006/05/11 03:25:17 UTC, 0 replies.
- [continuum] BUILD ERROR: poi Block - posted by "continuum@cocoon.zones.apache.org" <co...@cocoon.zones.apache.org> on 2006/05/11 03:25:25 UTC, 0 replies.
- [continuum] BUILD ERROR: poi Block Implementation - posted by "continuum@cocoon.zones.apache.org" <co...@cocoon.zones.apache.org> on 2006/05/11 03:25:30 UTC, 0 replies.
- [continuum] BUILD ERROR: poi Block Samples - posted by "continuum@cocoon.zones.apache.org" <co...@cocoon.zones.apache.org> on 2006/05/11 03:25:32 UTC, 0 replies.
- [continuum] BUILD ERROR: profiler Block Samples - posted by "continuum@cocoon.zones.apache.org" <co...@cocoon.zones.apache.org> on 2006/05/11 03:25:34 UTC, 0 replies.
- [continuum] BUILD ERROR: proxy Block - posted by "continuum@cocoon.zones.apache.org" <co...@cocoon.zones.apache.org> on 2006/05/11 03:25:40 UTC, 0 replies.
- [continuum] BUILD ERROR: proxy Block Implementation - posted by "continuum@cocoon.zones.apache.org" <co...@cocoon.zones.apache.org> on 2006/05/11 03:25:42 UTC, 0 replies.
- [continuum] BUILD ERROR: proxy Block Samples - posted by "continuum@cocoon.zones.apache.org" <co...@cocoon.zones.apache.org> on 2006/05/11 03:25:46 UTC, 0 replies.
- [continuum] BUILD ERROR: python Block - posted by "continuum@cocoon.zones.apache.org" <co...@cocoon.zones.apache.org> on 2006/05/11 03:25:50 UTC, 0 replies.
- [continuum] BUILD ERROR: python Block Mocks - posted by "continuum@cocoon.zones.apache.org" <co...@cocoon.zones.apache.org> on 2006/05/11 03:25:51 UTC, 0 replies.
- [continuum] BUILD ERROR: xsp Block - posted by "continuum@cocoon.zones.apache.org" <co...@cocoon.zones.apache.org> on 2006/05/11 03:25:58 UTC, 0 replies.
- [continuum] BUILD ERROR: xsp Block Implementation - posted by "continuum@cocoon.zones.apache.org" <co...@cocoon.zones.apache.org> on 2006/05/11 03:26:01 UTC, 0 replies.
- [continuum] BUILD ERROR: python Block Implementation - posted by "continuum@cocoon.zones.apache.org" <co...@cocoon.zones.apache.org> on 2006/05/11 03:26:04 UTC, 0 replies.
- [continuum] BUILD ERROR: qdox Block - posted by "continuum@cocoon.zones.apache.org" <co...@cocoon.zones.apache.org> on 2006/05/11 03:26:06 UTC, 0 replies.
- [continuum] BUILD ERROR: qdox Block Implementation - posted by "continuum@cocoon.zones.apache.org" <co...@cocoon.zones.apache.org> on 2006/05/11 03:26:08 UTC, 0 replies.
- [continuum] BUILD ERROR: qdox Block Samples - posted by "continuum@cocoon.zones.apache.org" <co...@cocoon.zones.apache.org> on 2006/05/11 03:26:09 UTC, 0 replies.
- [continuum] BUILD ERROR: querybean Block - posted by "continuum@cocoon.zones.apache.org" <co...@cocoon.zones.apache.org> on 2006/05/11 03:26:11 UTC, 0 replies.
- [continuum] BUILD ERROR: querybean Block Implementation - posted by "continuum@cocoon.zones.apache.org" <co...@cocoon.zones.apache.org> on 2006/05/11 03:26:13 UTC, 0 replies.
- [continuum] BUILD ERROR: querybean Block Samples - posted by "continuum@cocoon.zones.apache.org" <co...@cocoon.zones.apache.org> on 2006/05/11 03:26:15 UTC, 0 replies.
- [continuum] BUILD ERROR: scratchpad Block Samples - posted by "continuum@cocoon.zones.apache.org" <co...@cocoon.zones.apache.org> on 2006/05/11 03:26:18 UTC, 0 replies.
- [continuum] BUILD ERROR: serializers Block - posted by "continuum@cocoon.zones.apache.org" <co...@cocoon.zones.apache.org> on 2006/05/11 03:26:20 UTC, 0 replies.
- [continuum] BUILD ERROR: serializers Block Implementation - posted by "continuum@cocoon.zones.apache.org" <co...@cocoon.zones.apache.org> on 2006/05/11 03:26:23 UTC, 0 replies.
- [continuum] BUILD ERROR: slide Block - posted by "continuum@cocoon.zones.apache.org" <co...@cocoon.zones.apache.org> on 2006/05/11 03:26:26 UTC, 0 replies.
- [continuum] BUILD ERROR: slide Block Implementation - posted by "continuum@cocoon.zones.apache.org" <co...@cocoon.zones.apache.org> on 2006/05/11 03:26:27 UTC, 0 replies.
- [continuum] BUILD ERROR: slide Block Samples - posted by "continuum@cocoon.zones.apache.org" <co...@cocoon.zones.apache.org> on 2006/05/11 03:26:28 UTC, 0 replies.
- [continuum] BUILD ERROR: slop Block - posted by "continuum@cocoon.zones.apache.org" <co...@cocoon.zones.apache.org> on 2006/05/11 03:26:30 UTC, 0 replies.
- [continuum] BUILD ERROR: slop Block Implementation - posted by "continuum@cocoon.zones.apache.org" <co...@cocoon.zones.apache.org> on 2006/05/11 03:26:31 UTC, 0 replies.
- [continuum] BUILD ERROR: slop Block Samples - posted by "continuum@cocoon.zones.apache.org" <co...@cocoon.zones.apache.org> on 2006/05/11 03:26:32 UTC, 0 replies.
- [continuum] BUILD ERROR: stx Block - posted by "continuum@cocoon.zones.apache.org" <co...@cocoon.zones.apache.org> on 2006/05/11 03:26:33 UTC, 0 replies.
- [continuum] BUILD ERROR: stx Block Implementation - posted by "continuum@cocoon.zones.apache.org" <co...@cocoon.zones.apache.org> on 2006/05/11 03:26:34 UTC, 0 replies.
- [continuum] BUILD ERROR: stx Block Samples - posted by "continuum@cocoon.zones.apache.org" <co...@cocoon.zones.apache.org> on 2006/05/11 03:26:35 UTC, 0 replies.
- [continuum] BUILD ERROR: taglib Block Samples - posted by "continuum@cocoon.zones.apache.org" <co...@cocoon.zones.apache.org> on 2006/05/11 03:26:36 UTC, 0 replies.
- [continuum] BUILD ERROR: tour Block - posted by "continuum@cocoon.zones.apache.org" <co...@cocoon.zones.apache.org> on 2006/05/11 03:26:39 UTC, 0 replies.
- [continuum] BUILD ERROR: tour Block Implementation - posted by "continuum@cocoon.zones.apache.org" <co...@cocoon.zones.apache.org> on 2006/05/11 03:26:40 UTC, 0 replies.
- [continuum] BUILD ERROR: tour Block Samples - posted by "continuum@cocoon.zones.apache.org" <co...@cocoon.zones.apache.org> on 2006/05/11 03:26:42 UTC, 0 replies.
- [continuum] BUILD ERROR: velocity Block - posted by "continuum@cocoon.zones.apache.org" <co...@cocoon.zones.apache.org> on 2006/05/11 03:26:44 UTC, 0 replies.
- [continuum] BUILD ERROR: velocity Block Implementation - posted by "continuum@cocoon.zones.apache.org" <co...@cocoon.zones.apache.org> on 2006/05/11 03:26:45 UTC, 0 replies.
- [continuum] BUILD ERROR: velocity Block Samples - posted by "continuum@cocoon.zones.apache.org" <co...@cocoon.zones.apache.org> on 2006/05/11 03:26:46 UTC, 0 replies.
- [continuum] BUILD ERROR: web3 Block - posted by "continuum@cocoon.zones.apache.org" <co...@cocoon.zones.apache.org> on 2006/05/11 03:26:47 UTC, 0 replies.
- [continuum] BUILD ERROR: web3 Block Mocks - posted by "continuum@cocoon.zones.apache.org" <co...@cocoon.zones.apache.org> on 2006/05/11 03:26:49 UTC, 0 replies.
- [continuum] BUILD ERROR: web3 Block Implementation - posted by "continuum@cocoon.zones.apache.org" <co...@cocoon.zones.apache.org> on 2006/05/11 03:26:50 UTC, 0 replies.
- [continuum] BUILD ERROR: web3 Block Samples - posted by "continuum@cocoon.zones.apache.org" <co...@cocoon.zones.apache.org> on 2006/05/11 03:26:51 UTC, 0 replies.
- [continuum] BUILD ERROR: webdav Block - posted by "continuum@cocoon.zones.apache.org" <co...@cocoon.zones.apache.org> on 2006/05/11 03:26:54 UTC, 0 replies.
- [continuum] BUILD ERROR: webdav Block Implementation - posted by "continuum@cocoon.zones.apache.org" <co...@cocoon.zones.apache.org> on 2006/05/11 03:26:56 UTC, 0 replies.
- [continuum] BUILD ERROR: webdav Block Samples - posted by "continuum@cocoon.zones.apache.org" <co...@cocoon.zones.apache.org> on 2006/05/11 03:26:58 UTC, 0 replies.
- [continuum] BUILD ERROR: xsp Block Samples - posted by "continuum@cocoon.zones.apache.org" <co...@cocoon.zones.apache.org> on 2006/05/11 03:27:00 UTC, 0 replies.
- *cough* it seems that continuum choked last night - posted by Jorg Heymans <jh...@domek.be> on 2006/05/11 07:52:43 UTC, 1 replies.
- SVN down? (was Re: Maven dependencies) - posted by Giacomo Pati <gi...@apache.org> on 2006/05/11 11:08:44 UTC, 1 replies.
- Re: ApacheCon Hackaton: focus on 2.2? - Documentation - posted by hepabolu <he...@gmail.com> on 2006/05/12 09:53:30 UTC, 12 replies.
- Relinquishing moderation role - posted by Upayavira <uv...@odoko.co.uk> on 2006/05/12 10:00:40 UTC, 3 replies.
- CallFunctionNode problems in trunk - posted by Reinhard Poetz <re...@apache.org> on 2006/05/12 13:39:21 UTC, 21 replies.
- [jira] Updated: (COCOON-1694) Error decommissioning component: org.apache.cocoon.components.store.impl.EHDefaultStore - posted by "Ross McDonald (JIRA)" <ji...@apache.org> on 2006/05/12 15:27:09 UTC, 0 replies.
- [jira] Updated: (COCOON-1697) Allow request parameters to be used in "for (var k in h)" kind of Javascript Loops - posted by "Ross McDonald (JIRA)" <ji...@apache.org> on 2006/05/12 15:30:09 UTC, 1 replies.
- Cocoon 3.0 documentation started - posted by Reinhard Poetz <re...@apache.org> on 2006/05/12 17:38:33 UTC, 0 replies.
- [jira] Aktualisiert: (COCOON-1694) Error decommissioning component: org.apache.cocoon.components.store.impl.EHDefaultStore - posted by "Jörg Heinicke (JIRA)" <ji...@apache.org> on 2006/05/12 19:01:09 UTC, 0 replies.
- Need a new Forms Sample (and other improvements to forms) - posted by Berin Loritsch <bl...@d-haven.org> on 2006/05/12 21:26:45 UTC, 0 replies.
- [CI] back to normal - posted by Jorg Heymans <jh...@domek.be> on 2006/05/13 14:52:00 UTC, 0 replies.
- [2.2] CocoonTargetFactory.java missing? - posted by Antonio Gallardo <ag...@agssa.net> on 2006/05/13 22:35:32 UTC, 3 replies.
- Re: Cocoon 3.0 documentation started - posted by Carsten Ziegeler <cz...@apache.org> on 2006/05/14 12:30:52 UTC, 3 replies.
- [jira] Assigned: (COCOON-1618) [PATCH] SoapGenerator/Serializer for Axis Block - posted by "Antonio Gallardo (JIRA)" <ji...@apache.org> on 2006/05/15 05:27:06 UTC, 0 replies.
- Spring and OSGi - posted by Sylvain Wallez <sy...@apache.org> on 2006/05/15 08:09:12 UTC, 0 replies.
- [RT] Cocoon 2.2 Maven based build - posted by Ralph Goers <Ra...@dslextreme.com> on 2006/05/15 10:23:04 UTC, 4 replies.
- Releasing 2.2beta1 - posted by Reinhard Poetz <re...@apache.org> on 2006/05/15 17:13:02 UTC, 11 replies.
- [jira] Assigned: (COCOON-1603) [PATCH] handling of alternatives in MailTransformer - posted by "Jean-Baptiste Quenot (JIRA)" <ji...@apache.org> on 2006/05/15 18:53:07 UTC, 0 replies.
- [jira] Assigned: (COCOON-1758) Form locale never used in JXMacros - posted by "Jean-Baptiste Quenot (JIRA)" <ji...@apache.org> on 2006/05/15 18:53:09 UTC, 0 replies.
- [jira] Updated: (COCOON-1693) When using src parameter on sendMail action, body is included as attachment, and when using body parameter, mimeType is always text/html - posted by "Jean-Baptiste Quenot (JIRA)" <ji...@apache.org> on 2006/05/15 18:55:08 UTC, 0 replies.
- [jira] Assigned: (COCOON-1693) When using src parameter on sendMail action, body is included as attachment, and when using body parameter, mimeType is always text/html - posted by "Jean-Baptiste Quenot (JIRA)" <ji...@apache.org> on 2006/05/15 18:55:11 UTC, 0 replies.
- [2.2] Problems with maven deployer - posted by Carsten Ziegeler <cz...@apache.org> on 2006/05/15 19:56:04 UTC, 3 replies.
- [2.2] Dojo resources are missing - posted by Carsten Ziegeler <cz...@apache.org> on 2006/05/15 21:32:12 UTC, 7 replies.
- Re: svn commit: r406833 - in /cocoon/branches/BRANCH_2_1_X: ./ src/blocks/poi/java/org/apache/cocoon/components/elementprocessor/impl/poi/hssf/elements/ src/blocks/portal/conf/ src/blocks/portal/java/org/apache/cocoon/portal/event/aspect/impl/ src/blocks/p... - posted by Ralph Goers <Ra...@dslextreme.com> on 2006/05/16 07:20:13 UTC, 0 replies.
- [2.2] Configuration issues - posted by Carsten Ziegeler <cz...@apache.org> on 2006/05/16 08:23:57 UTC, 21 replies.
- What does a Cocoon 2.2 release consist of? - posted by Reinhard Poetz <re...@apache.org> on 2006/05/16 11:20:30 UTC, 8 replies.
- [jira] Created: (COCOON-1849) debug logging left in AggregateFieldDefinitionBuilder.java - posted by "Mark Lundquist (JIRA)" <ji...@apache.org> on 2006/05/16 20:28:06 UTC, 0 replies.
- [continuum] BUILD FAILURE: Apache Cocoon - posted by "continuum@cocoon.zones.apache.org" <co...@cocoon.zones.apache.org> on 2006/05/17 05:03:36 UTC, 0 replies.
- [continuum] BUILD FAILURE: Cocoon Blocks [modules] - posted by "continuum@cocoon.zones.apache.org" <co...@cocoon.zones.apache.org> on 2006/05/17 05:06:29 UTC, 0 replies.
- [continuum] BUILD FAILURE: Cocoon Core [modules] - posted by "continuum@cocoon.zones.apache.org" <co...@cocoon.zones.apache.org> on 2006/05/17 05:07:08 UTC, 0 replies.
- [continuum] BUILD FAILURE: Forms Block - posted by "continuum@cocoon.zones.apache.org" <co...@cocoon.zones.apache.org> on 2006/05/17 05:10:29 UTC, 0 replies.
- [continuum] BUILD FAILURE: Forms Block Samples - posted by "continuum@cocoon.zones.apache.org" <co...@cocoon.zones.apache.org> on 2006/05/17 05:12:31 UTC, 0 replies.
- [continuum] BUILD FAILURE: Core Webapp - posted by "continuum@cocoon.zones.apache.org" <co...@cocoon.zones.apache.org> on 2006/05/17 05:13:21 UTC, 7 replies.
- [jira] Created: (COCOON-1850) [Link] Dutch Ministry of Finance - www.minfin.nl - posted by "Arjé Cahn (JIRA)" <ji...@apache.org> on 2006/05/17 08:52:08 UTC, 0 replies.
- [forms] Repeater.moveRow() method - posted by Bruno Dumon <br...@outerthought.org> on 2006/05/17 11:32:25 UTC, 0 replies.
- [jira] Commented: (COCOON-1838) Always use 3-digit version number - posted by "Reinhard Poetz (JIRA)" <ji...@apache.org> on 2006/05/17 11:52:06 UTC, 1 replies.
- RAD with Cocoon 2.2 - posted by Reinhard Poetz <re...@apache.org> on 2006/05/17 12:18:24 UTC, 15 replies.
- [HEADS UP] Xalan XSLTC - posted by Torsten Curdt <tc...@apache.org> on 2006/05/17 13:10:07 UTC, 2 replies.
- Re: svn commit: r407153 - in /cocoon/trunk/blocks: cocoon-portal/cocoon-portal-impl/pom.xml cocoon-scratchpad/cocoon-scratchpad-impl/pom.xml - posted by Antonio Gallardo <ag...@agssa.net> on 2006/05/17 15:22:13 UTC, 1 replies.
- [continuum] BUILD SUCCESSFUL: Apache Cocoon - posted by "continuum@cocoon.zones.apache.org" <co...@cocoon.zones.apache.org> on 2006/05/17 19:54:37 UTC, 0 replies.
- [continuum] BUILD SUCCESSFUL: Cocoon Blocks [modules] - posted by "continuum@cocoon.zones.apache.org" <co...@cocoon.zones.apache.org> on 2006/05/17 20:00:24 UTC, 0 replies.
- [continuum] BUILD SUCCESSFUL: Cocoon Core [modules] - posted by "continuum@cocoon.zones.apache.org" <co...@cocoon.zones.apache.org> on 2006/05/17 20:03:25 UTC, 0 replies.
- [continuum] BUILD SUCCESSFUL: Core Webapp - posted by "continuum@cocoon.zones.apache.org" <co...@cocoon.zones.apache.org> on 2006/05/17 20:05:43 UTC, 2 replies.
- [continuum] BUILD SUCCESSFUL: Forms Block - posted by "continuum@cocoon.zones.apache.org" <co...@cocoon.zones.apache.org> on 2006/05/17 20:06:21 UTC, 0 replies.
- [continuum] BUILD SUCCESSFUL: Forms Block Samples - posted by "continuum@cocoon.zones.apache.org" <co...@cocoon.zones.apache.org> on 2006/05/17 20:07:36 UTC, 0 replies.
- [jira] Closed: (COCOON-1804) Javascript FOM_SCOPE issue when using Java as the flow engine - ReferenceError: "cocoon" is not defined - posted by "Simone Gianni (JIRA)" <ji...@apache.org> on 2006/05/17 23:03:07 UTC, 0 replies.
- {re:}[CForms] throws NPE in BRANCH - posted by Kaj Kandler <Ka...@Conficio.com> on 2006/05/17 23:50:24 UTC, 0 replies.
- [jira] Created: (COCOON-1851) [CForms] throws NPE in BRANCH - posted by "Kaj Kandler (JIRA)" <ji...@apache.org> on 2006/05/18 02:35:05 UTC, 0 replies.
- [jira] Commented: (COCOON-1851) [CForms] throws NPE in BRANCH - posted by "Kaj Kandler (JIRA)" <ji...@apache.org> on 2006/05/18 02:37:07 UTC, 1 replies.
- [jira] Updated: (COCOON-1851) [CForms] throws NPE in BRANCH - posted by "Kaj Kandler (JIRA)" <ji...@apache.org> on 2006/05/18 02:37:09 UTC, 1 replies.
- Adding a ProcessingPhaseListener to a form? - posted by Carsten Ziegeler <cz...@apache.org> on 2006/05/18 08:35:22 UTC, 6 replies.
- [jira] Assigned: (COCOON-1850) [Link] Dutch Ministry of Finance - www.minfin.nl - posted by "Helma van der Linden (JIRA)" <ji...@apache.org> on 2006/05/18 09:41:06 UTC, 0 replies.
- [jira] Commented: (COCOON-1850) [Link] Dutch Ministry of Finance - www.minfin.nl - posted by "Helma van der Linden (JIRA)" <ji...@apache.org> on 2006/05/18 09:43:06 UTC, 0 replies.
- Re[2]: RAD with Cocoon 2.2 - posted by Jens Maukisch <co...@maukisch.net> on 2006/05/18 11:13:50 UTC, 1 replies.
- ParnoidCocoonServlet (was Re: svn commit: r407533 - in /cocoon/trunk/core/cocoon-webapp: pom.xml src/main/webapp/WEB-INF/web.xml) - posted by Reinhard Poetz <re...@apache.org> on 2006/05/18 13:35:00 UTC, 2 replies.
- CocoonTask - posted by Reinhard Poetz <re...@apache.org> on 2006/05/18 14:01:07 UTC, 7 replies.
- Flowscript in Spring - posted by Sylvain Wallez <sy...@apache.org> on 2006/05/18 14:04:11 UTC, 2 replies.
- [QVOTE] Deprecate CocoonTask in 2.1 and remove it in 2.2 - posted by Reinhard Poetz <re...@apache.org> on 2006/05/18 15:21:33 UTC, 4 replies.
- How long for a full trunk build (was: ParnoidCocoonServlet) - posted by Bertrand Delacretaz <bd...@apache.org> on 2006/05/18 15:38:13 UTC, 5 replies.
- Re: How long for a full trunk build - posted by Reinhard Poetz <re...@apache.org> on 2006/05/18 15:43:22 UTC, 7 replies.
- Re: ParanoidCocoonServlet - posted by Reinhard Poetz <re...@apache.org> on 2006/05/18 18:28:07 UTC, 0 replies.
- Maven 2 transient dependency tree - posted by Giacomo Pati <gi...@apache.org> on 2006/05/19 08:06:16 UTC, 2 replies.
- [2.2] Classloading - posted by Carsten Ziegeler <cz...@apache.org> on 2006/05/19 09:18:26 UTC, 13 replies.
- [2.2] Error building trunk - posted by Carsten Ziegeler <cz...@apache.org> on 2006/05/19 10:12:32 UTC, 11 replies.
- Re: svn commit: r407804 - /cocoon/trunk/core/cocoon-webapp/src/main/webapp/WEB-INF/web.xml - posted by Reinhard Poetz <re...@apache.org> on 2006/05/19 16:29:35 UTC, 1 replies.
- Re: Double occurence of class DefaultConfiguration in builded trunk. - posted by Jason Johnston <co...@lojjic.net> on 2006/05/20 17:06:10 UTC, 1 replies.
- [continuum] BUILD FAILURE: Cocoon Bootstrap Implementation - posted by "continuum@cocoon.zones.apache.org" <co...@cocoon.zones.apache.org> on 2006/05/21 05:16:36 UTC, 2 replies.
- [continuum] BUILD SUCCESSFUL: Cocoon Bootstrap Implementation - posted by "continuum@cocoon.zones.apache.org" <co...@cocoon.zones.apache.org> on 2006/05/21 11:49:25 UTC, 0 replies.
- [continuum] BUILD SUCCESSFUL: Cocoon Core - posted by "continuum@cocoon.zones.apache.org" <co...@cocoon.zones.apache.org> on 2006/05/21 11:51:23 UTC, 0 replies.
- FYI: ApacheCon EU 2006, who stays where? - posted by Bertrand Delacretaz <bd...@codeconsult.ch> on 2006/05/22 09:40:21 UTC, 0 replies.
- [2.2] Configuration - posted by Reinhard Poetz <re...@yahoo.de> on 2006/05/22 15:10:42 UTC, 14 replies.
- Re: [Cocoon Wiki] Update of "FrontPage" by JohathannRelly - posted by Simone Gianni <s....@thebug.it> on 2006/05/22 15:21:14 UTC, 5 replies.
- http://cocoon.zones.apache.org/demos/21branch/ is down - posted by Antonio Gallardo <ag...@agssa.net> on 2006/05/22 17:37:32 UTC, 7 replies.
- [jira] Created: (COCOON-1852) Cocoon suffers from Apache Webdav Bug #32886 - posted by "Wolfgang Kowarschick (JIRA)" <ji...@apache.org> on 2006/05/22 19:19:31 UTC, 0 replies.
- [jira] Commented: (COCOON-1804) Javascript FOM_SCOPE issue when using Java as the flow engine - ReferenceError: "cocoon" is not defined - posted by "Andrew Madu (JIRA)" <ji...@apache.org> on 2006/05/23 14:58:30 UTC, 1 replies.
- Number formatting bug in i18n-transformer? - posted by Tuomo L <tl...@cc.hut.fi> on 2006/05/23 16:14:47 UTC, 0 replies.
- [2.2] Where is the status file for core? - posted by Carsten Ziegeler <cz...@apache.org> on 2006/05/23 16:17:10 UTC, 2 replies.
- [RT] Removing sitemap configurable - posted by Carsten Ziegeler <cz...@apache.org> on 2006/05/23 16:23:25 UTC, 4 replies.
- [SOLUTION] Re: Number formatting bug in i18n-transformer? - posted by Tuomo L <tl...@cc.hut.fi> on 2006/05/23 19:03:00 UTC, 0 replies.
- [jira] Created: (COCOON-1853) blocks-tobeconverted - posted by "Ben Pope (JIRA)" <ji...@apache.org> on 2006/05/23 21:44:29 UTC, 0 replies.
- Pattern for use of sub-pipelines to grab content at different stages? - posted by Craeg Strong <cs...@arielpartners.com> on 2006/05/24 07:34:34 UTC, 6 replies.
- cocoondev.org/daisy gives HTTP ERROR: 500 - posted by Robby Pelssers <rp...@agp.nl> on 2006/05/24 09:49:05 UTC, 1 replies.
- [jira] Closed: (COCOON-1853) blocks-tobeconverted - posted by "Carsten Ziegeler (JIRA)" <ji...@apache.org> on 2006/05/24 12:46:30 UTC, 0 replies.
- New XReporter expressions - posted by Simone Gianni <s....@thebug.it> on 2006/05/24 16:44:41 UTC, 4 replies.
- Automatic releases - posted by Reinhard Poetz <re...@apache.org> on 2006/05/24 18:46:29 UTC, 20 replies.
- intermittent test failures on cocoon-core - posted by Jorg Heymans <jh...@domek.be> on 2006/05/25 01:16:54 UTC, 0 replies.
- [continuum] BUILD SUCCESSFUL: Databases Block - posted by "continuum@cocoon.zones.apache.org" <co...@cocoon.zones.apache.org> on 2006/05/25 05:18:18 UTC, 0 replies.
- [continuum] BUILD SUCCESSFUL: Databases Block's Mocks - posted by "continuum@cocoon.zones.apache.org" <co...@cocoon.zones.apache.org> on 2006/05/25 05:18:23 UTC, 0 replies.
- [continuum] BUILD SUCCESSFUL: Databases Block's Implementation - posted by "continuum@cocoon.zones.apache.org" <co...@cocoon.zones.apache.org> on 2006/05/25 05:18:35 UTC, 0 replies.
- [continuum] BUILD SUCCESSFUL: Databases Block's Samples - posted by "continuum@cocoon.zones.apache.org" <co...@cocoon.zones.apache.org> on 2006/05/25 05:18:43 UTC, 0 replies.
- Spring sample - help needed - posted by Reinhard Poetz <re...@apache.org> on 2006/05/25 12:48:56 UTC, 1 replies.
- Re: svn commit: r409456 - in /cocoon/branches/BRANCH_2_1_X: lib/jars.xml lib/optional/xreporter-expression-20040701.jar lib/optional/xreporter-expression-20060525.jar status.xml - posted by Antonio Gallardo <ag...@agssa.net> on 2006/05/25 23:35:28 UTC, 2 replies.
- Calculated fields - posted by Simone Gianni <s....@thebug.it> on 2006/05/26 03:02:12 UTC, 2 replies.
- [continuum] BUILD FAILURE: Forms Block Implementation - posted by "continuum@cocoon.zones.apache.org" <co...@cocoon.zones.apache.org> on 2006/05/26 05:11:42 UTC, 10 replies.
- GetTogether - posted by Ralph Goers <Ra...@dslextreme.com> on 2006/05/26 18:30:06 UTC, 2 replies.
- [jira] Created: (COCOON-1854) Browser selector should have Opera before MSIE - posted by "Laurens Holst (JIRA)" <ji...@apache.org> on 2006/05/27 04:01:29 UTC, 0 replies.
- [jira] Created: (COCOON-1855) Can't load from fragment URLs - posted by "Laurens Holst (JIRA)" <ji...@apache.org> on 2006/05/27 04:14:29 UTC, 0 replies.
- [continuum] BUILD SUCCESSFUL: Forms Block Implementation - posted by "continuum@cocoon.zones.apache.org" <co...@cocoon.zones.apache.org> on 2006/05/27 05:19:56 UTC, 0 replies.
- Blocks and packages - posted by Daniel Fagerstrom <da...@nada.kth.se> on 2006/05/27 14:01:26 UTC, 7 replies.
- [jira] Commented: (COCOON-1489) [PATCH] XInclude transformer does not handle fallback correctly - posted by "Antonio Gallardo (JIRA)" <ji...@apache.org> on 2006/05/28 05:00:30 UTC, 1 replies.
- Call for Papers Opens for ApacheCon US 2006 - posted by David Crossley <cr...@apache.org> on 2006/05/28 06:28:01 UTC, 0 replies.
- [jira] Updated: (COCOON-1854) Browser selector should have Opera before MSIE - posted by "Andrew Stevens (JIRA)" <ji...@apache.org> on 2006/05/29 00:54:30 UTC, 0 replies.
- [2.2] Avalon does not hidden spring exceptions. - posted by Antonio Gallardo <ag...@agssa.net> on 2006/05/29 07:57:19 UTC, 8 replies.
- [jira] Closed: (COCOON-1753) XInclude transformer uses href fragment rather than xpointer attribute (spec conformance) - posted by "Antonio Gallardo (JIRA)" <ji...@apache.org> on 2006/05/29 08:01:30 UTC, 0 replies.
- [jira] Assigned: (COCOON-1110) xi:fallback fail when use parse="text" - posted by "Antonio Gallardo (JIRA)" <ji...@apache.org> on 2006/05/29 08:38:30 UTC, 0 replies.
- [jira] Closed: (COCOON-1110) xi:fallback fail when use parse="text" - posted by "Antonio Gallardo (JIRA)" <ji...@apache.org> on 2006/05/29 09:01:34 UTC, 0 replies.
- [jira] Assigned: (COCOON-1515) [PATCH] Add remoteUser() information to RequestGenerator - posted by "Antonio Gallardo (JIRA)" <ji...@apache.org> on 2006/05/29 09:30:32 UTC, 0 replies.
- [jira] Closed: (COCOON-1515) [PATCH] Add remoteUser() information to RequestGenerator - posted by "Antonio Gallardo (JIRA)" <ji...@apache.org> on 2006/05/29 10:06:31 UTC, 0 replies.
- [jira] Commented: (COCOON-1815) CopySourceAction generate NPE - posted by "Antonio Gallardo (JIRA)" <ji...@apache.org> on 2006/05/29 10:53:30 UTC, 0 replies.
- [jira] Assigned: (COCOON-1839) exception2html.xslt