You are viewing a plain text version of this content. The canonical link for it is here.
Posted to builds@cassandra.apache.org by Apache Jenkins Server <je...@builds.apache.org> on 2021/09/29 06:50:28 UTC
Build complete: Cassandra-3.11 #257 [UNSTABLE]
dbe84e53df01000140601ab4ff10ed4a3c726f32
-------------------------------------------------------------------------------
Build Cassandra-3.11 #257 Still Unstable
URL: https://ci-cassandra.apache.org/job/Cassandra-3.11/257/
-------------------------------------------------------------------------------
Changes:
[a.penya.garcia] Add option for environment variables to CircleCI config generation
-------------------------------------------------------------------------------
Failed Tests:
32 tests failed.
FAILED: cqlshlib.python2.jdk8.no_cython.test.test_cqlsh_completion.TestCqlshCompletion.test_complete_in_update
FAILED: cqlshlib.python2.jdk8.no_cython.test.test_cqlsh_completion.TestCqlshCompletion.test_complete_on_empty_string
FAILED: dtest-novnode.topology_test.TestTopology.test_decommissioned_node_cant_rejoin
FAILED: dtest-offheap.secondary_indexes_test.TestSecondaryIndexes.test_low_cardinality_indexes
FAILED: dtest-upgrade.upgrade_tests.upgrade_through_versions_test.TestUpgrade_current_3_11_x_To_indev_3_11_x.test_bootstrap
FAILED: dtest-upgrade.upgrade_tests.upgrade_through_versions_test.TestUpgrade_current_2_1_x_To_indev_3_11_x.test_rolling_upgrade
FAILED: dtest-upgrade.upgrade_tests.upgrade_through_versions_test.TestUpgrade_current_2_1_x_To_indev_3_11_x.test_parallel_upgrade_with_internode_ssl
FAILED: dtest-upgrade.upgrade_tests.upgrade_through_versions_test.TestUpgrade_current_2_1_x_To_indev_3_11_x.test_rolling_upgrade_with_internode_ssl
FAILED: dtest.secondary_indexes_test.TestSecondaryIndexes.test_6924_dropping_ks
FAILED: org.apache.cassandra.db.compaction.LongLeveledCompactionStrategyCQLTest.stressTestCompactionStrategyManager
FAILED: org.apache.cassandra.utils.SlidingTimeRateTest.testConcurrentUpdateAndGet-cdc
FAILED: dtest-novnode.secondary_indexes_test.TestSecondaryIndexes.test_6924_dropping_ks
FAILED: org.apache.cassandra.distributed.upgrade.CompactStorage2to3UpgradeTest.singleColumn
FAILED: org.apache.cassandra.utils.memory.LongBufferPoolTest.testAllocate
FAILED: org.apache.cassandra.distributed.upgrade.CompactStorage2to3UpgradeTest.testDropCompactWithClusteringAndValueColumnWithDeletesAndWrites
FAILED: dtest-offheap.counter_test.TestCounters.test_13691
FAILED: dtest-offheap.counter_test.TestCounters.test_13691
FAILED: dtest-upgrade.upgrade_internal_auth_test.TestAuthUpgrade.test_upgrade_legacy_table
FAILED: cqlshlib.python2.jdk8.no_cython.test.test_cqlsh_output.TestCqlshOutput.test_boolean_output
FAILED: cqlshlib.python2.jdk8.no_cython.test.test_cqlsh_output.TestCqlshOutput.test_columnless_key_output
FAILED: cqlshlib.python2.jdk8.no_cython.test.test_cqlsh_output.TestCqlshOutput.test_count_output
FAILED: cqlshlib.python2.jdk8.no_cython.test.test_cqlsh_output.TestCqlshOutput.test_null_output
FAILED: cqlshlib.python2.jdk8.no_cython.test.test_cqlsh_output.TestCqlshOutput.test_numeric_output
FAILED: cqlshlib.python2.jdk8.no_cython.test.test_cqlsh_output.TestCqlshOutput.test_static_cf_output
FAILED: cqlshlib.python2.jdk8.no_cython.test.test_cqlsh_output.TestCqlshOutput.test_string_output_ascii
FAILED: cqlshlib.python2.jdk8.no_cython.test.test_cqlsh_output.TestCqlshOutput.test_boolean_output
FAILED: cqlshlib.python2.jdk8.no_cython.test.test_cqlsh_output.TestCqlshOutput.test_columnless_key_output
FAILED: cqlshlib.python2.jdk8.no_cython.test.test_cqlsh_output.TestCqlshOutput.test_count_output
FAILED: cqlshlib.python2.jdk8.no_cython.test.test_cqlsh_output.TestCqlshOutput.test_null_output
FAILED: cqlshlib.python2.jdk8.no_cython.test.test_cqlsh_output.TestCqlshOutput.test_numeric_output
FAILED: cqlshlib.python2.jdk8.no_cython.test.test_cqlsh_output.TestCqlshOutput.test_static_cf_output
FAILED: cqlshlib.python2.jdk8.no_cython.test.test_cqlsh_output.TestCqlshOutput.test_string_output_ascii
-------------------------------------------------------------------------------
For complete test report and logs see https://nightlies.apache.org/cassandra/Cassandra-3.11/257/