You are viewing a plain text version of this content. The canonical link for it is here.
Posted to dev@lucene.apache.org by Apache Jenkins Server <je...@builds.apache.org> on 2018/06/27 19:51:46 UTC

[JENKINS] Lucene-Solr-Tests-7.x - Build # 654 - Unstable

Build: https://builds.apache.org/job/Lucene-Solr-Tests-7.x/654/

1 tests failed.
FAILED:  org.apache.solr.cloud.MoveReplicaHDFSTest.test

Error Message:
Collection not found: MoveReplicaHDFSTest_coll_true

Stack Trace:
org.apache.solr.common.SolrException: Collection not found: MoveReplicaHDFSTest_coll_true
	at __randomizedtesting.SeedInfo.seed([6F0BB7BA17327D2A:E75F8860B9CE10D2]:0)
	at org.apache.solr.client.solrj.impl.CloudSolrClient.requestWithRetryOnStaleState(CloudSolrClient.java:853)
	at org.apache.solr.client.solrj.impl.CloudSolrClient.request(CloudSolrClient.java:819)
	at org.apache.solr.client.solrj.SolrRequest.process(SolrRequest.java:194)
	at org.apache.solr.client.solrj.SolrClient.add(SolrClient.java:173)
	at org.apache.solr.client.solrj.SolrClient.add(SolrClient.java:138)
	at org.apache.solr.cloud.MoveReplicaTest.addDocs(MoveReplicaTest.java:372)
	at org.apache.solr.cloud.MoveReplicaTest.test(MoveReplicaTest.java:109)
	at sun.reflect.NativeMethodAccessorImpl.invoke0(Native Method)
	at sun.reflect.NativeMethodAccessorImpl.invoke(NativeMethodAccessorImpl.java:62)
	at sun.reflect.DelegatingMethodAccessorImpl.invoke(DelegatingMethodAccessorImpl.java:43)
	at java.lang.reflect.Method.invoke(Method.java:498)
	at com.carrotsearch.randomizedtesting.RandomizedRunner.invoke(RandomizedRunner.java:1737)
	at com.carrotsearch.randomizedtesting.RandomizedRunner$8.evaluate(RandomizedRunner.java:934)
	at com.carrotsearch.randomizedtesting.RandomizedRunner$9.evaluate(RandomizedRunner.java:970)
	at com.carrotsearch.randomizedtesting.RandomizedRunner$10.evaluate(RandomizedRunner.java:984)
	at com.carrotsearch.randomizedtesting.rules.SystemPropertiesRestoreRule$1.evaluate(SystemPropertiesRestoreRule.java:57)
	at org.apache.lucene.util.TestRuleSetupTeardownChained$1.evaluate(TestRuleSetupTeardownChained.java:49)
	at org.apache.lucene.util.AbstractBeforeAfterRule$1.evaluate(AbstractBeforeAfterRule.java:45)
	at org.apache.lucene.util.TestRuleThreadAndTestName$1.evaluate(TestRuleThreadAndTestName.java:48)
	at org.apache.lucene.util.TestRuleIgnoreAfterMaxFailures$1.evaluate(TestRuleIgnoreAfterMaxFailures.java:64)
	at org.apache.lucene.util.TestRuleMarkFailure$1.evaluate(TestRuleMarkFailure.java:47)
	at com.carrotsearch.randomizedtesting.rules.StatementAdapter.evaluate(StatementAdapter.java:36)
	at com.carrotsearch.randomizedtesting.ThreadLeakControl$StatementRunner.run(ThreadLeakControl.java:368)
	at com.carrotsearch.randomizedtesting.ThreadLeakControl.forkTimeoutingTask(ThreadLeakControl.java:817)
	at com.carrotsearch.randomizedtesting.ThreadLeakControl$3.evaluate(ThreadLeakControl.java:468)
	at com.carrotsearch.randomizedtesting.RandomizedRunner.runSingleTest(RandomizedRunner.java:943)
	at com.carrotsearch.randomizedtesting.RandomizedRunner$5.evaluate(RandomizedRunner.java:829)
	at com.carrotsearch.randomizedtesting.RandomizedRunner$6.evaluate(RandomizedRunner.java:879)
	at com.carrotsearch.randomizedtesting.RandomizedRunner$7.evaluate(RandomizedRunner.java:890)
	at com.carrotsearch.randomizedtesting.rules.StatementAdapter.evaluate(StatementAdapter.java:36)
	at com.carrotsearch.randomizedtesting.rules.SystemPropertiesRestoreRule$1.evaluate(SystemPropertiesRestoreRule.java:57)
	at org.apache.lucene.util.AbstractBeforeAfterRule$1.evaluate(AbstractBeforeAfterRule.java:45)
	at com.carrotsearch.randomizedtesting.rules.StatementAdapter.evaluate(StatementAdapter.java:36)
	at org.apache.lucene.util.TestRuleStoreClassName$1.evaluate(TestRuleStoreClassName.java:41)
	at com.carrotsearch.randomizedtesting.rules.NoShadowingOrOverridesOnMethodsRule$1.evaluate(NoShadowingOrOverridesOnMethodsRule.java:40)
	at com.carrotsearch.randomizedtesting.rules.NoShadowingOrOverridesOnMethodsRule$1.evaluate(NoShadowingOrOverridesOnMethodsRule.java:40)
	at com.carrotsearch.randomizedtesting.rules.StatementAdapter.evaluate(StatementAdapter.java:36)
	at com.carrotsearch.randomizedtesting.rules.StatementAdapter.evaluate(StatementAdapter.java:36)
	at com.carrotsearch.randomizedtesting.rules.StatementAdapter.evaluate(StatementAdapter.java:36)
	at org.apache.lucene.util.TestRuleAssertionsRequired$1.evaluate(TestRuleAssertionsRequired.java:53)
	at org.apache.lucene.util.TestRuleMarkFailure$1.evaluate(TestRuleMarkFailure.java:47)
	at org.apache.lucene.util.TestRuleIgnoreAfterMaxFailures$1.evaluate(TestRuleIgnoreAfterMaxFailures.java:64)
	at org.apache.lucene.util.TestRuleIgnoreTestSuites$1.evaluate(TestRuleIgnoreTestSuites.java:54)
	at com.carrotsearch.randomizedtesting.rules.StatementAdapter.evaluate(StatementAdapter.java:36)
	at com.carrotsearch.randomizedtesting.ThreadLeakControl$StatementRunner.run(ThreadLeakControl.java:368)
	at java.lang.Thread.run(Thread.java:748)




Build Log:
[...truncated 12694 lines...]
   [junit4] Suite: org.apache.solr.cloud.MoveReplicaHDFSTest
   [junit4]   2> Creating dataDir: /x1/jenkins/jenkins-slave/workspace/Lucene-Solr-Tests-7.x/solr/build/solr-core/test/J1/temp/solr.cloud.MoveReplicaHDFSTest_6F0BB7BA17327D2A-001/init-core-data-001
   [junit4]   2> 595489 WARN  (SUITE-MoveReplicaHDFSTest-seed#[6F0BB7BA17327D2A]-worker) [    ] o.a.s.SolrTestCaseJ4 startTrackingSearchers: numOpens=2 numCloses=2
   [junit4]   2> 595489 INFO  (SUITE-MoveReplicaHDFSTest-seed#[6F0BB7BA17327D2A]-worker) [    ] o.a.s.SolrTestCaseJ4 Using PointFields (NUMERIC_POINTS_SYSPROP=true) w/NUMERIC_DOCVALUES_SYSPROP=true
   [junit4]   2> 595491 INFO  (SUITE-MoveReplicaHDFSTest-seed#[6F0BB7BA17327D2A]-worker) [    ] o.a.s.SolrTestCaseJ4 Randomized ssl (true) and clientAuth (false) via: @org.apache.solr.util.RandomizeSSL(reason=, ssl=NaN, value=NaN, clientAuth=NaN)
   [junit4]   2> 595491 INFO  (SUITE-MoveReplicaHDFSTest-seed#[6F0BB7BA17327D2A]-worker) [    ] o.a.s.SolrTestCaseJ4 SecureRandom sanity checks: test.solr.allowed.securerandom=null & java.security.egd=file:/dev/./urandom
   [junit4]   2> 595493 INFO  (SUITE-MoveReplicaHDFSTest-seed#[6F0BB7BA17327D2A]-worker) [    ] o.a.s.c.MiniSolrCloudCluster Starting cluster of 4 servers in /x1/jenkins/jenkins-slave/workspace/Lucene-Solr-Tests-7.x/solr/build/solr-core/test/J1/temp/solr.cloud.MoveReplicaHDFSTest_6F0BB7BA17327D2A-001/tempDir-001
   [junit4]   2> 595493 INFO  (SUITE-MoveReplicaHDFSTest-seed#[6F0BB7BA17327D2A]-worker) [    ] o.a.s.c.ZkTestServer STARTING ZK TEST SERVER
   [junit4]   2> 595493 INFO  (Thread-556) [    ] o.a.s.c.ZkTestServer client port:0.0.0.0/0.0.0.0:0
   [junit4]   2> 595493 INFO  (Thread-556) [    ] o.a.s.c.ZkTestServer Starting server
   [junit4]   2> 595495 ERROR (Thread-556) [    ] o.a.z.s.ZooKeeperServer ZKShutdownHandler is not registered, so ZooKeeper server won't take any action on ERROR or SHUTDOWN server state changes
   [junit4]   2> 595593 INFO  (SUITE-MoveReplicaHDFSTest-seed#[6F0BB7BA17327D2A]-worker) [    ] o.a.s.c.ZkTestServer start zk server on port:49816
   [junit4]   2> 595596 INFO  (zkConnectionManagerCallback-1047-thread-1) [    ] o.a.s.c.c.ConnectionManager zkClient has connected
   [junit4]   2> 595603 INFO  (jetty-launcher-1044-thread-1) [    ] o.e.j.s.Server jetty-9.4.11.v20180605; built: 2018-06-05T18:24:03.829Z; git: d5fc0523cfa96bfebfbda19606cad384d772f04c; jvm 1.8.0_172-b11
   [junit4]   2> 595611 INFO  (jetty-launcher-1044-thread-2) [    ] o.e.j.s.Server jetty-9.4.11.v20180605; built: 2018-06-05T18:24:03.829Z; git: d5fc0523cfa96bfebfbda19606cad384d772f04c; jvm 1.8.0_172-b11
   [junit4]   2> 595613 INFO  (jetty-launcher-1044-thread-3) [    ] o.e.j.s.Server jetty-9.4.11.v20180605; built: 2018-06-05T18:24:03.829Z; git: d5fc0523cfa96bfebfbda19606cad384d772f04c; jvm 1.8.0_172-b11
   [junit4]   2> 595616 INFO  (jetty-launcher-1044-thread-4) [    ] o.e.j.s.Server jetty-9.4.11.v20180605; built: 2018-06-05T18:24:03.829Z; git: d5fc0523cfa96bfebfbda19606cad384d772f04c; jvm 1.8.0_172-b11
   [junit4]   2> 595616 INFO  (jetty-launcher-1044-thread-2) [    ] o.e.j.s.session DefaultSessionIdManager workerName=node0
   [junit4]   2> 595617 INFO  (jetty-launcher-1044-thread-2) [    ] o.e.j.s.session No SessionScavenger set, using defaults
   [junit4]   2> 595617 INFO  (jetty-launcher-1044-thread-2) [    ] o.e.j.s.session node0 Scavenging every 600000ms
   [junit4]   2> 595617 INFO  (jetty-launcher-1044-thread-2) [    ] o.e.j.s.h.ContextHandler Started o.e.j.s.ServletContextHandler@71784c9e{/solr,null,AVAILABLE}
   [junit4]   2> 595619 INFO  (jetty-launcher-1044-thread-2) [    ] o.e.j.s.AbstractConnector Started ServerConnector@707f5f8b{SSL,[ssl, http/1.1]}{127.0.0.1:45830}
   [junit4]   2> 595619 INFO  (jetty-launcher-1044-thread-2) [    ] o.e.j.s.Server Started @595674ms
   [junit4]   2> 595619 INFO  (jetty-launcher-1044-thread-2) [    ] o.a.s.c.s.e.JettySolrRunner Jetty properties: {hostContext=/solr, hostPort=45830}
   [junit4]   2> 595619 ERROR (jetty-launcher-1044-thread-2) [    ] o.a.s.u.StartupLoggingUtils Missing Java Option solr.log.dir. Logging may be missing or incomplete.
   [junit4]   2> 595619 INFO  (jetty-launcher-1044-thread-2) [    ] o.a.s.s.SolrDispatchFilter Using logger factory org.apache.logging.slf4j.Log4jLoggerFactory
   [junit4]   2> 595619 INFO  (jetty-launcher-1044-thread-2) [    ] o.a.s.s.SolrDispatchFilter  ___      _       Welcome to Apache Solr™ version 7.5.0
   [junit4]   2> 595619 INFO  (jetty-launcher-1044-thread-2) [    ] o.a.s.s.SolrDispatchFilter / __| ___| |_ _   Starting in cloud mode on port null
   [junit4]   2> 595619 INFO  (jetty-launcher-1044-thread-2) [    ] o.a.s.s.SolrDispatchFilter \__ \/ _ \ | '_|  Install dir: null
   [junit4]   2> 595619 INFO  (jetty-launcher-1044-thread-2) [    ] o.a.s.s.SolrDispatchFilter |___/\___/_|_|    Start time: 2018-06-27T18:29:52.129Z
   [junit4]   2> 595622 INFO  (jetty-launcher-1044-thread-1) [    ] o.e.j.s.session DefaultSessionIdManager workerName=node0
   [junit4]   2> 595622 INFO  (jetty-launcher-1044-thread-1) [    ] o.e.j.s.session No SessionScavenger set, using defaults
   [junit4]   2> 595622 INFO  (jetty-launcher-1044-thread-1) [    ] o.e.j.s.session node0 Scavenging every 660000ms
   [junit4]   2> 595623 INFO  (jetty-launcher-1044-thread-1) [    ] o.e.j.s.h.ContextHandler Started o.e.j.s.ServletContextHandler@5cd2c8b8{/solr,null,AVAILABLE}
   [junit4]   2> 595623 INFO  (jetty-launcher-1044-thread-1) [    ] o.e.j.s.AbstractConnector Started ServerConnector@5ce0c89d{SSL,[ssl, http/1.1]}{127.0.0.1:40577}
   [junit4]   2> 595623 INFO  (jetty-launcher-1044-thread-1) [    ] o.e.j.s.Server Started @595679ms
   [junit4]   2> 595623 INFO  (jetty-launcher-1044-thread-1) [    ] o.a.s.c.s.e.JettySolrRunner Jetty properties: {hostContext=/solr, hostPort=40577}
   [junit4]   2> 595623 ERROR (jetty-launcher-1044-thread-1) [    ] o.a.s.u.StartupLoggingUtils Missing Java Option solr.log.dir. Logging may be missing or incomplete.
   [junit4]   2> 595624 INFO  (jetty-launcher-1044-thread-1) [    ] o.a.s.s.SolrDispatchFilter Using logger factory org.apache.logging.slf4j.Log4jLoggerFactory
   [junit4]   2> 595624 INFO  (jetty-launcher-1044-thread-1) [    ] o.a.s.s.SolrDispatchFilter  ___      _       Welcome to Apache Solr™ version 7.5.0
   [junit4]   2> 595624 INFO  (jetty-launcher-1044-thread-1) [    ] o.a.s.s.SolrDispatchFilter / __| ___| |_ _   Starting in cloud mode on port null
   [junit4]   2> 595624 INFO  (jetty-launcher-1044-thread-1) [    ] o.a.s.s.SolrDispatchFilter \__ \/ _ \ | '_|  Install dir: null
   [junit4]   2> 595624 INFO  (jetty-launcher-1044-thread-1) [    ] o.a.s.s.SolrDispatchFilter |___/\___/_|_|    Start time: 2018-06-27T18:29:52.134Z
   [junit4]   2> 595625 INFO  (jetty-launcher-1044-thread-4) [    ] o.e.j.s.session DefaultSessionIdManager workerName=node0
   [junit4]   2> 595625 INFO  (jetty-launcher-1044-thread-4) [    ] o.e.j.s.session No SessionScavenger set, using defaults
   [junit4]   2> 595625 INFO  (jetty-launcher-1044-thread-4) [    ] o.e.j.s.session node0 Scavenging every 600000ms
   [junit4]   2> 595626 INFO  (jetty-launcher-1044-thread-4) [    ] o.e.j.s.h.ContextHandler Started o.e.j.s.ServletContextHandler@4d77c4c4{/solr,null,AVAILABLE}
   [junit4]   2> 595626 INFO  (jetty-launcher-1044-thread-4) [    ] o.e.j.s.AbstractConnector Started ServerConnector@2c5e5897{SSL,[ssl, http/1.1]}{127.0.0.1:33123}
   [junit4]   2> 595626 INFO  (jetty-launcher-1044-thread-4) [    ] o.e.j.s.Server Started @595682ms
   [junit4]   2> 595626 INFO  (jetty-launcher-1044-thread-4) [    ] o.a.s.c.s.e.JettySolrRunner Jetty properties: {hostContext=/solr, hostPort=33123}
   [junit4]   2> 595627 ERROR (jetty-launcher-1044-thread-4) [    ] o.a.s.u.StartupLoggingUtils Missing Java Option solr.log.dir. Logging may be missing or incomplete.
   [junit4]   2> 595627 INFO  (jetty-launcher-1044-thread-4) [    ] o.a.s.s.SolrDispatchFilter Using logger factory org.apache.logging.slf4j.Log4jLoggerFactory
   [junit4]   2> 595627 INFO  (jetty-launcher-1044-thread-4) [    ] o.a.s.s.SolrDispatchFilter  ___      _       Welcome to Apache Solr™ version 7.5.0
   [junit4]   2> 595627 INFO  (jetty-launcher-1044-thread-4) [    ] o.a.s.s.SolrDispatchFilter / __| ___| |_ _   Starting in cloud mode on port null
   [junit4]   2> 595627 INFO  (jetty-launcher-1044-thread-4) [    ] o.a.s.s.SolrDispatchFilter \__ \/ _ \ | '_|  Install dir: null
   [junit4]   2> 595627 INFO  (jetty-launcher-1044-thread-4) [    ] o.a.s.s.SolrDispatchFilter |___/\___/_|_|    Start time: 2018-06-27T18:29:52.137Z
   [junit4]   2> 595634 INFO  (jetty-launcher-1044-thread-3) [    ] o.e.j.s.session DefaultSessionIdManager workerName=node0
   [junit4]   2> 595634 INFO  (jetty-launcher-1044-thread-3) [    ] o.e.j.s.session No SessionScavenger set, using defaults
   [junit4]   2> 595634 INFO  (jetty-launcher-1044-thread-3) [    ] o.e.j.s.session node0 Scavenging every 660000ms
   [junit4]   2> 595634 INFO  (jetty-launcher-1044-thread-3) [    ] o.e.j.s.h.ContextHandler Started o.e.j.s.ServletContextHandler@3f8c21d1{/solr,null,AVAILABLE}
   [junit4]   2> 595635 INFO  (jetty-launcher-1044-thread-3) [    ] o.e.j.s.AbstractConnector Started ServerConnector@f56764a{SSL,[ssl, http/1.1]}{127.0.0.1:50553}
   [junit4]   2> 595635 INFO  (jetty-launcher-1044-thread-3) [    ] o.e.j.s.Server Started @595690ms
   [junit4]   2> 595635 INFO  (jetty-launcher-1044-thread-3) [    ] o.a.s.c.s.e.JettySolrRunner Jetty properties: {hostContext=/solr, hostPort=50553}
   [junit4]   2> 595635 ERROR (jetty-launcher-1044-thread-3) [    ] o.a.s.u.StartupLoggingUtils Missing Java Option solr.log.dir. Logging may be missing or incomplete.
   [junit4]   2> 595635 INFO  (jetty-launcher-1044-thread-3) [    ] o.a.s.s.SolrDispatchFilter Using logger factory org.apache.logging.slf4j.Log4jLoggerFactory
   [junit4]   2> 595635 INFO  (jetty-launcher-1044-thread-3) [    ] o.a.s.s.SolrDispatchFilter  ___      _       Welcome to Apache Solr™ version 7.5.0
   [junit4]   2> 595635 INFO  (jetty-launcher-1044-thread-3) [    ] o.a.s.s.SolrDispatchFilter / __| ___| |_ _   Starting in cloud mode on port null
   [junit4]   2> 595635 INFO  (jetty-launcher-1044-thread-3) [    ] o.a.s.s.SolrDispatchFilter \__ \/ _ \ | '_|  Install dir: null
   [junit4]   2> 595635 INFO  (jetty-launcher-1044-thread-3) [    ] o.a.s.s.SolrDispatchFilter |___/\___/_|_|    Start time: 2018-06-27T18:29:52.145Z
   [junit4]   2> 595639 INFO  (zkConnectionManagerCallback-1049-thread-1) [    ] o.a.s.c.c.ConnectionManager zkClient has connected
   [junit4]   2> 595639 INFO  (jetty-launcher-1044-thread-2) [    ] o.a.s.s.SolrDispatchFilter solr.xml found in ZooKeeper. Loading...
   [junit4]   2> 595653 INFO  (zkConnectionManagerCallback-1055-thread-1) [    ] o.a.s.c.c.ConnectionManager zkClient has connected
   [junit4]   2> 595677 INFO  (jetty-launcher-1044-thread-3) [    ] o.a.s.s.SolrDispatchFilter solr.xml found in ZooKeeper. Loading...
   [junit4]   2> 595685 INFO  (zkConnectionManagerCallback-1051-thread-1) [    ] o.a.s.c.c.ConnectionManager zkClient has connected
   [junit4]   2> 595685 INFO  (jetty-launcher-1044-thread-1) [    ] o.a.s.s.SolrDispatchFilter solr.xml found in ZooKeeper. Loading...
   [junit4]   2> 595849 INFO  (zkConnectionManagerCallback-1053-thread-1) [    ] o.a.s.c.c.ConnectionManager zkClient has connected
   [junit4]   2> 595849 INFO  (jetty-launcher-1044-thread-4) [    ] o.a.s.s.SolrDispatchFilter solr.xml found in ZooKeeper. Loading...
   [junit4]   2> 596313 INFO  (jetty-launcher-1044-thread-3) [    ] o.a.s.c.ZkContainer Zookeeper client=127.0.0.1:49816/solr
   [junit4]   2> 596337 INFO  (zkConnectionManagerCallback-1059-thread-1) [    ] o.a.s.c.c.ConnectionManager zkClient has connected
   [junit4]   2> 596373 INFO  (zkConnectionManagerCallback-1061-thread-1) [    ] o.a.s.c.c.ConnectionManager zkClient has connected
   [junit4]   2> 596697 INFO  (jetty-launcher-1044-thread-4) [    ] o.a.s.c.ZkContainer Zookeeper client=127.0.0.1:49816/solr
   [junit4]   2> 596725 INFO  (jetty-launcher-1044-thread-3) [n:127.0.0.1:50553_solr    ] o.a.s.c.Overseer Overseer (id=null) closing
   [junit4]   2> 596726 INFO  (jetty-launcher-1044-thread-3) [n:127.0.0.1:50553_solr    ] o.a.s.c.OverseerElectionContext I am going to be the leader 127.0.0.1:50553_solr
   [junit4]   2> 596727 INFO  (jetty-launcher-1044-thread-3) [n:127.0.0.1:50553_solr    ] o.a.s.c.Overseer Overseer (id=74048321409581062-127.0.0.1:50553_solr-n_0000000000) starting
   [junit4]   2> 596761 INFO  (zkConnectionManagerCallback-1067-thread-1) [    ] o.a.s.c.c.ConnectionManager zkClient has connected
   [junit4]   2> 596781 INFO  (jetty-launcher-1044-thread-1) [    ] o.a.s.c.ZkContainer Zookeeper client=127.0.0.1:49816/solr
   [junit4]   2> 596805 INFO  (zkConnectionManagerCallback-1072-thread-1) [    ] o.a.s.c.c.ConnectionManager zkClient has connected
   [junit4]   2> 596807 INFO  (jetty-launcher-1044-thread-3) [n:127.0.0.1:50553_solr    ] o.a.s.c.s.i.ZkClientClusterStateProvider Cluster at 127.0.0.1:49816/solr ready
   [junit4]   2> 596817 INFO  (zkConnectionManagerCallback-1076-thread-1) [    ] o.a.s.c.c.ConnectionManager zkClient has connected
   [junit4]   2> 596848 INFO  (jetty-launcher-1044-thread-3) [n:127.0.0.1:50553_solr    ] o.a.s.c.ZkController Register node as live in ZooKeeper:/live_nodes/127.0.0.1:50553_solr
   [junit4]   2> 596877 INFO  (OverseerStateUpdate-74048321409581062-127.0.0.1:50553_solr-n_0000000000) [    ] o.a.s.c.c.ZkStateReader Updated live nodes from ZooKeeper... (0) -> (1)
   [junit4]   2> 596901 INFO  (zkConnectionManagerCallback-1078-thread-1) [    ] o.a.s.c.c.ConnectionManager zkClient has connected
   [junit4]   2> 596905 INFO  (zkConnectionManagerCallback-1080-thread-1) [    ] o.a.s.c.c.ConnectionManager zkClient has connected
   [junit4]   2> 596919 INFO  (jetty-launcher-1044-thread-3) [n:127.0.0.1:50553_solr    ] o.a.s.h.a.MetricsHistoryHandler No .system collection, keeping metrics history in memory.
   [junit4]   2> 596968 INFO  (zkCallback-1071-thread-1) [    ] o.a.s.c.c.ZkStateReader Updated live nodes from ZooKeeper... (0) -> (1)
   [junit4]   2> 596980 INFO  (jetty-launcher-1044-thread-4) [n:127.0.0.1:33123_solr    ] o.a.s.c.c.ZkStateReader Updated live nodes from ZooKeeper... (0) -> (1)
   [junit4]   2> 596981 INFO  (jetty-launcher-1044-thread-1) [n:127.0.0.1:40577_solr    ] o.a.s.c.c.ZkStateReader Updated live nodes from ZooKeeper... (0) -> (1)
   [junit4]   2> 596986 INFO  (jetty-launcher-1044-thread-4) [n:127.0.0.1:33123_solr    ] o.a.s.c.Overseer Overseer (id=null) closing
   [junit4]   2> 596986 INFO  (jetty-launcher-1044-thread-1) [n:127.0.0.1:40577_solr    ] o.a.s.c.Overseer Overseer (id=null) closing
   [junit4]   2> 596990 INFO  (jetty-launcher-1044-thread-4) [n:127.0.0.1:33123_solr    ] o.a.s.c.TransientSolrCoreCacheDefault Allocating transient cache for 2147483647 transient cores
   [junit4]   2> 596990 INFO  (jetty-launcher-1044-thread-4) [n:127.0.0.1:33123_solr    ] o.a.s.c.ZkController Register node as live in ZooKeeper:/live_nodes/127.0.0.1:33123_solr
   [junit4]   2> 596991 INFO  (jetty-launcher-1044-thread-1) [n:127.0.0.1:40577_solr    ] o.a.s.c.TransientSolrCoreCacheDefault Allocating transient cache for 2147483647 transient cores
   [junit4]   2> 596991 INFO  (jetty-launcher-1044-thread-1) [n:127.0.0.1:40577_solr    ] o.a.s.c.ZkController Register node as live in ZooKeeper:/live_nodes/127.0.0.1:40577_solr
   [junit4]   2> 597030 INFO  (jetty-launcher-1044-thread-2) [    ] o.a.s.c.ZkContainer Zookeeper client=127.0.0.1:49816/solr
   [junit4]   2> 597053 INFO  (zkCallback-1071-thread-1) [    ] o.a.s.c.c.ZkStateReader Updated live nodes from ZooKeeper... (1) -> (3)
   [junit4]   2> 597081 INFO  (zkCallback-1060-thread-2) [    ] o.a.s.c.c.ZkStateReader Updated live nodes from ZooKeeper... (1) -> (3)
   [junit4]   2> 597088 INFO  (zkCallback-1079-thread-1) [    ] o.a.s.c.c.ZkStateReader Updated live nodes from ZooKeeper... (1) -> (3)
   [junit4]   2> 597091 INFO  (jetty-launcher-1044-thread-3) [n:127.0.0.1:50553_solr    ] o.a.s.m.r.SolrJmxReporter JMX monitoring for 'solr_50553.solr.node' (registry 'solr.node') enabled at server: com.sun.jmx.mbeanserver.JmxMBeanServer@6fd52b4f
   [junit4]   2> 597108 INFO  (zkConnectionManagerCallback-1089-thread-1) [    ] o.a.s.c.c.ConnectionManager zkClient has connected
   [junit4]   2> 597176 INFO  (jetty-launcher-1044-thread-3) [n:127.0.0.1:50553_solr    ] o.a.s.m.r.SolrJmxReporter JMX monitoring for 'solr_50553.solr.jvm' (registry 'solr.jvm') enabled at server: com.sun.jmx.mbeanserver.JmxMBeanServer@6fd52b4f
   [junit4]   2> 597177 INFO  (jetty-launcher-1044-thread-3) [n:127.0.0.1:50553_solr    ] o.a.s.m.r.SolrJmxReporter JMX monitoring for 'solr_50553.solr.jetty' (registry 'solr.jetty') enabled at server: com.sun.jmx.mbeanserver.JmxMBeanServer@6fd52b4f
   [junit4]   2> 597178 INFO  (zkCallback-1077-thread-1) [    ] o.a.s.c.c.ZkStateReader Updated live nodes from ZooKeeper... (1) -> (3)
   [junit4]   2> 597178 INFO  (zkConnectionManagerCallback-1097-thread-1) [    ] o.a.s.c.c.ConnectionManager zkClient has connected
   [junit4]   2> 597179 INFO  (jetty-launcher-1044-thread-3) [n:127.0.0.1:50553_solr    ] o.a.s.c.CorePropertiesLocator Found 0 core definitions underneath /x1/jenkins/jenkins-slave/workspace/Lucene-Solr-Tests-7.x/solr/build/solr-core/test/J1/temp/solr.cloud.MoveReplicaHDFSTest_6F0BB7BA17327D2A-001/tempDir-001/node3/.
   [junit4]   2> 597180 INFO  (jetty-launcher-1044-thread-1) [n:127.0.0.1:40577_solr    ] o.a.s.c.c.ZkStateReader Updated live nodes from ZooKeeper... (0) -> (3)
   [junit4]   2> 597181 INFO  (jetty-launcher-1044-thread-1) [n:127.0.0.1:40577_solr    ] o.a.s.c.s.i.ZkClientClusterStateProvider Cluster at 127.0.0.1:49816/solr ready
   [junit4]   2> 597421 INFO  (zkConnectionManagerCallback-1093-thread-1) [    ] o.a.s.c.c.ConnectionManager zkClient has connected
   [junit4]   2> 597429 INFO  (jetty-launcher-1044-thread-2) [n:127.0.0.1:45830_solr    ] o.a.s.c.c.ZkStateReader Updated live nodes from ZooKeeper... (0) -> (3)
   [junit4]   2> 597438 INFO  (jetty-launcher-1044-thread-2) [n:127.0.0.1:45830_solr    ] o.a.s.c.Overseer Overseer (id=null) closing
   [junit4]   2> 597440 INFO  (jetty-launcher-1044-thread-2) [n:127.0.0.1:45830_solr    ] o.a.s.c.TransientSolrCoreCacheDefault Allocating transient cache for 2147483647 transient cores
   [junit4]   2> 597440 INFO  (jetty-launcher-1044-thread-2) [n:127.0.0.1:45830_solr    ] o.a.s.c.ZkController Register node as live in ZooKeeper:/live_nodes/127.0.0.1:45830_solr
   [junit4]   2> 597441 INFO  (zkCallback-1071-thread-1) [    ] o.a.s.c.c.ZkStateReader Updated live nodes from ZooKeeper... (3) -> (4)
   [junit4]   2> 597468 INFO  (zkCallback-1079-thread-1) [    ] o.a.s.c.c.ZkStateReader Updated live nodes from ZooKeeper... (3) -> (4)
   [junit4]   2> 597472 INFO  (zkCallback-1077-thread-1) [    ] o.a.s.c.c.ZkStateReader Updated live nodes from ZooKeeper... (3) -> (4)
   [junit4]   2> 597521 INFO  (jetty-launcher-1044-thread-1) [n:127.0.0.1:40577_solr    ] o.a.s.h.a.MetricsHistoryHandler No .system collection, keeping metrics history in memory.
   [junit4]   2> 597550 INFO  (zkCallback-1060-thread-1) [    ] o.a.s.c.c.ZkStateReader Updated live nodes from ZooKeeper... (3) -> (4)
   [junit4]   2> 597641 INFO  (zkCallback-1092-thread-1) [    ] o.a.s.c.c.ZkStateReader Updated live nodes from ZooKeeper... (3) -> (4)
   [junit4]   2> 597641 INFO  (zkCallback-1096-thread-1) [    ] o.a.s.c.c.ZkStateReader Updated live nodes from ZooKeeper... (3) -> (4)
   [junit4]   2> 597653 INFO  (jetty-launcher-1044-thread-1) [n:127.0.0.1:40577_solr    ] o.a.s.m.r.SolrJmxReporter JMX monitoring for 'solr_40577.solr.node' (registry 'solr.node') enabled at server: com.sun.jmx.mbeanserver.JmxMBeanServer@6fd52b4f
   [junit4]   2> 597665 INFO  (zkConnectionManagerCallback-1104-thread-1) [    ] o.a.s.c.c.ConnectionManager zkClient has connected
   [junit4]   2> 597675 INFO  (jetty-launcher-1044-thread-1) [n:127.0.0.1:40577_solr    ] o.a.s.m.r.SolrJmxReporter JMX monitoring for 'solr_40577.solr.jvm' (registry 'solr.jvm') enabled at server: com.sun.jmx.mbeanserver.JmxMBeanServer@6fd52b4f
   [junit4]   2> 597676 INFO  (jetty-launcher-1044-thread-1) [n:127.0.0.1:40577_solr    ] o.a.s.m.r.SolrJmxReporter JMX monitoring for 'solr_40577.solr.jetty' (registry 'solr.jetty') enabled at server: com.sun.jmx.mbeanserver.JmxMBeanServer@6fd52b4f
   [junit4]   2> 597681 INFO  (zkConnectionManagerCallback-1109-thread-1) [    ] o.a.s.c.c.ConnectionManager zkClient has connected
   [junit4]   2> 597681 INFO  (jetty-launcher-1044-thread-4) [n:127.0.0.1:33123_solr    ] o.a.s.c.c.ZkStateReader Updated live nodes from ZooKeeper... (0) -> (4)
   [junit4]   2> 597682 INFO  (jetty-launcher-1044-thread-2) [n:127.0.0.1:45830_solr    ] o.a.s.c.c.ZkStateReader Updated live nodes from ZooKeeper... (0) -> (4)
   [junit4]   2> 597683 INFO  (jetty-launcher-1044-thread-2) [n:127.0.0.1:45830_solr    ] o.a.s.c.s.i.ZkClientClusterStateProvider Cluster at 127.0.0.1:49816/solr ready
   [junit4]   2> 597689 INFO  (jetty-launcher-1044-thread-1) [n:127.0.0.1:40577_solr    ] o.a.s.c.CorePropertiesLocator Found 0 core definitions underneath /x1/jenkins/jenkins-slave/workspace/Lucene-Solr-Tests-7.x/solr/build/solr-core/test/J1/temp/solr.cloud.MoveReplicaHDFSTest_6F0BB7BA17327D2A-001/tempDir-001/node1/.
   [junit4]   2> 597694 INFO  (jetty-launcher-1044-thread-2) [n:127.0.0.1:45830_solr    ] o.a.s.h.a.MetricsHistoryHandler No .system collection, keeping metrics history in memory.
   [junit4]   2> 597705 INFO  (jetty-launcher-1044-thread-4) [n:127.0.0.1:33123_solr    ] o.a.s.c.s.i.ZkClientClusterStateProvider Cluster at 127.0.0.1:49816/solr ready
   [junit4]   2> 597726 INFO  (jetty-launcher-1044-thread-2) [n:127.0.0.1:45830_solr    ] o.a.s.m.r.SolrJmxReporter JMX monitoring for 'solr_45830.solr.node' (registry 'solr.node') enabled at server: com.sun.jmx.mbeanserver.JmxMBeanServer@6fd52b4f
   [junit4]   2> 597737 INFO  (jetty-launcher-1044-thread-4) [n:127.0.0.1:33123_solr    ] o.a.s.h.a.MetricsHistoryHandler No .system collection, keeping metrics history in memory.
   [junit4]   2> 597779 INFO  (jetty-launcher-1044-thread-4) [n:127.0.0.1:33123_solr    ] o.a.s.m.r.SolrJmxReporter JMX monitoring for 'solr_33123.solr.node' (registry 'solr.node') enabled at server: com.sun.jmx.mbeanserver.JmxMBeanServer@6fd52b4f
   [junit4]   2> 597797 INFO  (jetty-launcher-1044-thread-2) [n:127.0.0.1:45830_solr    ] o.a.s.m.r.SolrJmxReporter JMX monitoring for 'solr_45830.solr.jvm' (registry 'solr.jvm') enabled at server: com.sun.jmx.mbeanserver.JmxMBeanServer@6fd52b4f
   [junit4]   2> 597797 INFO  (jetty-launcher-1044-thread-2) [n:127.0.0.1:45830_solr    ] o.a.s.m.r.SolrJmxReporter JMX monitoring for 'solr_45830.solr.jetty' (registry 'solr.jetty') enabled at server: com.sun.jmx.mbeanserver.JmxMBeanServer@6fd52b4f
   [junit4]   2> 597800 INFO  (jetty-launcher-1044-thread-2) [n:127.0.0.1:45830_solr    ] o.a.s.c.CorePropertiesLocator Found 0 core definitions underneath /x1/jenkins/jenkins-slave/workspace/Lucene-Solr-Tests-7.x/solr/build/solr-core/test/J1/temp/solr.cloud.MoveReplicaHDFSTest_6F0BB7BA17327D2A-001/tempDir-001/node2/.
   [junit4]   2> 597862 INFO  (jetty-launcher-1044-thread-4) [n:127.0.0.1:33123_solr    ] o.a.s.m.r.SolrJmxReporter JMX monitoring for 'solr_33123.solr.jvm' (registry 'solr.jvm') enabled at server: com.sun.jmx.mbeanserver.JmxMBeanServer@6fd52b4f
   [junit4]   2> 597862 INFO  (jetty-launcher-1044-thread-4) [n:127.0.0.1:33123_solr    ] o.a.s.m.r.SolrJmxReporter JMX monitoring for 'solr_33123.solr.jetty' (registry 'solr.jetty') enabled at server: com.sun.jmx.mbeanserver.JmxMBeanServer@6fd52b4f
   [junit4]   2> 597865 INFO  (jetty-launcher-1044-thread-4) [n:127.0.0.1:33123_solr    ] o.a.s.c.CorePropertiesLocator Found 0 core definitions underneath /x1/jenkins/jenkins-slave/workspace/Lucene-Solr-Tests-7.x/solr/build/solr-core/test/J1/temp/solr.cloud.MoveReplicaHDFSTest_6F0BB7BA17327D2A-001/tempDir-001/node4/.
   [junit4]   2> 598049 INFO  (zkConnectionManagerCallback-1113-thread-1) [    ] o.a.s.c.c.ConnectionManager zkClient has connected
   [junit4]   2> 598073 INFO  (zkConnectionManagerCallback-1118-thread-1) [    ] o.a.s.c.c.ConnectionManager zkClient has connected
   [junit4]   2> 598074 INFO  (SUITE-MoveReplicaHDFSTest-seed#[6F0BB7BA17327D2A]-worker) [    ] o.a.s.c.c.ZkStateReader Updated live nodes from ZooKeeper... (0) -> (4)
   [junit4]   2> 598075 INFO  (SUITE-MoveReplicaHDFSTest-seed#[6F0BB7BA17327D2A]-worker) [    ] o.a.s.c.s.i.ZkClientClusterStateProvider Cluster at 127.0.0.1:49816/solr ready
   [junit4]   2> 598167 INFO  (qtp1344074853-3400) [n:127.0.0.1:33123_solr    ] o.a.s.h.a.CollectionsHandler Invoked Collection Action :overseerstatus with params action=OVERSEERSTATUS&wt=javabin&version=2 and sendToOCPQueue=true
   [junit4]   2> 598359 INFO  (qtp1344074853-3400) [n:127.0.0.1:33123_solr    ] o.a.s.s.HttpSolrCall [admin] webapp=null path=/admin/collections params={action=OVERSEERSTATUS&wt=javabin&version=2} status=0 QTime=194
   [junit4]   2> 600080 WARN  (SUITE-MoveReplicaHDFSTest-seed#[6F0BB7BA17327D2A]-worker) [    ] o.a.h.u.NativeCodeLoader Unable to load native-hadoop library for your platform... using builtin-java classes where applicable
   [junit4]   1> Formatting using clusterid: testClusterID
   [junit4]   2> 600183 INFO  (OverseerCollectionConfigSetProcessor-74048321409581062-127.0.0.1:50553_solr-n_0000000000) [    ] o.a.s.c.OverseerTaskQueue Response ZK path: /overseer/collection-queue-work/qnr-0000000000 doesn't exist.  Requestor may have disconnected from ZooKeeper
   [junit4]   2> 601686 WARN  (SUITE-MoveReplicaHDFSTest-seed#[6F0BB7BA17327D2A]-worker) [    ] o.a.h.m.i.MetricsConfig Cannot locate configuration: tried hadoop-metrics2-namenode.properties,hadoop-metrics2.properties
   [junit4]   2> 602428 INFO  (SUITE-MoveReplicaHDFSTest-seed#[6F0BB7BA17327D2A]-worker) [    ] o.m.log Logging to org.apache.logging.slf4j.Log4jLogger@57155218 via org.mortbay.log.Slf4jLog
   [junit4]   2> 602460 WARN  (SUITE-MoveReplicaHDFSTest-seed#[6F0BB7BA17327D2A]-worker) [    ] o.a.h.h.HttpRequestLog Jetty request log can only be enabled using Log4j
   [junit4]   2> 603059 INFO  (SUITE-MoveReplicaHDFSTest-seed#[6F0BB7BA17327D2A]-worker) [    ] o.m.log jetty-6.1.26
   [junit4]   2> 603426 INFO  (SUITE-MoveReplicaHDFSTest-seed#[6F0BB7BA17327D2A]-worker) [    ] o.m.log Extract jar:file:/x1/jenkins/.ivy2/cache/org.apache.hadoop/hadoop-hdfs/tests/hadoop-hdfs-2.7.4-tests.jar!/webapps/hdfs to ./temp/Jetty_localhost_56763_hdfs____jfhyu5/webapp
   [junit4]   2> 605356 INFO  (SUITE-MoveReplicaHDFSTest-seed#[6F0BB7BA17327D2A]-worker) [    ] o.m.log Started HttpServer2$SelectChannelConnectorWithSafeStartup@localhost:56763
   [junit4]   2> 608589 WARN  (SUITE-MoveReplicaHDFSTest-seed#[6F0BB7BA17327D2A]-worker) [    ] o.a.h.h.HttpRequestLog Jetty request log can only be enabled using Log4j
   [junit4]   2> 608594 INFO  (SUITE-MoveReplicaHDFSTest-seed#[6F0BB7BA17327D2A]-worker) [    ] o.m.log jetty-6.1.26
   [junit4]   2> 608636 INFO  (SUITE-MoveReplicaHDFSTest-seed#[6F0BB7BA17327D2A]-worker) [    ] o.m.log Extract jar:file:/x1/jenkins/.ivy2/cache/org.apache.hadoop/hadoop-hdfs/tests/hadoop-hdfs-2.7.4-tests.jar!/webapps/datanode to ./temp/Jetty_localhost_45769_datanode____.jf4a68/webapp
   [junit4]   2> 609614 INFO  (SUITE-MoveReplicaHDFSTest-seed#[6F0BB7BA17327D2A]-worker) [    ] o.m.log Started HttpServer2$SelectChannelConnectorWithSafeStartup@localhost:45769
   [junit4]   2> 611449 WARN  (SUITE-MoveReplicaHDFSTest-seed#[6F0BB7BA17327D2A]-worker) [    ] o.a.h.h.HttpRequestLog Jetty request log can only be enabled using Log4j
   [junit4]   2> 611450 INFO  (SUITE-MoveReplicaHDFSTest-seed#[6F0BB7BA17327D2A]-worker) [    ] o.m.log jetty-6.1.26
   [junit4]   2> 611484 INFO  (SUITE-MoveReplicaHDFSTest-seed#[6F0BB7BA17327D2A]-worker) [    ] o.m.log Extract jar:file:/x1/jenkins/.ivy2/cache/org.apache.hadoop/hadoop-hdfs/tests/hadoop-hdfs-2.7.4-tests.jar!/webapps/datanode to ./temp/Jetty_localhost_42684_datanode____.bhdbj9/webapp
   [junit4]   2> 612546 INFO  (SUITE-MoveReplicaHDFSTest-seed#[6F0BB7BA17327D2A]-worker) [    ] o.m.log Started HttpServer2$SelectChannelConnectorWithSafeStartup@localhost:42684
   [junit4]   2> 614079 ERROR (DataNode: [[[DISK]file:/x1/jenkins/jenkins-slave/workspace/Lucene-Solr-Tests-7.x/solr/build/solr-core/test/J1/temp/solr.cloud.MoveReplicaHDFSTest_6F0BB7BA17327D2A-001/tempDir-002/hdfsBaseDir/data/data1/, [DISK]file:/x1/jenkins/jenkins-slave/workspace/Lucene-Solr-Tests-7.x/solr/build/solr-core/test/J1/temp/solr.cloud.MoveReplicaHDFSTest_6F0BB7BA17327D2A-001/tempDir-002/hdfsBaseDir/data/data2/]]  heartbeating to localhost/127.0.0.1:60346) [    ] o.a.h.h.s.d.DirectoryScanner dfs.datanode.directoryscan.throttle.limit.ms.per.sec set to value below 1 ms/sec. Assuming default value of 1000
   [junit4]   2> 614246 ERROR (DataNode: [[[DISK]file:/x1/jenkins/jenkins-slave/workspace/Lucene-Solr-Tests-7.x/solr/build/solr-core/test/J1/temp/solr.cloud.MoveReplicaHDFSTest_6F0BB7BA17327D2A-001/tempDir-002/hdfsBaseDir/data/data3/, [DISK]file:/x1/jenkins/jenkins-slave/workspace/Lucene-Solr-Tests-7.x/solr/build/solr-core/test/J1/temp/solr.cloud.MoveReplicaHDFSTest_6F0BB7BA17327D2A-001/tempDir-002/hdfsBaseDir/data/data4/]]  heartbeating to localhost/127.0.0.1:60346) [    ] o.a.h.h.s.d.DirectoryScanner dfs.datanode.directoryscan.throttle.limit.ms.per.sec set to value below 1 ms/sec. Assuming default value of 1000
   [junit4]   2> 615497 INFO  (Block report processor) [    ] BlockStateChange BLOCK* processReport 0x6beae8f7d68b9d: from storage DS-3cc1d437-de88-4476-929b-1530df5e8aa0 node DatanodeRegistration(127.0.0.1:59507, datanodeUuid=f5b8ead3-268a-49b7-9220-873b0a58e5a3, infoPort=53588, infoSecurePort=0, ipcPort=44017, storageInfo=lv=-56;cid=testClusterID;nsid=1829203596;c=0), blocks: 0, hasStaleStorage: true, processing time: 3 msecs
   [junit4]   2> 615498 INFO  (Block report processor) [    ] BlockStateChange BLOCK* processReport 0x6beae8f7d68b9d: from storage DS-7791a69e-2a67-4a78-a6af-8bbc11f00953 node DatanodeRegistration(127.0.0.1:59507, datanodeUuid=f5b8ead3-268a-49b7-9220-873b0a58e5a3, infoPort=53588, infoSecurePort=0, ipcPort=44017, storageInfo=lv=-56;cid=testClusterID;nsid=1829203596;c=0), blocks: 0, hasStaleStorage: false, processing time: 0 msecs
   [junit4]   2> 615514 INFO  (Block report processor) [    ] BlockStateChange BLOCK* processReport 0x6beae9029ef163: from storage DS-a22330df-594b-4225-a230-cba0d3ac5961 node DatanodeRegistration(127.0.0.1:37896, datanodeUuid=3b2575fb-6932-438b-b152-326a1832bda8, infoPort=52748, infoSecurePort=0, ipcPort=50837, storageInfo=lv=-56;cid=testClusterID;nsid=1829203596;c=0), blocks: 0, hasStaleStorage: true, processing time: 0 msecs
   [junit4]   2> 615514 INFO  (Block report processor) [    ] BlockStateChange BLOCK* processReport 0x6beae9029ef163: from storage DS-a2f1fd22-8d2c-45aa-8c0e-1f2e209a2317 node DatanodeRegistration(127.0.0.1:37896, datanodeUuid=3b2575fb-6932-438b-b152-326a1832bda8, infoPort=52748, infoSecurePort=0, ipcPort=50837, storageInfo=lv=-56;cid=testClusterID;nsid=1829203596;c=0), blocks: 0, hasStaleStorage: false, processing time: 0 msecs
   [junit4]   2> 617064 INFO  (TEST-MoveReplicaHDFSTest.testNormalMove-seed#[6F0BB7BA17327D2A]) [    ] o.a.s.SolrTestCaseJ4 ###Starting testNormalMove
   [junit4]   2> 617065 INFO  (TEST-MoveReplicaHDFSTest.testNormalMove-seed#[6F0BB7BA17327D2A]) [    ] o.a.s.c.c.ZkStateReader Updated live nodes from ZooKeeper... (0) -> (4)
   [junit4]   2> 617078 INFO  (TEST-MoveReplicaHDFSTest.testNormalMove-seed#[6F0BB7BA17327D2A]) [    ] o.e.j.s.Server jetty-9.4.11.v20180605; built: 2018-06-05T18:24:03.829Z; git: d5fc0523cfa96bfebfbda19606cad384d772f04c; jvm 1.8.0_172-b11
   [junit4]   2> 617080 INFO  (TEST-MoveReplicaHDFSTest.testNormalMove-seed#[6F0BB7BA17327D2A]) [    ] o.e.j.s.session DefaultSessionIdManager workerName=node0
   [junit4]   2> 617080 INFO  (TEST-MoveReplicaHDFSTest.testNormalMove-seed#[6F0BB7BA17327D2A]) [    ] o.e.j.s.session No SessionScavenger set, using defaults
   [junit4]   2> 617080 INFO  (TEST-MoveReplicaHDFSTest.testNormalMove-seed#[6F0BB7BA17327D2A]) [    ] o.e.j.s.session node0 Scavenging every 660000ms
   [junit4]   2> 617080 INFO  (TEST-MoveReplicaHDFSTest.testNormalMove-seed#[6F0BB7BA17327D2A]) [    ] o.e.j.s.h.ContextHandler Started o.e.j.s.ServletContextHandler@7006e87d{/solr,null,AVAILABLE}
   [junit4]   2> 617081 INFO  (TEST-MoveReplicaHDFSTest.testNormalMove-seed#[6F0BB7BA17327D2A]) [    ] o.e.j.s.AbstractConnector Started ServerConnector@3ae2f450{SSL,[ssl, http/1.1]}{127.0.0.1:33488}
   [junit4]   2> 617081 INFO  (TEST-MoveReplicaHDFSTest.testNormalMove-seed#[6F0BB7BA17327D2A]) [    ] o.e.j.s.Server Started @617137ms
   [junit4]   2> 617081 INFO  (TEST-MoveReplicaHDFSTest.testNormalMove-seed#[6F0BB7BA17327D2A]) [    ] o.a.s.c.s.e.JettySolrRunner Jetty properties: {hostContext=/solr, hostPort=33488}
   [junit4]   2> 617082 ERROR (TEST-MoveReplicaHDFSTest.testNormalMove-seed#[6F0BB7BA17327D2A]) [    ] o.a.s.u.StartupLoggingUtils Missing Java Option solr.log.dir. Logging may be missing or incomplete.
   [junit4]   2> 617082 INFO  (TEST-MoveReplicaHDFSTest.testNormalMove-seed#[6F0BB7BA17327D2A]) [    ] o.a.s.s.SolrDispatchFilter Using logger factory org.apache.logging.slf4j.Log4jLoggerFactory
   [junit4]   2> 617082 INFO  (TEST-MoveReplicaHDFSTest.testNormalMove-seed#[6F0BB7BA17327D2A]) [    ] o.a.s.s.SolrDispatchFilter  ___      _       Welcome to Apache Solr™ version 7.5.0
   [junit4]   2> 617082 INFO  (TEST-MoveReplicaHDFSTest.testNormalMove-seed#[6F0BB7BA17327D2A]) [    ] o.a.s.s.SolrDispatchFilter / __| ___| |_ _   Starting in cloud mode on port null
   [junit4]   2> 617082 INFO  (TEST-MoveReplicaHDFSTest.testNormalMove-seed#[6F0BB7BA17327D2A]) [    ] o.a.s.s.SolrDispatchFilter \__ \/ _ \ | '_|  Install dir: null
   [junit4]   2> 617082 INFO  (TEST-MoveReplicaHDFSTest.testNormalMove-seed#[6F0BB7BA17327D2A]) [    ] o.a.s.s.SolrDispatchFilter |___/\___/_|_|    Start time: 2018-06-27T18:30:13.592Z
   [junit4]   2> 617129 INFO  (zkConnectionManagerCallback-1122-thread-1) [    ] o.a.s.c.c.ConnectionManager zkClient has connected
   [junit4]   2> 617130 INFO  (TEST-MoveReplicaHDFSTest.testNormalMove-seed#[6F0BB7BA17327D2A]) [    ] o.a.s.s.SolrDispatchFilter solr.xml found in ZooKeeper. Loading...
   [junit4]   2> 617543 INFO  (TEST-MoveReplicaHDFSTest.testNormalMove-seed#[6F0BB7BA17327D2A]) [    ] o.a.s.c.ZkContainer Zookeeper client=127.0.0.1:49816/solr
   [junit4]   2> 617545 INFO  (zkConnectionManagerCallback-1126-thread-1) [    ] o.a.s.c.c.ConnectionManager zkClient has connected
   [junit4]   2> 617548 INFO  (zkConnectionManagerCallback-1128-thread-1) [    ] o.a.s.c.c.ConnectionManager zkClient has connected
   [junit4]   2> 617556 INFO  (TEST-MoveReplicaHDFSTest.testNormalMove-seed#[6F0BB7BA17327D2A]) [n:127.0.0.1:33488_solr    ] o.a.s.c.c.ZkStateReader Updated live nodes from ZooKeeper... (0) -> (4)
   [junit4]   2> 617559 INFO  (TEST-MoveReplicaHDFSTest.testNormalMove-seed#[6F0BB7BA17327D2A]) [n:127.0.0.1:33488_solr    ] o.a.s.c.Overseer Overseer (id=null) closing
   [junit4]   2> 617562 INFO  (TEST-MoveReplicaHDFSTest.testNormalMove-seed#[6F0BB7BA17327D2A]) [n:127.0.0.1:33488_solr    ] o.a.s.c.TransientSolrCoreCacheDefault Allocating transient cache for 2147483647 transient cores
   [junit4]   2> 617562 INFO  (TEST-MoveReplicaHDFSTest.testNormalMove-seed#[6F0BB7BA17327D2A]) [n:127.0.0.1:33488_solr    ] o.a.s.c.ZkController Register node as live in ZooKeeper:/live_nodes/127.0.0.1:33488_solr
   [junit4]   2> 617565 INFO  (zkCallback-1103-thread-1) [    ] o.a.s.c.c.ZkStateReader Updated live nodes from ZooKeeper... (4) -> (5)
   [junit4]   2> 617565 INFO  (zkCallback-1092-thread-1) [    ] o.a.s.c.c.ZkStateReader Updated live nodes from ZooKeeper... (4) -> (5)
   [junit4]   2> 617565 INFO  (zkCallback-1096-thread-1) [    ] o.a.s.c.c.ZkStateReader Updated live nodes from ZooKeeper... (4) -> (5)
   [junit4]   2> 617566 INFO  (zkCallback-1117-thread-2) [    ] o.a.s.c.c.ZkStateReader Updated live nodes from ZooKeeper... (4) -> (5)
   [junit4]   2> 617567 INFO  (zkCallback-1079-thread-1) [    ] o.a.s.c.c.ZkStateReader Updated live nodes from ZooKeeper... (4) -> (5)
   [junit4]   2> 617567 INFO  (zkCallback-1071-thread-1) [    ] o.a.s.c.c.ZkStateReader Updated live nodes from ZooKeeper... (4) -> (5)
   [junit4]   2> 617568 INFO  (zkCallback-1077-thread-1) [    ] o.a.s.c.c.ZkStateReader Updated live nodes from ZooKeeper... (4) -> (5)
   [junit4]   2> 617568 INFO  (zkCallback-1060-thread-1) [    ] o.a.s.c.c.ZkStateReader Updated live nodes from ZooKeeper... (4) -> (5)
   [junit4]   2> 617617 INFO  (zkCallback-1108-thread-1) [    ] o.a.s.c.c.ZkStateReader Updated live nodes from ZooKeeper... (4) -> (5)
   [junit4]   2> 617617 INFO  (zkCallback-1117-thread-1) [    ] o.a.s.c.c.ZkStateReader Updated live nodes from ZooKeeper... (4) -> (5)
   [junit4]   2> 617633 INFO  (zkCallback-1127-thread-1) [    ] o.a.s.c.c.ZkStateReader Updated live nodes from ZooKeeper... (4) -> (5)
   [junit4]   2> 617651 INFO  (zkConnectionManagerCallback-1135-thread-1) [    ] o.a.s.c.c.ConnectionManager zkClient has connected
   [junit4]   2> 617652 INFO  (TEST-MoveReplicaHDFSTest.testNormalMove-seed#[6F0BB7BA17327D2A]) [n:127.0.0.1:33488_solr    ] o.a.s.c.c.ZkStateReader Updated live nodes from ZooKeeper... (0) -> (5)
   [junit4]   2> 617653 INFO  (TEST-MoveReplicaHDFSTest.testNormalMove-seed#[6F0BB7BA17327D2A]) [n:127.0.0.1:33488_solr    ] o.a.s.c.s.i.ZkClientClusterStateProvider Cluster at 127.0.0.1:49816/solr ready
   [junit4]   2> 617654 INFO  (TEST-MoveReplicaHDFSTest.testNormalMove-seed#[6F0BB7BA17327D2A]) [n:127.0.0.1:33488_solr    ] o.a.s.h.a.MetricsHistoryHandler No .system collection, keeping metrics history in memory.
   [junit4]   2> 617747 INFO  (TEST-MoveReplicaHDFSTest.testNormalMove-seed#[6F0BB7BA17327D2A]) [n:127.0.0.1:33488_solr    ] o.a.s.m.r.SolrJmxReporter JMX monitoring for 'solr_33488.solr.node' (registry 'solr.node') enabled at server: com.sun.jmx.mbeanserver.JmxMBeanServer@6fd52b4f
   [junit4]   2> 617873 INFO  (TEST-MoveReplicaHDFSTest.testNormalMove-seed#[6F0BB7BA17327D2A]) [n:127.0.0.1:33488_solr    ] o.a.s.m.r.SolrJmxReporter JMX monitoring for 'solr_33488.solr.jvm' (registry 'solr.jvm') enabled at server: com.sun.jmx.mbeanserver.JmxMBeanServer@6fd52b4f
   [junit4]   2> 617873 INFO  (TEST-MoveReplicaHDFSTest.testNormalMove-seed#[6F0BB7BA17327D2A]) [n:127.0.0.1:33488_solr    ] o.a.s.m.r.SolrJmxReporter JMX monitoring for 'solr_33488.solr.jetty' (registry 'solr.jetty') enabled at server: com.sun.jmx.mbeanserver.JmxMBeanServer@6fd52b4f
   [junit4]   2> 617958 INFO  (TEST-MoveReplicaHDFSTest.testNormalMove-seed#[6F0BB7BA17327D2A]) [n:127.0.0.1:33488_solr    ] o.a.s.c.CorePropertiesLocator Found 0 core definitions underneath /x1/jenkins/jenkins-slave/workspace/Lucene-Solr-Tests-7.x/solr/build/solr-core/test/J1/temp/solr.cloud.MoveReplicaHDFSTest_6F0BB7BA17327D2A-001/tempDir-001/node5/.
   [junit4]   2> 618406 INFO  (zkConnectionManagerCallback-1138-thread-1) [    ] o.a.s.c.c.ConnectionManager zkClient has connected
   [junit4]   2> 618408 INFO  (TEST-MoveReplicaHDFSTest.testNormalMove-seed#[6F0BB7BA17327D2A]) [    ] o.a.s.c.MoveReplicaTest total_jettys: 5
   [junit4]   2> 618422 INFO  (qtp1344074853-3396) [n:127.0.0.1:33123_solr    ] o.a.s.h.a.CollectionsHandler Invoked Collection Action :create with params collection.configName=conf1&maxShardsPerNode=2&autoAddReplicas=false&name=MoveReplicaHDFSTest_coll_false&nrtReplicas=2&action=CREATE&numShards=2&wt=javabin&version=2 and sendToOCPQueue=true
   [junit4]   2> 618440 INFO  (OverseerThreadFactory-1346-thread-2) [    ] o.a.s.c.a.c.CreateCollectionCmd Create collection MoveReplicaHDFSTest_coll_false
   [junit4]   2> 618555 INFO  (OverseerStateUpdate-74048321409581062-127.0.0.1:50553_solr-n_0000000000) [    ] o.a.s.c.o.SliceMutator createReplica() {
   [junit4]   2>   "operation":"ADDREPLICA",
   [junit4]   2>   "collection":"MoveReplicaHDFSTest_coll_false",
   [junit4]   2>   "shard":"shard1",
   [junit4]   2>   "core":"MoveReplicaHDFSTest_coll_false_shard1_replica_n1",
   [junit4]   2>   "state":"down",
   [junit4]   2>   "base_url":"https://127.0.0.1:45830/solr",
   [junit4]   2>   "type":"NRT",
   [junit4]   2>   "waitForFinalState":"false"} 
   [junit4]   2> 618560 INFO  (OverseerStateUpdate-74048321409581062-127.0.0.1:50553_solr-n_0000000000) [    ] o.a.s.c.o.SliceMutator createReplica() {
   [junit4]   2>   "operation":"ADDREPLICA",
   [junit4]   2>   "collection":"MoveReplicaHDFSTest_coll_false",
   [junit4]   2>   "shard":"shard1",
   [junit4]   2>   "core":"MoveReplicaHDFSTest_coll_false_shard1_replica_n2",
   [junit4]   2>   "state":"down",
   [junit4]   2>   "base_url":"https://127.0.0.1:33123/solr",
   [junit4]   2>   "type":"NRT",
   [junit4]   2>   "waitForFinalState":"false"} 
   [junit4]   2> 618566 INFO  (OverseerStateUpdate-74048321409581062-127.0.0.1:50553_solr-n_0000000000) [    ] o.a.s.c.o.SliceMutator createReplica() {
   [junit4]   2>   "operation":"ADDREPLICA",
   [junit4]   2>   "collection":"MoveReplicaHDFSTest_coll_false",
   [junit4]   2>   "shard":"shard2",
   [junit4]   2>   "core":"MoveReplicaHDFSTest_coll_false_shard2_replica_n4",
   [junit4]   2>   "state":"down",
   [junit4]   2>   "base_url":"https://127.0.0.1:33488/solr",
   [junit4]   2>   "type":"NRT",
   [junit4]   2>   "waitForFinalState":"false"} 
   [junit4]   2> 618570 INFO  (OverseerStateUpdate-74048321409581062-127.0.0.1:50553_solr-n_0000000000) [    ] o.a.s.c.o.SliceMutator createReplica() {
   [junit4]   2>   "operation":"ADDREPLICA",
   [junit4]   2>   "collection":"MoveReplicaHDFSTest_coll_false",
   [junit4]   2>   "shard":"shard2",
   [junit4]   2>   "core":"MoveReplicaHDFSTest_coll_false_shard2_replica_n6",
   [junit4]   2>   "state":"down",
   [junit4]   2>   "base_url":"https://127.0.0.1:40577/solr",
   [junit4]   2>   "type":"NRT",
   [junit4]   2>   "waitForFinalState":"false"} 
   [junit4]   2> 619045 INFO  (qtp1344074853-3401) [n:127.0.0.1:33123_solr    x:MoveReplicaHDFSTest_coll_false_shard1_replica_n2] o.a.s.h.a.CoreAdminOperation core create command qt=/admin/cores&coreNodeName=core_node5&collection.configName=conf1&newCollection=true&name=MoveReplicaHDFSTest_coll_false_shard1_replica_n2&action=CREATE&numShards=2&collection=MoveReplicaHDFSTest_coll_false&shard=shard1&wt=javabin&version=2&replicaType=NRT
   [junit4]   2> 619062 INFO  (qtp1410407902-3376) [n:127.0.0.1:45830_solr    x:MoveReplicaHDFSTest_coll_false_shard1_replica_n1] o.a.s.h.a.CoreAdminOperation core create command qt=/admin/cores&coreNodeName=core_node3&collection.configName=conf1&newCollection=true&name=MoveReplicaHDFSTest_coll_false_shard1_replica_n1&action=CREATE&numShards=2&collection=MoveReplicaHDFSTest_coll_false&shard=shard1&wt=javabin&version=2&replicaType=NRT
   [junit4]   2> 619063 INFO  (qtp1434994251-3683) [n:127.0.0.1:33488_solr    x:MoveReplicaHDFSTest_coll_false_shard2_replica_n4] o.a.s.h.a.CoreAdminOperation core create command qt=/admin/cores&coreNodeName=core_node7&collection.configName=conf1&newCollection=true&name=MoveReplicaHDFSTest_coll_false_shard2_replica_n4&action=CREATE&numShards=2&collection=MoveReplicaHDFSTest_coll_false&shard=shard2&wt=javabin&version=2&replicaType=NRT
   [junit4]   2> 619130 INFO  (qtp1523825838-3390) [n:127.0.0.1:40577_solr    x:MoveReplicaHDFSTest_coll_false_shard2_replica_n6] o.a.s.h.a.CoreAdminOperation core create command qt=/admin/cores&coreNodeName=core_node8&collection.configName=conf1&newCollection=true&name=MoveReplicaHDFSTest_coll_false_shard2_replica_n6&action=CREATE&numShards=2&collection=MoveReplicaHDFSTest_coll_false&shard=shard2&wt=javabin&version=2&replicaType=NRT
   [junit4]   2> 620089 INFO  (qtp1344074853-3401) [n:127.0.0.1:33123_solr c:MoveReplicaHDFSTest_coll_false s:shard1 r:core_node5 x:MoveReplicaHDFSTest_coll_false_shard1_replica_n2] o.a.s.c.SolrConfig Using Lucene MatchVersion: 7.5.0
   [junit4]   2> 620165 INFO  (qtp1344074853-3401) [n:127.0.0.1:33123_solr c:MoveReplicaHDFSTest_coll_false s:shard1 r:core_node5 x:MoveReplicaHDFSTest_coll_false_shard1_replica_n2] o.a.s.s.IndexSchema [MoveReplicaHDFSTest_coll_false_shard1_replica_n2] Schema name=minimal
   [junit4]   2> 620226 INFO  (qtp1410407902-3376) [n:127.0.0.1:45830_solr c:MoveReplicaHDFSTest_coll_false s:shard1 r:core_node3 x:MoveReplicaHDFSTest_coll_false_shard1_replica_n1] o.a.s.c.SolrConfig Using Lucene MatchVersion: 7.5.0
   [junit4]   2> 620233 INFO  (qtp1434994251-3683) [n:127.0.0.1:33488_solr c:MoveReplicaHDFSTest_coll_false s:shard2 r:core_node7 x:MoveReplicaHDFSTest_coll_false_shard2_replica_n4] o.a.s.c.SolrConfig Using Lucene MatchVersion: 7.5.0
   [junit4]   2> 620250 INFO  (qtp1523825838-3390) [n:127.0.0.1:40577_solr c:MoveReplicaHDFSTest_coll_false s:shard2 r:core_node8 x:MoveReplicaHDFSTest_coll_false_shard2_replica_n6] o.a.s.c.SolrConfig Using Lucene MatchVersion: 7.5.0
   [junit4]   2> 620260 INFO  (qtp1344074853-3401) [n:127.0.0.1:33123_solr c:MoveReplicaHDFSTest_coll_false s:shard1 r:core_node5 x:MoveReplicaHDFSTest_coll_false_shard1_replica_n2] o.a.s.s.IndexSchema Loaded schema minimal/1.1 with uniqueid field id
   [junit4]   2> 620260 INFO  (qtp1344074853-3401) [n:127.0.0.1:33123_solr c:MoveReplicaHDFSTest_coll_false s:shard1 r:core_node5 x:MoveReplicaHDFSTest_coll_false_shard1_replica_n2] o.a.s.c.CoreContainer Creating SolrCore 'MoveReplicaHDFSTest_coll_false_shard1_replica_n2' using configuration from collection MoveReplicaHDFSTest_coll_false, trusted=true
   [junit4]   2> 620261 INFO  (qtp1344074853-3401) [n:127.0.0.1:33123_solr c:MoveReplicaHDFSTest_coll_false s:shard1 r:core_node5 x:MoveReplicaHDFSTest_coll_false_shard1_replica_n2] o.a.s.m.r.SolrJmxReporter JMX monitoring for 'solr_33123.solr.core.MoveReplicaHDFSTest_coll_false.shard1.replica_n2' (registry 'solr.core.MoveReplicaHDFSTest_coll_false.shard1.replica_n2') enabled at server: com.sun.jmx.mbeanserver.JmxMBeanServer@6fd52b4f
   [junit4]   2> 620266 INFO  (qtp1523825838-3390) [n:127.0.0.1:40577_solr c:MoveReplicaHDFSTest_coll_false s:shard2 r:core_node8 x:MoveReplicaHDFSTest_coll_false_shard2_replica_n6] o.a.s.s.IndexSchema [MoveReplicaHDFSTest_coll_false_shard2_replica_n6] Schema name=minimal
   [junit4]   2> 620268 INFO  (qtp1523825838-3390) [n:127.0.0.1:40577_solr c:MoveReplicaHDFSTest_coll_false s:shard2 r:core_node8 x:MoveReplicaHDFSTest_coll_false_shard2_replica_n6] o.a.s.s.IndexSchema Loaded schema minimal/1.1 with uniqueid field id
   [junit4]   2> 620268 INFO  (qtp1523825838-3390) [n:127.0.0.1:40577_solr c:MoveReplicaHDFSTest_coll_false s:shard2 r:core_node8 x:MoveReplicaHDFSTest_coll_false_shard2_replica_n6] o.a.s.c.CoreContainer Creating SolrCore 'MoveReplicaHDFSTest_coll_false_shard2_replica_n6' using configuration from collection MoveReplicaHDFSTest_coll_false, trusted=true
   [junit4]   2> 620274 INFO  (qtp1523825838-3390) [n:127.0.0.1:40577_solr c:MoveReplicaHDFSTest_coll_false s:shard2 r:core_node8 x:MoveReplicaHDFSTest_coll_false_shard2_replica_n6] o.a.s.m.r.SolrJmxReporter JMX monitoring for 'solr_40577.solr.core.MoveReplicaHDFSTest_coll_false.shard2.replica_n6' (registry 'solr.core.MoveReplicaHDFSTest_coll_false.shard2.replica_n6') enabled at server: com.sun.jmx.mbeanserver.JmxMBeanServer@6fd52b4f
   [junit4]   2> 620458 INFO  (qtp1410407902-3376) [n:127.0.0.1:45830_solr c:MoveReplicaHDFSTest_coll_false s:shard1 r:core_node3 x:MoveReplicaHDFSTest_coll_false_shard1_replica_n1] o.a.s.s.IndexSchema [MoveReplicaHDFSTest_coll_false_shard1_replica_n1] Schema name=minimal
   [junit4]   2> 620462 INFO  (qtp1410407902-3376) [n:127.0.0.1:45830_solr c:MoveReplicaHDFSTest_coll_false s:shard1 r:core_node3 x:MoveReplicaHDFSTest_coll_false_shard1_replica_n1] o.a.s.s.IndexSchema Loaded schema minimal/1.1 with uniqueid field id
   [junit4]   2> 620462 INFO  (qtp1410407902-3376) [n:127.0.0.1:45830_solr c:MoveReplicaHDFSTest_coll_false s:shard1 r:core_node3 x:MoveReplicaHDFSTest_coll_false_shard1_replica_n1] o.a.s.c.CoreContainer Creating SolrCore 'MoveReplicaHDFSTest_coll_false_shard1_replica_n1' using configuration from collection MoveReplicaHDFSTest_coll_false, trusted=true
   [junit4]   2> 620463 INFO  (qtp1410407902-3376) [n:127.0.0.1:45830_solr c:MoveReplicaHDFSTest_coll_false s:shard1 r:core_node3 x:MoveReplicaHDFSTest_coll_false_shard1_replica_n1] o.a.s.m.r.SolrJmxReporter JMX monitoring for 'solr_45830.solr.core.MoveReplicaHDFSTest_coll_false.shard1.replica_n1' (registry 'solr.core.MoveReplicaHDFSTest_coll_false.shard1.replica_n1') enabled at server: com.sun.jmx.mbeanserver.JmxMBeanServer@6fd52b4f
   [junit4]   2> 620465 INFO  (qtp1434994251-3683) [n:127.0.0.1:33488_solr c:MoveReplicaHDFSTest_coll_false s:shard2 r:core_node7 x:MoveReplicaHDFSTest_coll_false_shard2_replica_n4] o.a.s.s.IndexSchema [MoveReplicaHDFSTest_coll_false_shard2_replica_n4] Schema name=minimal
   [junit4]   2> 620498 INFO  (qtp1523825838-3390) [n:127.0.0.1:40577_solr c:MoveReplicaHDFSTest_coll_false s:shard2 r:core_node8 x:MoveReplicaHDFSTest_coll_false_shard2_replica_n6] o.a.s.c.HdfsDirectoryFactory solr.hdfs.home=hdfs://localhost:60346/data
   [junit4]   2> 620498 INFO  (qtp1523825838-3390) [n:127.0.0.1:40577_solr c:MoveReplicaHDFSTest_coll_false s:shard2 r:core_node8 x:MoveReplicaHDFSTest_coll_false_shard2_replica_n6] o.a.s.c.HdfsDirectoryFactory Solr Kerberos Authentication disabled
   [junit4]   2> 620498 INFO  (qtp1523825838-3390) [n:127.0.0.1:40577_solr c:MoveReplicaHDFSTest_coll_false s:shard2 r:core_node8 x:MoveReplicaHDFSTest_coll_false_shard2_replica_n6] o.a.s.c.SolrCore solr.RecoveryStrategy.Builder
   [junit4]   2> 620499 INFO  (qtp1523825838-3390) [n:127.0.0.1:40577_solr c:MoveReplicaHDFSTest_coll_false s:shard2 r:core_node8 x:MoveReplicaHDFSTest_coll_false_shard2_replica_n6] o.a.s.c.SolrCore [[MoveReplicaHDFSTest_coll_false_shard2_replica_n6] ] Opening new SolrCore at [/x1/jenkins/jenkins-slave/workspace/Lucene-Solr-Tests-7.x/solr/build/solr-core/test/J1/temp/solr.cloud.MoveReplicaHDFSTest_6F0BB7BA17327D2A-001/tempDir-001/node1/MoveReplicaHDFSTest_coll_false_shard2_replica_n6], dataDir=[hdfs://localhost:60346/data/MoveReplicaHDFSTest_coll_false/core_node8/data/]
   [junit4]   2> 620501 INFO  (qtp1344074853-3401) [n:127.0.0.1:33123_solr c:MoveReplicaHDFSTest_coll_false s:shard1 r:core_node5 x:MoveReplicaHDFSTest_coll_false_shard1_replica_n2] o.a.s.c.HdfsDirectoryFactory solr.hdfs.home=hdfs://localhost:60346/data
   [junit4]   2> 620503 INFO  (qtp1344074853-3401) [n:127.0.0.1:33123_solr c:MoveReplicaHDFSTest_coll_false s:shard1 r:core_node5 x:MoveReplicaHDFSTest_coll_false_shard1_replica_n2] o.a.s.c.HdfsDirectoryFactory Solr Kerberos Authentication disabled
   [junit4]   2> 620503 INFO  (qtp1344074853-3401) [n:127.0.0.1:33123_solr c:MoveReplicaHDFSTest_coll_false s:shard1 r:core_node5 x:MoveReplicaHDFSTest_coll_false_shard1_replica_n2] o.a.s.c.SolrCore solr.RecoveryStrategy.Builder
   [junit4]   2> 620503 INFO  (qtp1344074853-3401) [n:127.0.0.1:33123_solr c:MoveReplicaHDFSTest_coll_false s:shard1 r:core_node5 x:MoveReplicaHDFSTest_coll_false_shard1_replica_n2] o.a.s.c.SolrCore [[MoveReplicaHDFSTest_coll_false_shard1_replica_n2] ] Opening new SolrCore at [/x1/jenkins/jenkins-slave/workspace/Lucene-Solr-Tests-7.x/solr/build/solr-core/test/J1/temp/solr.cloud.MoveReplicaHDFSTest_6F0BB7BA17327D2A-001/tempDir-001/node4/MoveReplicaHDFSTest_coll_false_shard1_replica_n2], dataDir=[hdfs://localhost:60346/data/MoveReplicaHDFSTest_coll_false/core_node5/data/]
   [junit4]   2> 620507 INFO  (qtp1344074853-3401) [n:127.0.0.1:33123_solr c:MoveReplicaHDFSTest_coll_false s:shard1 r:core_node5 x:MoveReplicaHDFSTest_coll_false_shard1_replica_n2] o.a.s.c.HdfsDirectoryFactory creating directory factory for path hdfs://localhost:60346/data/MoveReplicaHDFSTest_coll_false/core_node5/data/snapshot_metadata
   [junit4]   2> 620509 INFO  (qtp1410407902-3376) [n:127.0.0.1:45830_solr c:MoveReplicaHDFSTest_coll_false s:shard1 r:core_node3 x:MoveReplicaHDFSTest_coll_false_shard1_replica_n1] o.a.s.c.HdfsDirectoryFactory solr.hdfs.home=hdfs://localhost:60346/data
   [junit4]   2> 620509 INFO  (qtp1410407902-3376) [n:127.0.0.1:45830_solr c:MoveReplicaHDFSTest_coll_false s:shard1 r:core_node3 x:MoveReplicaHDFSTest_coll_false_shard1_replica_n1] o.a.s.c.HdfsDirectoryFactory Solr Kerberos Authentication disabled
   [junit4]   2> 620509 INFO  (qtp1410407902-3376) [n:127.0.0.1:45830_solr c:MoveReplicaHDFSTest_coll_false s:shard1 r:core_node3 x:MoveReplicaHDFSTest_coll_false_shard1_replica_n1] o.a.s.c.SolrCore solr.RecoveryStrategy.Builder
   [junit4]   2> 620509 INFO  (qtp1410407902-3376) [n:127.0.0.1:45830_solr c:MoveReplicaHDFSTest_coll_false s:shard1 r:core_node3 x:MoveReplicaHDFSTest_coll_false_shard1_replica_n1] o.a.s.c.SolrCore [[MoveReplicaHDFSTest_coll_false_shard1_replica_n1] ] Opening new SolrCore at [/x1/jenkins/jenkins-slave/workspace/Lucene-Solr-Tests-7.x/solr/build/solr-core/test/J1/temp/solr.cloud.MoveReplicaHDFSTest_6F0BB7BA17327D2A-001/tempDir-001/node2/MoveReplicaHDFSTest_coll_false_shard1_replica_n1], dataDir=[hdfs://localhost:60346/data/MoveReplicaHDFSTest_coll_false/core_node3/data/]
   [junit4]   2> 620511 INFO  (qtp1410407902-3376) [n:127.0.0.1:45830_solr c:MoveReplicaHDFSTest_coll_false s:shard1 r:core_node3 x:MoveReplicaHDFSTest_coll_false_shard1_replica_n1] o.a.s.c.HdfsDirectoryFactory creating directory factory for path hdfs://localhost:60346/data/MoveReplicaHDFSTest_coll_false/core_node3/data/snapshot_metadata
   [junit4]   2> 620514 INFO  (qtp1523825838-3390) [n:127.0.0.1:40577_solr c:MoveReplicaHDFSTest_coll_false s:shard2 r:core_node8 x:MoveReplicaHDFSTest_coll_false_shard2_replica_n6] o.a.s.c.HdfsDirectoryFactory creating directory factory for path hdfs://localhost:60346/data/MoveReplicaHDFSTest_coll_false/core_node8/data/snapshot_metadata
   [junit4]   2> 620523 INFO  (qtp1434994251-3683) [n:127.0.0.1:33488_solr c:MoveReplicaHDFSTest_coll_false s:shard2 r:core_node7 x:MoveReplicaHDFSTest_coll_false_shard2_replica_n4] o.a.s.s.IndexSchema Loaded schema minimal/1.1 with uniqueid field id
   [junit4]   2> 620523 INFO  (qtp1434994251-3683) [n:127.0.0.1:33488_solr c:MoveReplicaHDFSTest_coll_false s:shard2 r:core_node7 x:MoveReplicaHDFSTest_coll_false_shard2_replica_n4] o.a.s.c.CoreContainer Creating SolrCore 'MoveReplicaHDFSTest_coll_false_shard2_replica_n4' using configuration from collection MoveReplicaHDFSTest_coll_false, trusted=true
   [junit4]   2> 620523 INFO  (qtp1434994251-3683) [n:127.0.0.1:33488_solr c:MoveReplicaHDFSTest_coll_false s:shard2 r:core_node7 x:MoveReplicaHDFSTest_coll_false_shard2_replica_n4] o.a.s.m.r.SolrJmxReporter JMX monitoring for 'solr_33488.solr.core.MoveReplicaHDFSTest_coll_false.shard2.replica_n4' (registry 'solr.core.MoveReplicaHDFSTest_coll_false.shard2.replica_n4') enabled at server: com.sun.jmx.mbeanserver.JmxMBeanServer@6fd52b4f
   [junit4]   2> 620523 INFO  (qtp1434994251-3683) [n:127.0.0.1:33488_solr c:MoveReplicaHDFSTest_coll_false s:shard2 r:core_node7 x:MoveReplicaHDFSTest_coll_false_shard2_replica_n4] o.a.s.c.HdfsDirectoryFactory solr.hdfs.home=hdfs://localhost:60346/data
   [junit4]   2> 620524 INFO  (qtp1434994251-3683) [n:127.0.0.1:33488_solr c:MoveReplicaHDFSTest_coll_false s:shard2 r:core_node7 x:MoveReplicaHDFSTest_coll_false_shard2_replica_n4] o.a.s.c.HdfsDirectoryFactory Solr Kerberos Authentication disabled
   [junit4]   2> 620524 INFO  (qtp1434994251-3683) [n:127.0.0.1:33488_solr c:MoveReplicaHDFSTest_coll_false s:shard2 r:core_node7 x:MoveReplicaHDFSTest_coll_false_shard2_replica_n4] o.a.s.c.SolrCore solr.RecoveryStrategy.Builder
   [junit4]   2> 620524 INFO  (qtp1434994251-3683) [n:127.0.0.1:33488_solr c:MoveReplicaHDFSTest_coll_false s:shard2 r:core_node7 x:MoveReplicaHDFSTest_coll_false_shard2_replica_n4] o.a.s.c.SolrCore [[MoveReplicaHDFSTest_coll_false_shard2_replica_n4] ] Opening new SolrCore at [/x1/jenkins/jenkins-slave/workspace/Lucene-Solr-Tests-7.x/solr/build/solr-core/test/J1/temp/solr.cloud.MoveReplicaHDFSTest_6F0BB7BA17327D2A-001/tempDir-001/node5/MoveReplicaHDFSTest_coll_false_shard2_replica_n4], dataDir=[hdfs://localhost:60346/data/MoveReplicaHDFSTest_coll_false/core_node7/data/]
   [junit4]   2> 620542 INFO  (qtp1434994251-3683) [n:127.0.0.1:33488_solr c:MoveReplicaHDFSTest_coll_false s:shard2 r:core_node7 x:MoveReplicaHDFSTest_coll_false_shard2_replica_n4] o.a.s.c.HdfsDirectoryFactory creating directory factory for path hdfs://localhost:60346/data/MoveReplicaHDFSTest_coll_false/core_node7/data/snapshot_metadata
   [junit4]   2> 620930 INFO  (qtp1523825838-3390) [n:127.0.0.1:40577_solr c:MoveReplicaHDFSTest_coll_false s:shard2 r:core_node8 x:MoveReplicaHDFSTest_coll_false_shard2_replica_n6] o.a.s.c.HdfsDirectoryFactory creating directory factory for path hdfs://localhost:60346/data/MoveReplicaHDFSTest_coll_false/core_node8/data
   [junit4]   2> 620933 INFO  (qtp1344074853-3401) [n:127.0.0.1:33123_solr c:MoveReplicaHDFSTest_coll_false s:shard1 r:core_node5 x:MoveReplicaHDFSTest_coll_false_shard1_replica_n2] o.a.s.c.HdfsDirectoryFactory creating directory factory for path hdfs://localhost:60346/data/MoveReplicaHDFSTest_coll_false/core_node5/data
   [junit4]   2> 620937 INFO  (qtp1410407902-3376) [n:127.0.0.1:45830_solr c:MoveReplicaHDFSTest_coll_false s:shard1 r:core_node3 x:MoveReplicaHDFSTest_coll_false_shard1_replica_n1] o.a.s.c.HdfsDirectoryFactory creating directory factory for path hdfs://localhost:60346/data/MoveReplicaHDFSTest_coll_false/core_node3/data
   [junit4]   2> 620941 INFO  (qtp1434994251-3683) [n:127.0.0.1:33488_solr c:MoveReplicaHDFSTest_coll_false s:shard2 r:core_node7 x:MoveReplicaHDFSTest_coll_false_shard2_replica_n4] o.a.s.c.HdfsDirectoryFactory creating directory factory for path hdfs://localhost:60346/data/MoveReplicaHDFSTest_coll_false/core_node7/data
   [junit4]   2> 621261 INFO  (qtp1410407902-3376) [n:127.0.0.1:45830_solr c:MoveReplicaHDFSTest_coll_false s:shard1 r:core_node3 x:MoveReplicaHDFSTest_coll_false_shard1_replica_n1] o.a.s.c.HdfsDirectoryFactory creating directory factory for path hdfs://localhost:60346/data/MoveReplicaHDFSTest_coll_false/core_node3/data/index
   [junit4]   2> 621269 INFO  (qtp1523825838-3390) [n:127.0.0.1:40577_solr c:MoveReplicaHDFSTest_coll_false s:shard2 r:core_node8 x:MoveReplicaHDFSTest_coll_false_shard2_replica_n6] o.a.s.c.HdfsDirectoryFactory creating directory factory for path hdfs://localhost:60346/data/MoveReplicaHDFSTest_coll_false/core_node8/data/index
   [junit4]   2> 621275 INFO  (qtp1344074853-3401) [n:127.0.0.1:33123_solr c:MoveReplicaHDFSTest_coll_false s:shard1 r:core_node5 x:MoveReplicaHDFSTest_coll_false_shard1_replica_n2] o.a.s.c.HdfsDirectoryFactory creating directory factory for path hdfs://localhost:60346/data/MoveReplicaHDFSTest_coll_false/core_node5/data/index
   [junit4]   2> 621501 INFO  (qtp1434994251-3683) [n:127.0.0.1:33488_solr c:MoveReplicaHDFSTest_coll_false s:shard2 r:core_node7 x:MoveReplicaHDFSTest_coll_false_shard2_replica_n4] o.a.s.c.HdfsDirectoryFactory creating directory factory for path hdfs://localhost:60346/data/MoveReplicaHDFSTest_coll_false/core_node7/data/index
   [junit4]   2> 623715 INFO  (Block report processor) [    ] BlockStateChange BLOCK* addStoredBlock: blockMap updated: 127.0.0.1:37896 is added to blk_1073741828_1004{UCState=COMMITTED, truncateBlock=null, primaryNodeIndex=-1, replicas=[ReplicaUC[[DISK]DS-a22330df-594b-4225-a230-cba0d3ac5961:NORMAL:127.0.0.1:37896|RBW], ReplicaUC[[DISK]DS-7791a69e-2a67-4a78-a6af-8bbc11f00953:NORMAL:127.0.0.1:59507|RBW]]} size 69
   [junit4]   2> 623717 INFO  (Block report processor) [    ] BlockStateChange BLOCK* addStoredBlock: blockMap updated: 127.0.0.1:59507 is added to blk_1073741828_1004 size 69
   [junit4]   2> 623717 INFO  (Block report processor) [    ] BlockStateChange BLOCK* addStoredBlock: blockMap updated: 127.0.0.1:59507 is added to blk_1073741825_1001{UCState=COMMITTED, truncateBlock=null, primaryNodeIndex=-1, replicas=[ReplicaUC[[DISK]DS-a22330df-594b-4225-a230-cba0d3ac5961:NORMAL:127.0.0.1:37896|RBW], ReplicaUC[[DISK]DS-3cc1d437-de88-4476-929b-1530df5e8aa0:NORMAL:127.0.0.1:59507|RBW]]} size 69
   [junit4]   2> 623717 INFO  (Block report processor) [    ] BlockStateChange BLOCK* addStoredBlock: blockMap updated: 127.0.0.1:59507 is added to blk_1073741826_1002{UCState=COMMITTED, truncateBlock=null, primaryNodeIndex=-1, replicas=[ReplicaUC[[DISK]DS-a2f1fd22-8d2c-45aa-8c0e-1f2e209a2317:NORMAL:127.0.0.1:37896|RBW], ReplicaUC[[DISK]DS-3cc1d437-de88-4476-929b-1530df5e8aa0:NORMAL:127.0.0.1:59507|RBW]]} size 69
   [junit4]   2> 623718 INFO  (Block report processor) [    ] BlockStateChange BLOCK* addStoredBlock: blockMap updated: 127.0.0.1:59507 is added to blk_1073741827_1003{UCState=COMMITTED, truncateBlock=null, primaryNodeIndex=-1, replicas=[ReplicaUC[[DISK]DS-a2f1fd22-8d2c-45aa-8c0e-1f2e209a2317:NORMAL:127.0.0.1:37896|RBW], ReplicaUC[[DISK]DS-7791a69e-2a67-4a78-a6af-8bbc11f00953:NORMAL:127.0.0.1:59507|RBW]]} size 69
   [junit4]   2> 623718 INFO  (Block report processor) [    ] BlockStateChange BLOCK* addStoredBlock: blockMap updated: 127.0.0.1:37896 is added to blk_1073741825_1001 size 69
   [junit4]   2> 623718 INFO  (Block report processor) [    ] BlockStateChange BLOCK* addStoredBlock: blockMap updated: 127.0.0.1:37896 is added to blk_1073741826_1002 size 69
   [junit4]   2> 623718 INFO  (Block report processor) [    ] BlockStateChange BLOCK* addStoredBlock: blockMap updated: 127.0.0.1:37896 is added to blk_1073741827_1003 size 69
   [junit4]   2> 625572 INFO  (qtp1434994251-3683) [n:127.0.0.1:33488_solr c:MoveReplicaHDFSTest_coll_false s:shard2 r:core_node7 x:MoveReplicaHDFSTest_coll_false_shard2_replica_n4] o.a.s.u.UpdateHandler Using UpdateLog implementation: org.apache.solr.update.HdfsUpdateLog
   [junit4]   2> 625572 INFO  (qtp1434994251-3683) [n:127.0.0.1:33488_solr c:MoveReplicaHDFSTest_coll_false s:shard2 r:core_node7 x:MoveReplicaHDFSTest_coll_false_shard2_replica_n4] o.a.s.u.UpdateLog Initializing UpdateLog: dataDir=null defaultSyncLevel=FLUSH numRecordsToKeep=100 maxNumLogsToKeep=10 numVersionBuckets=65536
   [junit4]   2> 625572 INFO  (qtp1434994251-3683) [n:127.0.0.1:33488_solr c:MoveReplicaHDFSTest_coll_false s:shard2 r:core_node7 x:MoveReplicaHDFSTest_coll_false_shard2_replica_n4] o.a.s.u.HdfsUpdateLog Initializing HdfsUpdateLog: tlogDfsReplication=3
   [junit4]   2> 625627 INFO  (qtp1434994251-3683) [n:127.0.0.1:33488_solr c:MoveReplicaHDFSTest_coll_false s:shard2 r:core_node7 x:MoveReplicaHDFSTest_coll_false_shard2_replica_n4] o.a.s.u.CommitTracker Hard AutoCommit: disabled
   [junit4]   2> 625627 INFO  (qtp1434994251-3683) [n:127.0.0.1:33488_solr c:MoveReplicaHDFSTest_coll_false s:shard2 r:core_node7 x:MoveReplicaHDFSTest_coll_false_shard2_replica_n4] o.a.s.u.CommitTracker Soft AutoCommit: disabled
   [junit4]   2> 625641 INFO  (qtp1344074853-3401) [n:127.0.0.1:33123_solr c:MoveReplicaHDFSTest_coll_false s:shard1 r:core_node5 x:MoveReplicaHDFSTest_coll_false_shard1_replica_n2] o.a.s.u.UpdateHandler Using UpdateLog implementation: org.apache.solr.update.HdfsUpdateLog
   [junit4]   2> 625641 INFO  (qtp1344074853-3401) [n:127.0.0.1:33123_solr c:MoveReplicaHDFSTest_coll_false s:shard1 r:core_node5 x:MoveReplicaHDFSTest_coll_false_shard1_replica_n2] o.a.s.u.UpdateLog Initializing UpdateLog: dataDir=null defaultSyncLevel=FLUSH numRecordsToKeep=100 maxNumLogsToKeep=10 numVersionBuckets=65536
   [junit4]   2> 625641 INFO  (qtp1344074853-3401) [n:127.0.0.1:33123_solr c:MoveReplicaHDFSTest_coll_false s:shard1 r:core_node5 x:MoveReplicaHDFSTest_coll_false_shard1_replica_n2] o.a.s.u.HdfsUpdateLog Initializing HdfsUpdateLog: tlogDfsReplication=3
   [junit4]   2> 625688 INFO  (qtp1410407902-3376) [n:127.0.0.1:45830_solr c:MoveReplicaHDFSTest_coll_false s:shard1 r:core_node3 x:MoveReplicaHDFSTest_coll_false_shard1_replica_n1] o.a.s.u.UpdateHandler Using UpdateLog implementation: org.apache.solr.update.HdfsUpdateLog
   [junit4]   2> 625689 INFO  (qtp1410407902-3376) [n:127.0.0.1:45830_solr c:MoveReplicaHDFSTest_coll_false s:shard1 r:core_node3 x:MoveReplicaHDFSTest_coll_false_shard1_replica_n1] o.a.s.u.UpdateLog Initializing UpdateLog: dataDir=null defaultSyncLevel=FLUSH numRecordsToKeep=100 maxNumLogsToKeep=10 numVersionBuckets=65536
   [junit4]   2> 625689 INFO  (qtp1410407902-3376) [n:127.0.0.1:45830_solr c:MoveReplicaHDFSTest_coll_false s:shard1 r:core_node3 x:MoveReplicaHDFSTest_coll_false_shard1_replica_n1] o.a.s.u.HdfsUpdateLog Initializing HdfsUpdateLog: tlogDfsReplication=3
   [junit4]   2> 625741 INFO  (qtp1344074853-3401) [n:127.0.0.1:33123_solr c:MoveReplicaHDFSTest_coll_false s:shard1 r:core_node5 x:MoveReplicaHDFSTest_coll_false_shard1_replica_n2] o.a.s.u.CommitTracker Hard AutoCommit: disabled
   [junit4]   2> 625741 INFO  (qtp1344074853-3401) [n:127.0.0.1:33123_solr c:MoveReplicaHDFSTest_coll_false s:shard1 r:core_node5 x:MoveReplicaHDFSTest_coll_false_shard1_replica_n2] o.a.s.u.CommitTracker Soft AutoCommit: disabled
   [junit4]   2> 625760 INFO  (qtp1410407902-3376) [n:127.0.0.1:45830_solr c:MoveReplicaHDFSTest_coll_false s:shard1 r:core_node3 x:MoveReplicaHDFSTest_coll_false_shard1_replica_n1] o.a.s.u.CommitTracker Hard AutoCommit: disabled
   [junit4]   2> 625760 INFO  (qtp1410407902-3376) [n:127.0.0.1:45830_solr c:MoveReplicaHDFSTest_coll_false s:shard1 r:core_node3 x:MoveReplicaHDFSTest_coll_false_shard1_replica_n1] o.a.s.u.CommitTracker Soft AutoCommit: disabled
   [junit4]   2> 625813 INFO  (qtp1523825838-3390) [n:127.0.0.1:40577_solr c:MoveReplicaHDFSTest_coll_false s:shard2 r:core_node8 x:MoveReplicaHDFSTest_coll_false_shard2_replica_n6] o.a.s.u.UpdateHandler Using UpdateLog implementation: org.apache.solr.update.HdfsUpdateLog
   [junit4]   2> 625813 INFO  (qtp1523825838-3390) [n:127.0.0.1:40577_solr c:MoveReplicaHDFSTest_coll_false s:shard2 r:core_node8 x:MoveReplicaHDFSTest_coll_false_shard2_replica_n6] o.a.s.u.UpdateLog Initializing UpdateLog: dataDir=null defaultSyncLevel=FLUSH numRecordsToKeep=100 maxNumLogsToKeep=10 numVersionBuckets=65536
   [junit4]   2> 625813 INFO  (qtp1523825838-3390) [n:127.0.0.1:40577_solr c:MoveReplicaHDFSTest_coll_false s:shard2 r:core_node8 x:MoveReplicaHDFSTest_coll_false_shard2_replica_n6] o.a.s.u.HdfsUpdateLog Initializing HdfsUpdateLog: tlogDfsReplication=3
   [junit4]   2> 626370 INFO  (qtp1434994251-3683) [n:127.0.0.1:33488_solr c:MoveReplicaHDFSTest_coll_false s:shard2 r:core_node7 x:MoveReplicaHDFSTest_coll_false_shard2_replica_n4] o.a.s.s.SolrIndexSearcher Opening [Searcher@fefdc1[MoveReplicaHDFSTest_coll_false_shard2_replica_n4] main]
   [junit4]   2> 626371 INFO  (qtp1434994251-3683) [n:127.0.0.1:33488_solr c:MoveReplicaHDFSTest_coll_false s:shard2 r:core_node7 x:MoveReplicaHDFSTest_coll_false_shard2_replica_n4] o.a.s.r.ManagedResourceStorage Configured ZooKeeperStorageIO with znodeBase: /configs/conf1
   [junit4]   2> 626372 INFO  (qtp1434994251-3683) [n:127.0.0.1:33488_solr c:MoveReplicaHDFSTest_coll_false s:shard2 r:core_node7 x:MoveReplicaHDFSTest_coll_false_shard2_replica_n4] o.a.s.r.ManagedResourceStorage Loaded null at path _rest_managed.json using ZooKeeperStorageIO:path=/configs/conf1
   [junit4]   2> 626376 INFO  (qtp1434994251-3683) [n:127.0.0.1:33488_solr c:MoveReplicaHDFSTest_coll_false s:shard2 r:core_node7 x:MoveReplicaHDFSTest_coll_false_shard2_replica_n4] o.a.s.h.ReplicationHandler Commits will be reserved for 10000ms.
   [junit4]   2> 626427 INFO  (qtp1523825838-3390) [n:127.0.0.1:40577_solr c:MoveReplicaHDFSTest_coll_false s:shard2 r:core_node8 x:MoveReplicaHDFSTest_coll_false_shard2_replica_n6] o.a.s.u.CommitTracker Hard AutoCommit: disabled
   [junit4]   2> 626427 INFO  (qtp1523825838-3390) [n:127.0.0.1:40577_solr c:MoveReplicaHDFSTest_coll_false s:shard2 r:core_node8 x:MoveReplicaHDFSTest_coll_false_shard2_replica_n6] o.a.s.u.CommitTracker Soft AutoCommit: disabled
   [junit4]   2> 626430 INFO  (qtp1410407902-3376) [n:127.0.0.1:45830_solr c:MoveReplicaHDFSTest_coll_false s:shard1 r:core_node3 x:MoveReplicaHDFSTest_coll_false_shard1_replica_n1] o.a.s.s.SolrIndexSearcher Opening [Searcher@711ac6ea[MoveReplicaHDFSTest_coll_false_shard1_replica_n1] main]
   [junit4]   2> 626431 INFO  (qtp1344074853-3401) [n:127.0.0.1:33123_solr c:MoveReplicaHDFSTest_coll_false s:shard1 r:core_node5 x:MoveReplicaHDFSTest_coll_false_shard1_replica_n2] o.a.s.s.SolrIndexSearcher Opening [Searcher@abe98f4[MoveReplicaHDFSTest_coll_false_shard1_replica_n2] main]
   [junit4]   2> 626432 INFO  (qtp1344074853-3401) [n:127.0.0.1:33123_solr c:MoveReplicaHDFSTest_coll_false s:shard1 r:core_node5 x:MoveReplicaHDFSTest_coll_false_shard1_replica_n2] o.a.s.r.ManagedResourceStorage Configured ZooKeeperStorageIO with znodeBase: /configs/conf1
   [junit4]   2> 626433 INFO  (qtp1344074853-3401) [n:127.0.0.1:33123_solr c:MoveReplicaHDFSTest_coll_false s:shard1 r:core_node5 x:MoveReplicaHDFSTest_coll_false_shard1_replica_n2] o.a.s.r.ManagedResourceStorage Loaded null at path _rest_managed.json using ZooKeeperStorageIO:path=/configs/conf1
   [junit4]   2> 626434 INFO  (qtp1344074853-3401) [n:127.0.0.1:33123_solr c:MoveReplicaHDFSTest_coll_false s:shard1 r:core_node5 x:MoveReplicaHDFSTest_coll_false_shard1_replica_n2] o.a.s.h.ReplicationHandler Commits will be reserved for 10000ms.
   [junit4]   2> 626434 INFO  (qtp1344074853-3401) [n:127.0.0.1:33123_solr c:MoveReplicaHDFSTest_coll_false s:shard1 r:core_node5 x:MoveReplicaHDFSTest_coll_false_shard1_replica_n2] o.a.s.u.UpdateLog Could not find max version in index or recent updates, using new clock 1604451537197727744
   [junit4]   2> 626437 INFO  (qtp1410407902-3376) [n:127.0.0.1:45830_solr c:MoveReplicaHDFSTest_coll_false s:shard1 r:core_node3 x:MoveReplicaHDFSTest_coll_false_shard1_replica_n1] o.a.s.r.ManagedResourceStorage Configured ZooKeeperStorageIO with znodeBase: /configs/conf1
   [junit4]   2> 626437 INFO  (qtp1410407902-3376) [n:127.0.0.1:45830_solr c:MoveReplicaHDFSTest_coll_false s:shard1 r:core_node3 x:MoveReplicaHDFSTest_coll_false_shard1_replica_n1] o.a.s.r.ManagedResourceStorage Loaded null at path _rest_managed.json using ZooKeeperStorageIO:path=/configs/conf1
   [junit4]   2> 626438 INFO  (qtp1410407902-3376) [n:127.0.0.1:45830_solr c:MoveReplicaHDFSTest_coll_false s:shard1 r:core_node3 x:MoveReplicaHDFSTest_coll_false_shard1_replica_n1] o.a.s.h.ReplicationHandler Commits will be reserved for 10000ms.
   [junit4]   2> 626454 INFO  (searcherExecutor-1378-thread-1-processing-n:127.0.0.1:33488_solr x:MoveReplicaHDFSTest_coll_false_shard2_replica_n4 c:MoveReplicaHDFSTest_coll_false s:shard2 r:core_node7) [n:127.0.0.1:33488_solr c:MoveReplicaHDFSTest_coll_false s:shard2 r:core_node7 x:MoveReplicaHDFSTest_coll_false_shard2_replica_n4] o.a.s.c.SolrCore [MoveReplicaHDFSTest_coll_false_shard2_replica_n4] Registered new searcher Searcher@fefdc1[MoveReplicaHDFSTest_coll_false_shard2_replica_n4] main{ExitableDirectoryReader(UninvertingDirectoryReader())}
   [junit4]   2> 626454 INFO  (qtp1434994251-3683) [n:127.0.0.1:33488_solr c:MoveReplicaHDFSTest_coll_false s:shard2 r:core_node7 x:MoveReplicaHDFSTest_coll_false_shard2_replica_n4] o.a.s.u.UpdateLog Could not find max version in index or recent updates, using new clock 1604451537218699264
   [junit4]   2> 626480 INFO  (qtp1344074853-3401) [n:127.0.0.1:33123_solr c:MoveReplicaHDFSTest_coll_false s:shard1 r:core_node5 x:MoveReplicaHDFSTest_coll_false_shard1_replica_n2] o.a.s.c.ZkShardTerms Successful update of terms at /collections/MoveReplicaHDFSTest_coll_false/terms/shard1 to Terms{values={core_node5=0}, version=0}
   [junit4]   2> 626480 INFO  (qtp1434994251-3683) [n:127.0.0.1:33488_solr c:MoveReplicaHDFSTest_coll_false s:shard2 r:core_node7 x:MoveReplicaHDFSTest_coll_false_shard2_replica_n4] o.a.s.c.ZkShardTerms Successful update of terms at /collections/MoveReplicaHDFSTest_coll_false/terms/shard2 to Terms{values={core_node7=0}, version=0}
   [junit4]   2> 626489 INFO  (qtp1344074853-3401) [n:127.0.0.1:33123_solr c:MoveReplicaHDFSTest_coll_false s:shard1 r:core_node5 x:MoveReplicaHDFSTest_coll_false_shard1_replica_n2] o.a.s.c.ShardLeaderElectionContext Waiting until we see more replicas up for shard shard1: total=2 found=1 timeoutin=9999ms
   [junit4]   2> 626490 INFO  (qtp1434994251-3683) [n:127.0.0.1:33488_solr c:MoveReplicaHDFSTest_coll_false s:shard2 r:core_node7 x:MoveReplicaHDFSTest_coll_false_shard2_replica_n4] o.a.s.c.ShardLeaderElectionContext Waiting until we see more replicas up for shard shard2: total=2 found=1 timeoutin=9999ms
   [junit4]   2> 626500 INFO  (searcherExecutor-1375-thread-1-processing-n:127.0.0.1:33123_solr x:MoveReplicaHDFSTest_coll_false_shard1_replica_n2 c:MoveReplicaHDFSTest_coll_false s:shard1 r:core_node5) [n:127.0.0.1:33123_solr c:MoveReplicaHDFSTest_coll_false s:shard1 r:core_node5 x:MoveReplicaHDFSTest_coll_false_shard1_replica_n2] o.a.s.c.SolrCore [MoveReplicaHDFSTest_coll_false_shard1_replica_n2] Registered new searcher Searcher@abe98f4[MoveReplicaHDFSTest_coll_false_shard1_replica_n2] main{ExitableDirectoryReader(UninvertingDirectoryReader())}
   [junit4]   2> 626501 INFO  (searcherExecutor-1377-thread-1-processing-n:127.0.0.1:45830_solr x:MoveReplicaHDFSTest_coll_false_shard1_replica_n1 c:MoveReplicaHDFSTest_coll_false s:shard1 r:core_node3) [n:127.0.0.1:45830_solr c:MoveReplicaHDFSTest_coll_false s:shard1 r:core_node3 x:MoveReplicaHDFSTest_coll_false_shard1_replica_n1] o.a.s.c.SolrCore [MoveReplicaHDFSTest_coll_false_shard1_replica_n1] Registered new searcher Searcher@711ac6ea[MoveReplicaHDFSTest_coll_false_shard1_replica_n1] main{ExitableDirectoryReader(UninvertingDirectoryReader())}
   [junit4]   2> 626501 INFO  (qtp1410407902-3376) [n:127.0.0.1:45830_solr c:MoveReplicaHDFSTest_coll_false s:shard1 r:core_node3 x:MoveReplicaHDFSTest_coll_false_shard1_replica_n1] o.a.s.u.UpdateLog Could not find max version in index or recent updates, using new clock 1604451537267982336
   [junit4]   2> 626511 INFO  (qtp1523825838-3390) [n:127.0.0.1:40577_solr c:MoveReplicaHDFSTest_coll_false s:shard2 r:core_node8 x:MoveReplicaHDFSTest_coll_false_shard2_replica_n6] o.a.s.s.SolrIndexSearcher Opening [Searcher@655a9141[MoveReplicaHDFSTest_coll_false_shard2_replica_n6] main]
   [junit4]   2> 626514 INFO  (qtp1523825838-3390) [n:127.0.0.1:40577_solr c:MoveReplicaHDFSTest_coll_false s:shard2 r:core_node8 x:MoveReplicaHDFSTest_coll_false_shard2_replica_n6] o.a.s.r.ManagedResourceStorage Configured ZooKeeperStorageIO with znodeBase: /configs/conf1
   [junit4]   2> 626515 INFO  (qtp1410407902-3376) [n:127.0.0.1:45830_solr c:MoveReplicaHDFSTest_coll_false s:shard1 r:core_node3 x:MoveReplicaHDFSTest_coll_false_shard1_replica_n1] o.a.s.c.ZkShardTerms Successful update of terms at /collections/MoveReplicaHDFSTest_coll_false/terms/shard1 to Terms{values={core_node3=0, core_node5=0}, version=1}
   [junit4]   2> 626515 INFO  (qtp1523825838-3390) [n:127.0.0.1:40577_solr c:MoveReplicaHDFSTest_coll_false s:shard2 r:core_node8 x:MoveReplicaHDFSTest_coll_false_shard2_replica_n6] o.a.s.r.ManagedResourceStorage Loaded null at path _rest_managed.json using ZooKeeperStorageIO:path=/configs/conf1
   [junit4]   2> 626658 INFO  (qtp1523825838-3390) [n:127.0.0.1:40577_solr c:MoveReplicaHDFSTest_coll_false s:shard2 r:core_node8 x:MoveReplicaHDFSTest_coll_false_shard2_replica_n6] o.a.s.h.ReplicationHandler Commits will be reserved for 10000ms.
   [junit4]   2> 626659 INFO  (qtp1523825838-3390) [n:127.0.0.1:40577_solr c:MoveReplicaHDFSTest_coll_false s:shard2 r:core_node8 x:MoveReplicaHDFSTest_coll_false_shard2_replica_n6] o.a.s.u.UpdateLog Could not find max version in index or recent updates, using new clock 1604451537433657344
   [junit4]   2> 626706 INFO  (searcherExecutor-1376-thread-1-processing-n:127.0.0.1:40577_solr x:MoveReplicaHDFSTest_coll_false_shard2_replica_n6 c:MoveReplicaHDFSTest_coll_false s:shard2 r:core_node8) [n:127.0.0.1:40577_solr c:MoveReplicaHDFSTest_coll_false s:shard2 r:core_node8 x:MoveReplicaHDFSTest_coll_false_shard2_replica_n6] o.a.s.c.SolrCore [MoveReplicaHDFSTest_coll_false_shard2_replica_n6] Registered new searcher Searcher@655a9141[MoveReplicaHDFSTest_coll_false_shard2_replica_n6] main{ExitableDirectoryReader(UninvertingDirectoryReader())}
   [junit4]   2> 626710 INFO  (qtp1523825838-3390) [n:127.0.0.1:40577_solr c:MoveReplicaHDFSTest_coll_false s:shard2 r:core_node8 x:MoveReplicaHDFSTest_coll_false_shard2_replica_n6] o.a.s.c.ZkShardTerms Successful update of terms at /collections/MoveReplicaHDFSTest_coll_false/terms/shard2 to Terms{values={core_node7=0, core_node8=0}, version=1}
   [junit4]   2> 626991 INFO  (qtp1434994251-3683) [n:127.0.0.1:33488_solr c:MoveReplicaHDFSTest_coll_false s:shard2 r:core_node7 x:MoveReplicaHDFSTest_coll_false_shard2_replica_n4] o.a.s.c.ShardLeaderElectionContext Enough replicas found to continue.
   [junit4]   2> 626991 INFO  (qtp1434994251-3683) [n:127.0.0.1:33488_solr c:MoveReplicaHDFSTest_coll_false s:shard2 r:core_node7 x:MoveReplicaHDFSTest_coll_false_shard2_replica_n4] o.a.s.c.ShardLeaderElectionContext I may be the new leader - try and sync
   [junit4]   2> 626991 INFO  (qtp1434994251-3683) [n:127.0.0.1:33488_solr c:MoveReplicaHDFSTest_coll_false s:shard2 r:core_node7 x:MoveReplicaHDFSTest_coll_false_shard2_replica_n4] o.a.s.c.SyncStrategy Sync replicas to https://127.0.0.1:33488/solr/MoveReplicaHDFSTest_coll_false_shard2_replica_n4/
   [junit4]   2> 626992 INFO  (qtp1344074853-3401) [n:127.0.0.1:33123_solr c:MoveReplicaHDFSTest_coll_false s:shard1 r:core_node5 x:MoveReplicaHDFSTest_coll_false_shard1_replica_n2] o.a.s.c.ShardLeaderElectionContext Enough replicas found to continue.
   [junit4]   2> 626992 INFO  (qtp1344074853-3401) [n:127.0.0.1:33123_solr c:MoveReplicaHDFSTest_coll_false s:shard1 r:core_node5 x:MoveReplicaHDFSTest_coll_false_shard1_replica_n2] o.a.s.c.ShardLeaderElectionContext I may be the new leader - try and sync
   [junit4]   2> 626992 INFO  (qtp1344074853-3401) [n:127.0.0.1:33123_solr c:MoveReplicaHDFSTest_coll_false s:shard1 r:core_node5 x:MoveReplicaHDFSTest_coll_false_shard1_replica_n2] o.a.s.c.SyncStrategy Sync replicas to https://127.0.0.1:33123/solr/MoveReplicaHDFSTest_coll_false_shard1_replica_n2/
   [junit4]   2> 626992 INFO  (qtp1434994251-3683) [n:127.0.0.1:33488_solr c:MoveReplicaHDFSTest_coll_false s:shard2 r:core_node7 x:MoveReplicaHDFSTest_coll_false_shard2_replica_n4] o.a.s.u.PeerSync PeerSync: core=MoveReplicaHDFSTest_coll_false_shard2_replica_n4 url=https://127.0.0.1:33488/solr START replicas=[https://127.0.0.1:40577/solr/MoveReplicaHDFSTest_coll_false_shard2_replica_n6/] nUpdates=100
   [junit4]   2> 626994 INFO  (qtp1344074853-3401) [n:127.0.0.1:33123_solr c:MoveReplicaHDFSTest_coll_false s:shard1 r:core_node5 x:MoveReplicaHDFSTest_coll_false_shard1_replica_n2] o.a.s.u.PeerSync PeerSync: core=MoveReplicaHDFSTest_coll_false_shard1_replica_n2 url=https://127.0.0.1:33123/solr START replicas=[https://127.0.0.1:45830/solr/MoveReplicaHDFSTest_coll_false_shard1_replica_n1/] nUpdates=100
   [junit4]   2> 626998 INFO  (qtp1434994251-3683) [n:127.0.0.1:33488_solr c:MoveReplicaHDFSTest_coll_false s:shard2 r:core_node7 x:MoveReplicaHDFSTest_coll_false_shard2_replica_n4] o.a.s.u.PeerSync PeerSync: core=MoveReplicaHDFSTest_coll_false_shard2_replica_n4 url=https://127.0.0.1:33488/solr DONE.  We have no versions.  sync failed.
   [junit4]   2> 627007 INFO  (qtp1344074853-3401) [n:127.0.0.1:33123_solr c:MoveReplicaHDFSTest_coll_false s:shard1 r:core_node5 x:MoveReplicaHDFSTest_coll_false_shard1_replica_n2] o.a.s.u.PeerSync PeerSync: core=MoveReplicaHDFSTest_coll_false_shard1_replica_n2 url=https://127.0.0.1:33123/solr DONE.  We have no versions.  sync failed.
   [junit4]   2> 627051 INFO  (qtp1523825838-3393) [n:127.0.0.1:40577_solr c:MoveReplicaHDFSTest_coll_false s:shard2 r:core_node8 x:MoveReplicaHDFSTest_coll_false_shard2_replica_n6] o.a.s.c.S.Request [MoveReplicaHDFSTest_coll_false_shard2_replica_n6]  webapp=/solr path=/get params={distrib=false&qt=/get&fingerprint=false&getVersions=100&wt=javabin&version=2} status=0 QTime=2
   [junit4]   2> 627052 INFO  (qtp1434994251-3683) [n:127.0.0.1:33488_solr c:MoveReplicaHDFSTest_coll_false s:shard2 r:core_node7 x:MoveReplicaHDFSTest_coll_false_shard2_replica_n4] o.a.s.c.SyncStrategy Leader's attempt to sync with shard failed, moving to the next candidate
   [junit4]   2> 627052 INFO  (qtp1434994251-3683) [n:127.0.0.1:33488_solr c:MoveReplicaHDFSTest_coll_false s:shard2 r:core_node7 x:MoveReplicaHDFSTest_coll_false_shard2_replica_n4] o.a.s.c.ShardLeaderElectionContext We failed sync, but we have no versions - we can't sync in that case - we were active before, so become leader anyway
   [junit4]   2> 627052 INFO  (qtp1434994251-3683) [n:127.0.0.1:33488_solr c:MoveReplicaHDFSTest_coll_false s:shard2 r:core_node7 x:MoveReplicaHDFSTest_coll_false_shard2_replica_n4] o.a.s.c.ShardLeaderElectionContext Found all replicas participating in election, clear LIR
   [junit4]   2> 627062 INFO  (qtp1434994251-3683) [n:127.0.0.1:33488_solr c:MoveReplicaHDFSTest_coll_false s:shard2 r:core_node7 x:MoveReplicaHDFSTest_coll_false_shard2_replica_n4] o.a.s.c.ShardLeaderElectionContext I am the new leader: https://127.0.0.1:33488/solr/MoveReplicaHDFSTest_coll_false_shard2_replica_n4/ shard2
   [junit4]   2> 627070 INFO  (qtp1410407902-3381) [n:127.0.0.1:45830_solr c:MoveReplicaHDFSTest_coll_false s:shard1 r:core_node3 x:MoveReplicaHDFSTest_coll_false_shard1_replica_n1] o.a.s.c.S.Request [MoveReplicaHDFSTest_coll_false_shard1_replica_n1]  webapp=/solr path=/get params={distrib=false&qt=/get&fingerprint=false&getVersions=100&wt=javabin&version=2} status=0 QTime=18
   [junit4]   2> 627071 INFO  (qtp1344074853-3401) [n:127.0.0.1:33123_solr c:MoveReplicaHDFSTest_coll_false s:shard1 r:core_node5 x:MoveReplicaHDFSTest_coll_false_shard1_replica_n2] o.a.s.c.SyncStrategy Leader's attempt to sync with shard failed, moving to the next candidate
   [junit4]   2> 627071 INFO  (qtp1344074853-3401) [n:127.0.0.1:33123_solr c:MoveReplicaHDFSTest_coll_false s:shard1 r:core_node5 x:MoveReplicaHDFSTest_coll_false_shard1_replica_n2] o.a.s.c.ShardLeaderElectionContext We failed sync, but we have no versions - we can't sync in that case - we were active before, so become leader anyway
   [junit4]   2> 627071 INFO  (qtp1344074853-3401) [n:127.0.0.1:33123_solr c:MoveReplicaHDFSTest_coll_false s:shard1 r:core_node5 x:MoveReplicaHDFSTest_coll_false_shard1_replica_n2] o.a.s.c.ShardLeaderElectionContext Found all replicas participating in election, clear LIR
   [junit4]   2> 627075 INFO  (qtp1344074853-3401) [n:127.0.0.1:33123_solr c:MoveReplicaHDFSTest_coll_false s:shard1 r:core_node5 x:MoveReplicaHDFSTest_coll_false_shard1_replica_n2] o.a.s.c.ShardLeaderElectionContext I am the new leader: https://127.0.0.1:33123/solr/MoveReplicaHDFSTest_coll_false_shard1_replica_n2/ shard1
   [junit4]   2> 627179 INFO  (qtp1344074853-3401) [n:127.0.0.1:33123_solr c:MoveReplicaHDFSTest_coll_false s:shard1 r:core_node5 x:MoveReplicaHDFSTest_coll_false_shard1_replica_n2] o.a.s.c.ZkController I am the leader, no recovery necessary
   [junit4]   2> 627182 INFO  (qtp1344074853-3401) [n:127.0.0.1:33123_solr c:MoveReplicaHDFSTest_coll_false s:shard1 r:core_node5 x:MoveReplicaHDFSTest_coll_false_shard1_replica_n2] o.a.s.s.HttpSolrCall [admin] webapp=null path=/admin/cores params={qt=/admin/cores&coreNodeName=core_node5&collection.configName=conf1&newCollection=true&name=MoveReplicaHDFSTest_coll_false_shard1_replica_n2&action=CREATE&numShards=2&collection=MoveReplicaHDFSTest_coll_false&shard=shard1&wt=javabin&version=2&replicaType=NRT} status=0 QTime=8136
   [junit4]   2> 627215 INFO  (qtp1434994251-3683) [n:127.0.0.1:33488_solr c:MoveReplicaHDFSTest_coll_false s:shard2 r:core_node7 x:MoveReplicaHDFSTest_coll_false_shard2_replica_n4] o.a.s.c.ZkController I am the leader, no recovery necessary
   [junit4]   2> 627219 INFO  (qtp1434994251-3683) [n:127.0.0.1:33488_solr c:MoveReplicaHDFSTest_coll_false s:shard2 r:core_node7 x:MoveReplicaHDFSTest_coll_false_shard2_replica_n4] o.a.s.s.HttpSolrCall [admin] webapp=null path=/admin/cores params={qt=/admin/cores&coreNodeName=core_node7&collection.configName=conf1&newCollection=true&name=MoveReplicaHDFSTest_coll_false_shard2_replica_n4&action=CREATE&numShards=2&collection=MoveReplicaHDFSTest_coll_false&shard=shard2&wt=javabin&version=2&replicaType=NRT} status=0 QTime=8155
   [junit4]   2> 627422 INFO  (zkCallback-1077-thread-1) [    ] o.a.s.c.c.ZkStateReader A cluster state change: [WatchedEvent state:SyncConnected type:NodeDataChanged path:/collections/MoveReplicaHDFSTest_coll_false/state.json] for collection [MoveReplicaHDFSTest_coll_false] has occurred - updating... (live nodes size: [5])
   [junit4]   2> 627423 INFO  (zkCallback-1127-thread-1) [    ] o.a.s.c.c.ZkStateReader A cluster state change: [WatchedEvent state:SyncConnected type:NodeDataChanged path:/collections/MoveReplicaHDFSTest_coll_false/state.json] for collection [MoveReplicaHDFSTest_coll_false] has occurred - updating... (live nodes size: [5])
   [junit4]   2> 627722 INFO  (qtp1410407902-3376) [n:127.0.0.1:45830_solr c:MoveRepl

[...truncated too long message...]

y-configure:
[ivy:configure] :: loading settings :: file = /x1/jenkins/jenkins-slave/workspace/Lucene-Solr-Tests-7.x/lucene/top-level-ivy-settings.xml

resolve:

ivy-availability-check:
[loadresource] Do not set property disallowed.ivy.jars.list as its length is 0.

-ivy-fail-disallowed-ivy-version:

ivy-fail:

ivy-configure:
[ivy:configure] :: loading settings :: file = /x1/jenkins/jenkins-slave/workspace/Lucene-Solr-Tests-7.x/lucene/top-level-ivy-settings.xml

resolve:

ivy-availability-check:
[loadresource] Do not set property disallowed.ivy.jars.list as its length is 0.

-ivy-fail-disallowed-ivy-version:

ivy-fail:

ivy-configure:
[ivy:configure] :: loading settings :: file = /x1/jenkins/jenkins-slave/workspace/Lucene-Solr-Tests-7.x/lucene/top-level-ivy-settings.xml

resolve:

ivy-availability-check:
[loadresource] Do not set property disallowed.ivy.jars.list as its length is 0.

-ivy-fail-disallowed-ivy-version:

ivy-fail:

ivy-configure:
[ivy:configure] :: loading settings :: file = /x1/jenkins/jenkins-slave/workspace/Lucene-Solr-Tests-7.x/lucene/top-level-ivy-settings.xml

resolve:

ivy-availability-check:
[loadresource] Do not set property disallowed.ivy.jars.list as its length is 0.

-ivy-fail-disallowed-ivy-version:

ivy-fail:

ivy-configure:
[ivy:configure] :: loading settings :: file = /x1/jenkins/jenkins-slave/workspace/Lucene-Solr-Tests-7.x/lucene/top-level-ivy-settings.xml

resolve:

jar-checksums:
    [mkdir] Created dir: /x1/jenkins/jenkins-slave/workspace/Lucene-Solr-Tests-7.x/lucene/null73793279
     [copy] Copying 39 files to /x1/jenkins/jenkins-slave/workspace/Lucene-Solr-Tests-7.x/lucene/null73793279
   [delete] Deleting directory /x1/jenkins/jenkins-slave/workspace/Lucene-Solr-Tests-7.x/lucene/null73793279

resolve-example:

ivy-availability-check:
[loadresource] Do not set property disallowed.ivy.jars.list as its length is 0.

-ivy-fail-disallowed-ivy-version:

ivy-fail:

ivy-configure:
[ivy:configure] :: loading settings :: file = /x1/jenkins/jenkins-slave/workspace/Lucene-Solr-Tests-7.x/lucene/top-level-ivy-settings.xml

resolve:

resolve-server:

ivy-availability-check:
[loadresource] Do not set property disallowed.ivy.jars.list as its length is 0.

-ivy-fail-disallowed-ivy-version:

ivy-fail:

ivy-fail:

ivy-configure:
[ivy:configure] :: loading settings :: file = /x1/jenkins/jenkins-slave/workspace/Lucene-Solr-Tests-7.x/lucene/top-level-ivy-settings.xml

resolve:

resolve:

ivy-availability-check:
[loadresource] Do not set property disallowed.ivy.jars.list as its length is 0.

-ivy-fail-disallowed-ivy-version:

ivy-fail:

ivy-fail:

ivy-configure:
[ivy:configure] :: loading settings :: file = /x1/jenkins/jenkins-slave/workspace/Lucene-Solr-Tests-7.x/lucene/top-level-ivy-settings.xml

resolve:

ivy-availability-check:
[loadresource] Do not set property disallowed.ivy.jars.list as its length is 0.

-ivy-fail-disallowed-ivy-version:

ivy-fail:

ivy-fail:

ivy-configure:
[ivy:configure] :: loading settings :: file = /x1/jenkins/jenkins-slave/workspace/Lucene-Solr-Tests-7.x/lucene/top-level-ivy-settings.xml

resolve:

ivy-availability-check:
[loadresource] Do not set property disallowed.ivy.jars.list as its length is 0.

-ivy-fail-disallowed-ivy-version:

ivy-fail:

ivy-configure:
[ivy:configure] :: loading settings :: file = /x1/jenkins/jenkins-slave/workspace/Lucene-Solr-Tests-7.x/lucene/top-level-ivy-settings.xml

resolve:

ivy-availability-check:
[loadresource] Do not set property disallowed.ivy.jars.list as its length is 0.

-ivy-fail-disallowed-ivy-version:

ivy-fail:

ivy-fail:

ivy-configure:
[ivy:configure] :: loading settings :: file = /x1/jenkins/jenkins-slave/workspace/Lucene-Solr-Tests-7.x/lucene/top-level-ivy-settings.xml

resolve:

ivy-availability-check:
[loadresource] Do not set property disallowed.ivy.jars.list as its length is 0.

-ivy-fail-disallowed-ivy-version:

ivy-fail:

ivy-configure:
[ivy:configure] :: loading settings :: file = /x1/jenkins/jenkins-slave/workspace/Lucene-Solr-Tests-7.x/lucene/top-level-ivy-settings.xml

resolve:

ivy-availability-check:
[loadresource] Do not set property disallowed.ivy.jars.list as its length is 0.

-ivy-fail-disallowed-ivy-version:

ivy-fail:

ivy-fail:

ivy-configure:
[ivy:configure] :: loading settings :: file = /x1/jenkins/jenkins-slave/workspace/Lucene-Solr-Tests-7.x/lucene/top-level-ivy-settings.xml

resolve:

ivy-availability-check:
[loadresource] Do not set property disallowed.ivy.jars.list as its length is 0.

-ivy-fail-disallowed-ivy-version:

ivy-fail:

ivy-fail:

ivy-configure:
[ivy:configure] :: loading settings :: file = /x1/jenkins/jenkins-slave/workspace/Lucene-Solr-Tests-7.x/lucene/top-level-ivy-settings.xml

resolve:

ivy-availability-check:
[loadresource] Do not set property disallowed.ivy.jars.list as its length is 0.

-ivy-fail-disallowed-ivy-version:

ivy-fail:

ivy-fail:

ivy-configure:
[ivy:configure] :: loading settings :: file = /x1/jenkins/jenkins-slave/workspace/Lucene-Solr-Tests-7.x/lucene/top-level-ivy-settings.xml

resolve:

ivy-availability-check:
[loadresource] Do not set property disallowed.ivy.jars.list as its length is 0.

-ivy-fail-disallowed-ivy-version:

ivy-fail:

ivy-fail:

ivy-configure:
[ivy:configure] :: loading settings :: file = /x1/jenkins/jenkins-slave/workspace/Lucene-Solr-Tests-7.x/lucene/top-level-ivy-settings.xml

resolve:

ivy-availability-check:
[loadresource] Do not set property disallowed.ivy.jars.list as its length is 0.

-ivy-fail-disallowed-ivy-version:

ivy-fail:

ivy-fail:

ivy-configure:
[ivy:configure] :: loading settings :: file = /x1/jenkins/jenkins-slave/workspace/Lucene-Solr-Tests-7.x/lucene/top-level-ivy-settings.xml

resolve:

ivy-availability-check:
[loadresource] Do not set property disallowed.ivy.jars.list as its length is 0.

-ivy-fail-disallowed-ivy-version:

ivy-fail:

ivy-fail:

ivy-configure:
[ivy:configure] :: loading settings :: file = /x1/jenkins/jenkins-slave/workspace/Lucene-Solr-Tests-7.x/lucene/top-level-ivy-settings.xml

resolve:

ivy-availability-check:
[loadresource] Do not set property disallowed.ivy.jars.list as its length is 0.

-ivy-fail-disallowed-ivy-version:

ivy-fail:

ivy-fail:

ivy-configure:
[ivy:configure] :: loading settings :: file = /x1/jenkins/jenkins-slave/workspace/Lucene-Solr-Tests-7.x/lucene/top-level-ivy-settings.xml

resolve:

ivy-availability-check:
[loadresource] Do not set property disallowed.ivy.jars.list as its length is 0.

-ivy-fail-disallowed-ivy-version:

ivy-fail:

ivy-fail:

ivy-configure:
[ivy:configure] :: loading settings :: file = /x1/jenkins/jenkins-slave/workspace/Lucene-Solr-Tests-7.x/lucene/top-level-ivy-settings.xml

resolve:

ivy-availability-check:
[loadresource] Do not set property disallowed.ivy.jars.list as its length is 0.

-ivy-fail-disallowed-ivy-version:

ivy-fail:

ivy-fail:

ivy-configure:
[ivy:configure] :: loading settings :: file = /x1/jenkins/jenkins-slave/workspace/Lucene-Solr-Tests-7.x/lucene/top-level-ivy-settings.xml

resolve:

ivy-availability-check:
[loadresource] Do not set property disallowed.ivy.jars.list as its length is 0.

-ivy-fail-disallowed-ivy-version:

ivy-fail:

ivy-fail:

ivy-configure:
[ivy:configure] :: loading settings :: file = /x1/jenkins/jenkins-slave/workspace/Lucene-Solr-Tests-7.x/lucene/top-level-ivy-settings.xml

resolve:

ivy-availability-check:
[loadresource] Do not set property disallowed.ivy.jars.list as its length is 0.

-ivy-fail-disallowed-ivy-version:

ivy-fail:

ivy-fail:

ivy-configure:
[ivy:configure] :: loading settings :: file = /x1/jenkins/jenkins-slave/workspace/Lucene-Solr-Tests-7.x/lucene/top-level-ivy-settings.xml

resolve:

jar-checksums:
    [mkdir] Created dir: /x1/jenkins/jenkins-slave/workspace/Lucene-Solr-Tests-7.x/solr/null1355861237
     [copy] Copying 247 files to /x1/jenkins/jenkins-slave/workspace/Lucene-Solr-Tests-7.x/solr/null1355861237
   [delete] Deleting directory /x1/jenkins/jenkins-slave/workspace/Lucene-Solr-Tests-7.x/solr/null1355861237

check-working-copy:
[ivy:cachepath] :: resolving dependencies :: org.eclipse.jgit#org.eclipse.jgit-caller;working
[ivy:cachepath] 	confs: [default]
[ivy:cachepath] 	found org.eclipse.jgit#org.eclipse.jgit;4.6.0.201612231935-r in public
[ivy:cachepath] 	found com.jcraft#jsch;0.1.53 in public
[ivy:cachepath] 	found com.googlecode.javaewah#JavaEWAH;1.1.6 in public
[ivy:cachepath] 	found org.apache.httpcomponents#httpclient;4.3.6 in public
[ivy:cachepath] 	found org.apache.httpcomponents#httpcore;4.3.3 in public
[ivy:cachepath] 	found commons-logging#commons-logging;1.1.3 in public
[ivy:cachepath] 	found commons-codec#commons-codec;1.6 in public
[ivy:cachepath] 	found org.slf4j#slf4j-api;1.7.2 in public
[ivy:cachepath] :: resolution report :: resolve 33ms :: artifacts dl 1ms
	---------------------------------------------------------------------
	|                  |            modules            ||   artifacts   |
	|       conf       | number| search|dwnlded|evicted|| number|dwnlded|
	---------------------------------------------------------------------
	|      default     |   8   |   0   |   0   |   0   ||   8   |   0   |
	---------------------------------------------------------------------
[wc-checker] Initializing working copy...
[wc-checker] SLF4J: Failed to load class "org.slf4j.impl.StaticLoggerBinder".
[wc-checker] SLF4J: Defaulting to no-operation (NOP) logger implementation
[wc-checker] SLF4J: See http://www.slf4j.org/codes.html#StaticLoggerBinder for further details.
[wc-checker] Checking working copy status...

-jenkins-base:

BUILD SUCCESSFUL
Total time: 153 minutes 41 seconds
Archiving artifacts
WARN: No artifacts found that match the file pattern "**/*.events,heapdumps/**,**/hs_err_pid*". Configuration error?
WARN: java.lang.InterruptedException: no matches found within 10000
Recording test results
Build step 'Publish JUnit test result report' changed build result to UNSTABLE
Email was triggered for: Unstable (Test Failures)
Sending email for trigger: Unstable (Test Failures)

[JENKINS] Lucene-Solr-Tests-7.x - Build # 655 - Still Unstable

Posted by Apache Jenkins Server <je...@builds.apache.org>.
Build: https://builds.apache.org/job/Lucene-Solr-Tests-7.x/655/

1 tests failed.
FAILED:  org.apache.solr.metrics.rrd.SolrRrdBackendFactoryTest.testBasic

Error Message:
{} expected:<1> but was:<0>

Stack Trace:
java.lang.AssertionError: {} expected:<1> but was:<0>
	at __randomizedtesting.SeedInfo.seed([7FFE4C7F3C3189ED:D404516AE3ED0FC3]:0)
	at org.junit.Assert.fail(Assert.java:93)
	at org.junit.Assert.failNotEquals(Assert.java:647)
	at org.junit.Assert.assertEquals(Assert.java:128)
	at org.junit.Assert.assertEquals(Assert.java:472)
	at org.apache.solr.metrics.rrd.SolrRrdBackendFactoryTest.testBasic(SolrRrdBackendFactoryTest.java:90)
	at sun.reflect.NativeMethodAccessorImpl.invoke0(Native Method)
	at sun.reflect.NativeMethodAccessorImpl.invoke(NativeMethodAccessorImpl.java:62)
	at sun.reflect.DelegatingMethodAccessorImpl.invoke(DelegatingMethodAccessorImpl.java:43)
	at java.lang.reflect.Method.invoke(Method.java:498)
	at com.carrotsearch.randomizedtesting.RandomizedRunner.invoke(RandomizedRunner.java:1737)
	at com.carrotsearch.randomizedtesting.RandomizedRunner$8.evaluate(RandomizedRunner.java:934)
	at com.carrotsearch.randomizedtesting.RandomizedRunner$9.evaluate(RandomizedRunner.java:970)
	at com.carrotsearch.randomizedtesting.RandomizedRunner$10.evaluate(RandomizedRunner.java:984)
	at com.carrotsearch.randomizedtesting.rules.SystemPropertiesRestoreRule$1.evaluate(SystemPropertiesRestoreRule.java:57)
	at org.apache.lucene.util.TestRuleSetupTeardownChained$1.evaluate(TestRuleSetupTeardownChained.java:49)
	at org.apache.lucene.util.AbstractBeforeAfterRule$1.evaluate(AbstractBeforeAfterRule.java:45)
	at org.apache.lucene.util.TestRuleThreadAndTestName$1.evaluate(TestRuleThreadAndTestName.java:48)
	at org.apache.lucene.util.TestRuleIgnoreAfterMaxFailures$1.evaluate(TestRuleIgnoreAfterMaxFailures.java:64)
	at org.apache.lucene.util.TestRuleMarkFailure$1.evaluate(TestRuleMarkFailure.java:47)
	at com.carrotsearch.randomizedtesting.rules.StatementAdapter.evaluate(StatementAdapter.java:36)
	at com.carrotsearch.randomizedtesting.ThreadLeakControl$StatementRunner.run(ThreadLeakControl.java:368)
	at com.carrotsearch.randomizedtesting.ThreadLeakControl.forkTimeoutingTask(ThreadLeakControl.java:817)
	at com.carrotsearch.randomizedtesting.ThreadLeakControl$3.evaluate(ThreadLeakControl.java:468)
	at com.carrotsearch.randomizedtesting.RandomizedRunner.runSingleTest(RandomizedRunner.java:943)
	at com.carrotsearch.randomizedtesting.RandomizedRunner$5.evaluate(RandomizedRunner.java:829)
	at com.carrotsearch.randomizedtesting.RandomizedRunner$6.evaluate(RandomizedRunner.java:879)
	at com.carrotsearch.randomizedtesting.RandomizedRunner$7.evaluate(RandomizedRunner.java:890)
	at com.carrotsearch.randomizedtesting.rules.StatementAdapter.evaluate(StatementAdapter.java:36)
	at com.carrotsearch.randomizedtesting.rules.SystemPropertiesRestoreRule$1.evaluate(SystemPropertiesRestoreRule.java:57)
	at org.apache.lucene.util.AbstractBeforeAfterRule$1.evaluate(AbstractBeforeAfterRule.java:45)
	at com.carrotsearch.randomizedtesting.rules.StatementAdapter.evaluate(StatementAdapter.java:36)
	at org.apache.lucene.util.TestRuleStoreClassName$1.evaluate(TestRuleStoreClassName.java:41)
	at com.carrotsearch.randomizedtesting.rules.NoShadowingOrOverridesOnMethodsRule$1.evaluate(NoShadowingOrOverridesOnMethodsRule.java:40)
	at com.carrotsearch.randomizedtesting.rules.NoShadowingOrOverridesOnMethodsRule$1.evaluate(NoShadowingOrOverridesOnMethodsRule.java:40)
	at com.carrotsearch.randomizedtesting.rules.StatementAdapter.evaluate(StatementAdapter.java:36)
	at com.carrotsearch.randomizedtesting.rules.StatementAdapter.evaluate(StatementAdapter.java:36)
	at com.carrotsearch.randomizedtesting.rules.StatementAdapter.evaluate(StatementAdapter.java:36)
	at org.apache.lucene.util.TestRuleAssertionsRequired$1.evaluate(TestRuleAssertionsRequired.java:53)
	at org.apache.lucene.util.TestRuleMarkFailure$1.evaluate(TestRuleMarkFailure.java:47)
	at org.apache.lucene.util.TestRuleIgnoreAfterMaxFailures$1.evaluate(TestRuleIgnoreAfterMaxFailures.java:64)
	at org.apache.lucene.util.TestRuleIgnoreTestSuites$1.evaluate(TestRuleIgnoreTestSuites.java:54)
	at com.carrotsearch.randomizedtesting.rules.StatementAdapter.evaluate(StatementAdapter.java:36)
	at com.carrotsearch.randomizedtesting.ThreadLeakControl$StatementRunner.run(ThreadLeakControl.java:368)
	at java.lang.Thread.run(Thread.java:748)




Build Log:
[...truncated 14795 lines...]
   [junit4] Suite: org.apache.solr.metrics.rrd.SolrRrdBackendFactoryTest
   [junit4]   2> Creating dataDir: /home/jenkins/jenkins-slave/workspace/Lucene-Solr-Tests-7.x/solr/build/solr-core/test/J1/temp/solr.metrics.rrd.SolrRrdBackendFactoryTest_7FFE4C7F3C3189ED-001/init-core-data-001
   [junit4]   2> NOTE: reproduce with: ant test  -Dtestcase=SolrRrdBackendFactoryTest -Dtests.method=testBasic -Dtests.seed=7FFE4C7F3C3189ED -Dtests.multiplier=2 -Dtests.slow=true -Dtests.locale=ca-ES -Dtests.timezone=US/Michigan -Dtests.asserts=true -Dtests.file.encoding=US-ASCII
   [junit4] FAILURE 0.30s J1 | SolrRrdBackendFactoryTest.testBasic <<<
   [junit4]    > Throwable #1: java.lang.AssertionError: {} expected:<1> but was:<0>
   [junit4]    > 	at __randomizedtesting.SeedInfo.seed([7FFE4C7F3C3189ED:D404516AE3ED0FC3]:0)
   [junit4]    > 	at org.apache.solr.metrics.rrd.SolrRrdBackendFactoryTest.testBasic(SolrRrdBackendFactoryTest.java:90)
   [junit4]    > 	at java.lang.Thread.run(Thread.java:748)
   [junit4]   2> NOTE: leaving temporary files on disk at: /home/jenkins/jenkins-slave/workspace/Lucene-Solr-Tests-7.x/solr/build/solr-core/test/J1/temp/solr.metrics.rrd.SolrRrdBackendFactoryTest_7FFE4C7F3C3189ED-001
   [junit4]   2> NOTE: test params are: codec=Asserting(Lucene70): {}, docValues:{}, maxPointsInLeafNode=1594, maxMBSortInHeap=5.235163526338246, sim=RandomSimilarity(queryNorm=true): {}, locale=ca-ES, timezone=US/Michigan
   [junit4]   2> NOTE: Linux 4.4.0-112-generic amd64/Oracle Corporation 1.8.0_172 (64-bit)/cpus=4,threads=1,free=219650936,total=530055168
   [junit4]   2> NOTE: All tests run in this JVM: [MoreLikeThisHandlerTest, HdfsRecoveryZkTest, TestSolrCLIRunExample, RequiredFieldsTest, DataDrivenBlockJoinTest, CloudMLTQParserTest, ClassificationUpdateProcessorIntegrationTest, DistributedQueryComponentCustomSortTest, TestReload, TestPayloadScoreQParserPlugin, TestSubQueryTransformerDistrib, PKIAuthenticationIntegrationTest, TestMaxScoreQueryParser, SuggesterTest, BlockJoinFacetDistribTest, DateFieldTest, TestClassicSimilarityFactory, TestFieldCacheReopen, TestDocSet, TestInfoStreamLogging, TestObjectReleaseTracker, TestSolrFieldCacheBean, TestLFUCache, TestQueryUtils, TestSolrDeletionPolicy1, CoreAdminRequestStatusTest, TestPostingsSolrHighlighter, PeerSyncWithIndexFingerprintCachingTest, IndexBasedSpellCheckerTest, TestDynamicFieldCollectionResource, TestDynamicLoading, ReplaceNodeTest, MaxSizeAutoCommitTest, XmlUpdateRequestHandlerTest, TestCSVResponseWriter, TestJsonFacets, HttpTriggerListenerTest, TestLazyCores, SolrCloudReportersTest, TestExclusionRuleCollectionAccess, CursorMarkTest, TestManagedStopFilterFactory, TestReqParamsAPI, TestStressVersions, TestIBSimilarityFactory, PluginInfoTest, BasicFunctionalityTest, MultiThreadedOCPTest, HdfsCollectionsAPIDistributedZkTest, ScheduledTriggerTest, TestConfigSetsAPIZkFailure, ManagedSchemaRoundRobinCloudTest, LIRRollingUpdatesTest, MigrateRouteKeyTest, SpellPossibilityIteratorTest, TestLRUStatsCache, BufferStoreTest, TestDocTermOrds, HttpPartitionOnCommitTest, SoftAutoCommitTest, DocValuesNotIndexedTest, DistributedFacetSimpleRefinementLongTailTest, TestBinaryField, TestTolerantUpdateProcessorCloud, SolrJmxReporterCloudTest, TestPhraseSuggestions, BadCopyFieldTest, WordBreakSolrSpellCheckerTest, RecoveryZkTest, TriggerIntegrationTest, CdcrRequestHandlerTest, IgnoreCommitOptimizeUpdateProcessorFactoryTest, LoggingHandlerTest, TestSortByMinMaxFunction, DistributedSpellCheckComponentTest, TestDocBasedVersionConstraints, AtomicUpdateProcessorFactoryTest, TestHdfsBackupRestoreCore, ShufflingReplicaListTransformerTest, TestScoreJoinQPNoScore, TaggingAttributeTest, TestHighlightDedupGrouping, DeleteNodeTest, TestGenericDistributedQueue, TestFieldResource, TestFieldCacheVsDocValues, UnloadDistributedZkTest, TestRuleBasedAuthorizationPlugin, HighlighterConfigTest, TestCursorMarkWithoutUniqueKey, TestSchemaVersionResource, TestStressInPlaceUpdates, TestEmbeddedSolrServerSchemaAPI, TestFiltering, MoveReplicaHDFSTest, ExternalFileFieldSortTest, TestSizeLimitedDistributedMap, UninvertDocValuesMergePolicyTest, TestTolerantSearch, TestRangeQuery, CollectionsAPIDistributedZkTest, StatsReloadRaceTest, ClusterStateTest, ZkStateReaderTest, TermVectorComponentTest, PreAnalyzedFieldManagedSchemaCloudTest, TestZkChroot, TestDistribDocBasedVersion, GraphQueryTest, ActionThrottleTest, TestRandomRequestDistribution, DisMaxRequestHandlerTest, TestDistributedSearch, MetricsHandlerTest, RuleEngineTest, SolrInfoBeanTest, TestQuerySenderListener, SolrCoreCheckLockOnStartupTest, TestNumericTerms32, OverriddenZkACLAndCredentialsProvidersTest, MetricTriggerTest, HdfsBasicDistributedZk2Test, SuggestComponentContextFilterQueryTest, HdfsChaosMonkeySafeLeaderTest, DistribJoinFromCollectionTest, DistributedDebugComponentTest, TestNumericRangeQuery32, TestAnalyzedSuggestions, ReplicaListTransformerTest, TestNoOpRegenerator, TestAddFieldRealTimeGet, TestClusterProperties, SolrIndexMetricsTest, TestCharFilters, TestReversedWildcardFilterFactory, TokenizerChainTest, TestLuceneIndexBackCompat, AssignBackwardCompatibilityTest, AsyncCallRequestStatusResponseTest, BasicDistributedZk2Test, CleanupOldIndexTest, CollectionsAPISolrJTest, LeaderElectionTest, OverseerTaskQueueTest, ShardRoutingCustomTest, SharedFSAutoReplicaFailoverTest, SliceStateTest, SolrCLIZkUtilsTest, SolrCloudExampleTest, TestAuthenticationFramework, TestCloudConsistency, TestCloudJSONFacetSKG, TestLeaderElectionWithEmptyReplica, TestOnReconnectListenerSupport, TestPullReplica, TestSolrCloudWithDelegationTokens, TestSolrCloudWithSecureImpersonation, ZkCLITest, ZkControllerTest, AssignTest, SimpleCollectionCreateDeleteTest, TestCollectionsAPIViaSolrCloudCluster, TestReplicaProperties, ExecutePlanActionTest, NodeAddedTriggerTest, RestoreTriggerStateTest, TestPolicyCloud, BlobRepositoryCloudTest, TestBackupRepositoryFactory, TestCodecSupport, TestConfig, TestConfigOverlay, TestConfigSetImmutable, TestCorePropertiesReload, TestCustomStream, TestBlobHandler, TestSolrConfigHandlerConcurrent, PropertiesRequestHandlerTest, SecurityConfHandlerTest, SegmentsInfoRequestHandlerTest, TestApiFramework, TestCollectionAPIs, TestConfigsApi, TestCoreAdminApis, BadComponentTest, DistributedFacetExistsSmallTest, DistributedFacetPivotLongTailTest, DistributedFacetPivotWhiteBoxTest, InfixSuggestersTest, TestHttpShardHandlerFactory, TestPivotHelperCode, TestTrackingShardHandlerFactory, SolrCoreMetricManagerTest, SolrRrdBackendFactoryTest]
   [junit4] Completed [639/819 (1!)] on J1 in 0.96s, 1 test, 1 failure <<< FAILURES!

[...truncated 51033 lines...]
[asciidoctor:convert] asciidoctor: ERROR: about-this-guide.adoc: line 1: invalid part, must have at least one section (e.g., chapter, appendix, etc.)
[asciidoctor:convert] asciidoctor: ERROR: solr-glossary.adoc: line 1: invalid part, must have at least one section (e.g., chapter, appendix, etc.)
     [java] Processed 2232 links (1782 relative) to 3000 anchors in 230 files
     [echo] Validated Links & Anchors via: /home/jenkins/jenkins-slave/workspace/Lucene-Solr-Tests-7.x/solr/build/solr-ref-guide/bare-bones-html/

-documentation-lint:
    [jtidy] Checking for broken html (such as invalid tags)...
   [delete] Deleting directory /home/jenkins/jenkins-slave/workspace/Lucene-Solr-Tests-7.x/lucene/build/jtidy_tmp
     [echo] Checking for broken links...
     [exec] 
     [exec] Crawl/parse...
     [exec] 
     [exec] Verify...
     [echo] Checking for malformed docs...

jar-checksums:

resolve:

ivy-availability-check:
[loadresource] Do not set property disallowed.ivy.jars.list as its length is 0.

-ivy-fail-disallowed-ivy-version:

ivy-fail:

ivy-configure:
[ivy:configure] :: loading settings :: file = /home/jenkins/jenkins-slave/workspace/Lucene-Solr-Tests-7.x/lucene/top-level-ivy-settings.xml

resolve:

ivy-availability-check:
[loadresource] Do not set property disallowed.ivy.jars.list as its length is 0.

-ivy-fail-disallowed-ivy-version:

ivy-fail:

ivy-configure:
[ivy:configure] :: loading settings :: file = /home/jenkins/jenkins-slave/workspace/Lucene-Solr-Tests-7.x/lucene/top-level-ivy-settings.xml

resolve:

resolve:

ivy-availability-check:
[loadresource] Do not set property disallowed.ivy.jars.list as its length is 0.

-ivy-fail-disallowed-ivy-version:

ivy-fail:

ivy-configure:
[ivy:configure] :: loading settings :: file = /home/jenkins/jenkins-slave/workspace/Lucene-Solr-Tests-7.x/lucene/top-level-ivy-settings.xml

resolve:

ivy-availability-check:
[loadresource] Do not set property disallowed.ivy.jars.list as its length is 0.

-ivy-fail-disallowed-ivy-version:

ivy-fail:

ivy-configure:
[ivy:configure] :: loading settings :: file = /home/jenkins/jenkins-slave/workspace/Lucene-Solr-Tests-7.x/lucene/top-level-ivy-settings.xml

resolve:

ivy-availability-check:
[loadresource] Do not set property disallowed.ivy.jars.list as its length is 0.

-ivy-fail-disallowed-ivy-version:

ivy-fail:

ivy-configure:
[ivy:configure] :: loading settings :: file = /home/jenkins/jenkins-slave/workspace/Lucene-Solr-Tests-7.x/lucene/top-level-ivy-settings.xml

resolve:

ivy-availability-check:
[loadresource] Do not set property disallowed.ivy.jars.list as its length is 0.

-ivy-fail-disallowed-ivy-version:

ivy-fail:

ivy-configure:
[ivy:configure] :: loading settings :: file = /home/jenkins/jenkins-slave/workspace/Lucene-Solr-Tests-7.x/lucene/top-level-ivy-settings.xml

resolve:

ivy-availability-check:
[loadresource] Do not set property disallowed.ivy.jars.list as its length is 0.

-ivy-fail-disallowed-ivy-version:

ivy-fail:

ivy-configure:
[ivy:configure] :: loading settings :: file = /home/jenkins/jenkins-slave/workspace/Lucene-Solr-Tests-7.x/lucene/top-level-ivy-settings.xml

resolve:

ivy-availability-check:
[loadresource] Do not set property disallowed.ivy.jars.list as its length is 0.

-ivy-fail-disallowed-ivy-version:

ivy-fail:

ivy-configure:
[ivy:configure] :: loading settings :: file = /home/jenkins/jenkins-slave/workspace/Lucene-Solr-Tests-7.x/lucene/top-level-ivy-settings.xml

resolve:

ivy-availability-check:
[loadresource] Do not set property disallowed.ivy.jars.list as its length is 0.

-ivy-fail-disallowed-ivy-version:

ivy-fail:

ivy-configure:
[ivy:configure] :: loading settings :: file = /home/jenkins/jenkins-slave/workspace/Lucene-Solr-Tests-7.x/lucene/top-level-ivy-settings.xml

resolve:

ivy-availability-check:
[loadresource] Do not set property disallowed.ivy.jars.list as its length is 0.

-ivy-fail-disallowed-ivy-version:

ivy-fail:

ivy-configure:
[ivy:configure] :: loading settings :: file = /home/jenkins/jenkins-slave/workspace/Lucene-Solr-Tests-7.x/lucene/top-level-ivy-settings.xml

resolve:

ivy-availability-check:
[loadresource] Do not set property disallowed.ivy.jars.list as its length is 0.

-ivy-fail-disallowed-ivy-version:

ivy-fail:

ivy-configure:
[ivy:configure] :: loading settings :: file = /home/jenkins/jenkins-slave/workspace/Lucene-Solr-Tests-7.x/lucene/top-level-ivy-settings.xml

resolve:

ivy-availability-check:
[loadresource] Do not set property disallowed.ivy.jars.list as its length is 0.

-ivy-fail-disallowed-ivy-version:

ivy-fail:

ivy-configure:
[ivy:configure] :: loading settings :: file = /home/jenkins/jenkins-slave/workspace/Lucene-Solr-Tests-7.x/lucene/top-level-ivy-settings.xml

resolve:

ivy-availability-check:
[loadresource] Do not set property disallowed.ivy.jars.list as its length is 0.

-ivy-fail-disallowed-ivy-version:

ivy-fail:

ivy-configure:
[ivy:configure] :: loading settings :: file = /home/jenkins/jenkins-slave/workspace/Lucene-Solr-Tests-7.x/lucene/top-level-ivy-settings.xml

resolve:

ivy-availability-check:
[loadresource] Do not set property disallowed.ivy.jars.list as its length is 0.

-ivy-fail-disallowed-ivy-version:

ivy-fail:

ivy-configure:
[ivy:configure] :: loading settings :: file = /home/jenkins/jenkins-slave/workspace/Lucene-Solr-Tests-7.x/lucene/top-level-ivy-settings.xml

resolve:

ivy-availability-check:
[loadresource] Do not set property disallowed.ivy.jars.list as its length is 0.

-ivy-fail-disallowed-ivy-version:

ivy-fail:

ivy-configure:
[ivy:configure] :: loading settings :: file = /home/jenkins/jenkins-slave/workspace/Lucene-Solr-Tests-7.x/lucene/top-level-ivy-settings.xml

resolve:

ivy-availability-check:
[loadresource] Do not set property disallowed.ivy.jars.list as its length is 0.

-ivy-fail-disallowed-ivy-version:

ivy-fail:

ivy-configure:
[ivy:configure] :: loading settings :: file = /home/jenkins/jenkins-slave/workspace/Lucene-Solr-Tests-7.x/lucene/top-level-ivy-settings.xml

resolve:

ivy-availability-check:
[loadresource] Do not set property disallowed.ivy.jars.list as its length is 0.

-ivy-fail-disallowed-ivy-version:

ivy-fail:

ivy-configure:
[ivy:configure] :: loading settings :: file = /home/jenkins/jenkins-slave/workspace/Lucene-Solr-Tests-7.x/lucene/top-level-ivy-settings.xml

resolve:

ivy-availability-check:
[loadresource] Do not set property disallowed.ivy.jars.list as its length is 0.

-ivy-fail-disallowed-ivy-version:

ivy-fail:

ivy-configure:
[ivy:configure] :: loading settings :: file = /home/jenkins/jenkins-slave/workspace/Lucene-Solr-Tests-7.x/lucene/top-level-ivy-settings.xml

resolve:

ivy-availability-check:
[loadresource] Do not set property disallowed.ivy.jars.list as its length is 0.

-ivy-fail-disallowed-ivy-version:

ivy-fail:

ivy-configure:
[ivy:configure] :: loading settings :: file = /home/jenkins/jenkins-slave/workspace/Lucene-Solr-Tests-7.x/lucene/top-level-ivy-settings.xml

resolve:

ivy-availability-check:
[loadresource] Do not set property disallowed.ivy.jars.list as its length is 0.

-ivy-fail-disallowed-ivy-version:

ivy-fail:

ivy-configure:
[ivy:configure] :: loading settings :: file = /home/jenkins/jenkins-slave/workspace/Lucene-Solr-Tests-7.x/lucene/top-level-ivy-settings.xml

resolve:

ivy-availability-check:
[loadresource] Do not set property disallowed.ivy.jars.list as its length is 0.

-ivy-fail-disallowed-ivy-version:

ivy-fail:

ivy-configure:
[ivy:configure] :: loading settings :: file = /home/jenkins/jenkins-slave/workspace/Lucene-Solr-Tests-7.x/lucene/top-level-ivy-settings.xml

resolve:

ivy-availability-check:
[loadresource] Do not set property disallowed.ivy.jars.list as its length is 0.

-ivy-fail-disallowed-ivy-version:

ivy-fail:

ivy-configure:
[ivy:configure] :: loading settings :: file = /home/jenkins/jenkins-slave/workspace/Lucene-Solr-Tests-7.x/lucene/top-level-ivy-settings.xml

resolve:

ivy-availability-check:
[loadresource] Do not set property disallowed.ivy.jars.list as its length is 0.

-ivy-fail-disallowed-ivy-version:

ivy-fail:

ivy-configure:
[ivy:configure] :: loading settings :: file = /home/jenkins/jenkins-slave/workspace/Lucene-Solr-Tests-7.x/lucene/top-level-ivy-settings.xml

resolve:

ivy-availability-check:
[loadresource] Do not set property disallowed.ivy.jars.list as its length is 0.

-ivy-fail-disallowed-ivy-version:

ivy-fail:

ivy-configure:
[ivy:configure] :: loading settings :: file = /home/jenkins/jenkins-slave/workspace/Lucene-Solr-Tests-7.x/lucene/top-level-ivy-settings.xml

resolve:

ivy-availability-check:
[loadresource] Do not set property disallowed.ivy.jars.list as its length is 0.

-ivy-fail-disallowed-ivy-version:

ivy-fail:

ivy-configure:
[ivy:configure] :: loading settings :: file = /home/jenkins/jenkins-slave/workspace/Lucene-Solr-Tests-7.x/lucene/top-level-ivy-settings.xml

resolve:

ivy-availability-check:
[loadresource] Do not set property disallowed.ivy.jars.list as its length is 0.

-ivy-fail-disallowed-ivy-version:

ivy-fail:

ivy-configure:
[ivy:configure] :: loading settings :: file = /home/jenkins/jenkins-slave/workspace/Lucene-Solr-Tests-7.x/lucene/top-level-ivy-settings.xml

resolve:

ivy-availability-check:
[loadresource] Do not set property disallowed.ivy.jars.list as its length is 0.

-ivy-fail-disallowed-ivy-version:

ivy-fail:

ivy-configure:
[ivy:configure] :: loading settings :: file = /home/jenkins/jenkins-slave/workspace/Lucene-Solr-Tests-7.x/lucene/top-level-ivy-settings.xml

common.resolve:

resolve:

ivy-availability-check:
[loadresource] Do not set property disallowed.ivy.jars.list as its length is 0.

-ivy-fail-disallowed-ivy-version:

ivy-fail:

ivy-configure:
[ivy:configure] :: loading settings :: file = /home/jenkins/jenkins-slave/workspace/Lucene-Solr-Tests-7.x/lucene/top-level-ivy-settings.xml

resolve:

ivy-availability-check:
[loadresource] Do not set property disallowed.ivy.jars.list as its length is 0.

-ivy-fail-disallowed-ivy-version:

ivy-fail:

ivy-configure:
[ivy:configure] :: loading settings :: file = /home/jenkins/jenkins-slave/workspace/Lucene-Solr-Tests-7.x/lucene/top-level-ivy-settings.xml

resolve:

ivy-availability-check:
[loadresource] Do not set property disallowed.ivy.jars.list as its length is 0.

-ivy-fail-disallowed-ivy-version:

ivy-fail:

ivy-configure:
[ivy:configure] :: loading settings :: file = /home/jenkins/jenkins-slave/workspace/Lucene-Solr-Tests-7.x/lucene/top-level-ivy-settings.xml

resolve:

ivy-availability-check:
[loadresource] Do not set property disallowed.ivy.jars.list as its length is 0.

-ivy-fail-disallowed-ivy-version:

ivy-fail:

ivy-configure:
[ivy:configure] :: loading settings :: file = /home/jenkins/jenkins-slave/workspace/Lucene-Solr-Tests-7.x/lucene/top-level-ivy-settings.xml

resolve:

ivy-availability-check:
[loadresource] Do not set property disallowed.ivy.jars.list as its length is 0.

-ivy-fail-disallowed-ivy-version:

ivy-fail:

ivy-configure:
[ivy:configure] :: loading settings :: file = /home/jenkins/jenkins-slave/workspace/Lucene-Solr-Tests-7.x/lucene/top-level-ivy-settings.xml

resolve:

jar-checksums:
    [mkdir] Created dir: /home/jenkins/jenkins-slave/workspace/Lucene-Solr-Tests-7.x/lucene/null1304377637
     [copy] Copying 39 files to /home/jenkins/jenkins-slave/workspace/Lucene-Solr-Tests-7.x/lucene/null1304377637
   [delete] Deleting directory /home/jenkins/jenkins-slave/workspace/Lucene-Solr-Tests-7.x/lucene/null1304377637

resolve-example:

ivy-availability-check:
[loadresource] Do not set property disallowed.ivy.jars.list as its length is 0.

-ivy-fail-disallowed-ivy-version:

ivy-fail:

ivy-configure:
[ivy:configure] :: loading settings :: file = /home/jenkins/jenkins-slave/workspace/Lucene-Solr-Tests-7.x/lucene/top-level-ivy-settings.xml

resolve:

resolve-server:

ivy-availability-check:
[loadresource] Do not set property disallowed.ivy.jars.list as its length is 0.

-ivy-fail-disallowed-ivy-version:

ivy-fail:

ivy-fail:

ivy-configure:
[ivy:configure] :: loading settings :: file = /home/jenkins/jenkins-slave/workspace/Lucene-Solr-Tests-7.x/lucene/top-level-ivy-settings.xml

resolve:

resolve:

ivy-availability-check:
[loadresource] Do not set property disallowed.ivy.jars.list as its length is 0.

-ivy-fail-disallowed-ivy-version:

ivy-fail:

ivy-fail:

ivy-configure:
[ivy:configure] :: loading settings :: file = /home/jenkins/jenkins-slave/workspace/Lucene-Solr-Tests-7.x/lucene/top-level-ivy-settings.xml

resolve:

ivy-availability-check:
[loadresource] Do not set property disallowed.ivy.jars.list as its length is 0.

-ivy-fail-disallowed-ivy-version:

ivy-fail:

ivy-fail:

ivy-configure:
[ivy:configure] :: loading settings :: file = /home/jenkins/jenkins-slave/workspace/Lucene-Solr-Tests-7.x/lucene/top-level-ivy-settings.xml

resolve:

ivy-availability-check:
[loadresource] Do not set property disallowed.ivy.jars.list as its length is 0.

-ivy-fail-disallowed-ivy-version:

ivy-fail:

ivy-configure:
[ivy:configure] :: loading settings :: file = /home/jenkins/jenkins-slave/workspace/Lucene-Solr-Tests-7.x/lucene/top-level-ivy-settings.xml

resolve:

ivy-availability-check:
[loadresource] Do not set property disallowed.ivy.jars.list as its length is 0.

-ivy-fail-disallowed-ivy-version:

ivy-fail:

ivy-fail:

ivy-configure:
[ivy:configure] :: loading settings :: file = /home/jenkins/jenkins-slave/workspace/Lucene-Solr-Tests-7.x/lucene/top-level-ivy-settings.xml

resolve:

ivy-availability-check:
[loadresource] Do not set property disallowed.ivy.jars.list as its length is 0.

-ivy-fail-disallowed-ivy-version:

ivy-fail:

ivy-configure:
[ivy:configure] :: loading settings :: file = /home/jenkins/jenkins-slave/workspace/Lucene-Solr-Tests-7.x/lucene/top-level-ivy-settings.xml

resolve:

ivy-availability-check:
[loadresource] Do not set property disallowed.ivy.jars.list as its length is 0.

-ivy-fail-disallowed-ivy-version:

ivy-fail:

ivy-fail:

ivy-configure:
[ivy:configure] :: loading settings :: file = /home/jenkins/jenkins-slave/workspace/Lucene-Solr-Tests-7.x/lucene/top-level-ivy-settings.xml

resolve:

ivy-availability-check:
[loadresource] Do not set property disallowed.ivy.jars.list as its length is 0.

-ivy-fail-disallowed-ivy-version:

ivy-fail:

ivy-fail:

ivy-configure:
[ivy:configure] :: loading settings :: file = /home/jenkins/jenkins-slave/workspace/Lucene-Solr-Tests-7.x/lucene/top-level-ivy-settings.xml

resolve:

ivy-availability-check:
[loadresource] Do not set property disallowed.ivy.jars.list as its length is 0.

-ivy-fail-disallowed-ivy-version:

ivy-fail:

ivy-fail:

ivy-configure:
[ivy:configure] :: loading settings :: file = /home/jenkins/jenkins-slave/workspace/Lucene-Solr-Tests-7.x/lucene/top-level-ivy-settings.xml

resolve:

ivy-availability-check:
[loadresource] Do not set property disallowed.ivy.jars.list as its length is 0.

-ivy-fail-disallowed-ivy-version:

ivy-fail:

ivy-fail:

ivy-configure:
[ivy:configure] :: loading settings :: file = /home/jenkins/jenkins-slave/workspace/Lucene-Solr-Tests-7.x/lucene/top-level-ivy-settings.xml

resolve:

ivy-availability-check:
[loadresource] Do not set property disallowed.ivy.jars.list as its length is 0.

-ivy-fail-disallowed-ivy-version:

ivy-fail:

ivy-fail:

ivy-configure:
[ivy:configure] :: loading settings :: file = /home/jenkins/jenkins-slave/workspace/Lucene-Solr-Tests-7.x/lucene/top-level-ivy-settings.xml

resolve:

ivy-availability-check:
[loadresource] Do not set property disallowed.ivy.jars.list as its length is 0.

-ivy-fail-disallowed-ivy-version:

ivy-fail:

ivy-fail:

ivy-configure:
[ivy:configure] :: loading settings :: file = /home/jenkins/jenkins-slave/workspace/Lucene-Solr-Tests-7.x/lucene/top-level-ivy-settings.xml

resolve:

ivy-availability-check:
[loadresource] Do not set property disallowed.ivy.jars.list as its length is 0.

-ivy-fail-disallowed-ivy-version:

ivy-fail:

ivy-fail:

ivy-configure:
[ivy:configure] :: loading settings :: file = /home/jenkins/jenkins-slave/workspace/Lucene-Solr-Tests-7.x/lucene/top-level-ivy-settings.xml

resolve:

ivy-availability-check:
[loadresource] Do not set property disallowed.ivy.jars.list as its length is 0.

-ivy-fail-disallowed-ivy-version:

ivy-fail:

ivy-fail:

ivy-configure:
[ivy:configure] :: loading settings :: file = /home/jenkins/jenkins-slave/workspace/Lucene-Solr-Tests-7.x/lucene/top-level-ivy-settings.xml

resolve:

ivy-availability-check:
[loadresource] Do not set property disallowed.ivy.jars.list as its length is 0.

-ivy-fail-disallowed-ivy-version:

ivy-fail:

ivy-fail:

ivy-configure:
[ivy:configure] :: loading settings :: file = /home/jenkins/jenkins-slave/workspace/Lucene-Solr-Tests-7.x/lucene/top-level-ivy-settings.xml

resolve:

ivy-availability-check:
[loadresource] Do not set property disallowed.ivy.jars.list as its length is 0.

-ivy-fail-disallowed-ivy-version:

ivy-fail:

ivy-fail:

ivy-configure:
[ivy:configure] :: loading settings :: file = /home/jenkins/jenkins-slave/workspace/Lucene-Solr-Tests-7.x/lucene/top-level-ivy-settings.xml

resolve:

ivy-availability-check:
[loadresource] Do not set property disallowed.ivy.jars.list as its length is 0.

-ivy-fail-disallowed-ivy-version:

ivy-fail:

ivy-fail:

ivy-configure:
[ivy:configure] :: loading settings :: file = /home/jenkins/jenkins-slave/workspace/Lucene-Solr-Tests-7.x/lucene/top-level-ivy-settings.xml

resolve:

jar-checksums:
    [mkdir] Created dir: /home/jenkins/jenkins-slave/workspace/Lucene-Solr-Tests-7.x/solr/null865648070
     [copy] Copying 247 files to /home/jenkins/jenkins-slave/workspace/Lucene-Solr-Tests-7.x/solr/null865648070
   [delete] Deleting directory /home/jenkins/jenkins-slave/workspace/Lucene-Solr-Tests-7.x/solr/null865648070

check-working-copy:
[ivy:cachepath] :: resolving dependencies :: org.eclipse.jgit#org.eclipse.jgit-caller;working
[ivy:cachepath] 	confs: [default]
[ivy:cachepath] 	found org.eclipse.jgit#org.eclipse.jgit;4.6.0.201612231935-r in public
[ivy:cachepath] 	found com.jcraft#jsch;0.1.53 in public
[ivy:cachepath] 	found com.googlecode.javaewah#JavaEWAH;1.1.6 in public
[ivy:cachepath] 	found org.apache.httpcomponents#httpclient;4.3.6 in public
[ivy:cachepath] 	found org.apache.httpcomponents#httpcore;4.3.3 in public
[ivy:cachepath] 	found commons-logging#commons-logging;1.1.3 in public
[ivy:cachepath] 	found commons-codec#commons-codec;1.6 in public
[ivy:cachepath] 	found org.slf4j#slf4j-api;1.7.2 in public
[ivy:cachepath] :: resolution report :: resolve 53ms :: artifacts dl 17ms
	---------------------------------------------------------------------
	|                  |            modules            ||   artifacts   |
	|       conf       | number| search|dwnlded|evicted|| number|dwnlded|
	---------------------------------------------------------------------
	|      default     |   8   |   0   |   0   |   0   ||   8   |   0   |
	---------------------------------------------------------------------
[wc-checker] Initializing working copy...
[wc-checker] SLF4J: Failed to load class "org.slf4j.impl.StaticLoggerBinder".
[wc-checker] SLF4J: Defaulting to no-operation (NOP) logger implementation
[wc-checker] SLF4J: See http://www.slf4j.org/codes.html#StaticLoggerBinder for further details.
[wc-checker] Checking working copy status...

-jenkins-base:

BUILD SUCCESSFUL
Total time: 189 minutes 29 seconds
Archiving artifacts
WARN: No artifacts found that match the file pattern "**/*.events,heapdumps/**,**/hs_err_pid*". Configuration error?
WARN: java.lang.InterruptedException: no matches found within 10000
Recording test results
Build step 'Publish JUnit test result report' changed build result to UNSTABLE
Email was triggered for: Unstable (Test Failures)
Sending email for trigger: Unstable (Test Failures)