You are viewing a plain text version of this content. The canonical link for it is here.
Posted to commits@hc.apache.org by Apache Jenkins Server <je...@builds.apache.org> on 2026/10/17 00:08:24 UTC
Build failed in Jenkins: HttpComponents » HttpComponents Client 5.6.x Java17 #188
See <https://ci-builds.apache.org/job/HttpComponents/job/HttpComponents%20Client%205.6.x%20Java17/188/display/redirect?page=changes>
Changes:
[Ryan Schmitt] Fix spurious TCP resets when initiating TLS connection closure
------------------------------------------
Started by an SCM change
Running as SYSTEM
[EnvInject] - Loading node environment variables.
Building remotely on builds37 (ubuntu) in workspace <https://ci-builds.apache.org/job/HttpComponents/job/HttpComponents%20Client%205.6.x%20Java17/ws/>
The recommended git tool is: NONE
No credentials specified
Cloning the remote Git repository
Cloning repository https://github.com/apache/httpcomponents-client.git
> git init <https://ci-builds.apache.org/job/HttpComponents/job/HttpComponents%20Client%205.6.x%20Java17/ws/> # timeout=10
Fetching upstream changes from https://github.com/apache/httpcomponents-client.git
> git --version # timeout=10
> git --version # 'git version 2.34.1'
> git fetch --tags --force --progress -- https://github.com/apache/httpcomponents-client.git +refs/heads/*:refs/remotes/origin/* # timeout=10
> git config remote.origin.url https://github.com/apache/httpcomponents-client.git # timeout=10
> git config --add remote.origin.fetch +refs/heads/*:refs/remotes/origin/* # timeout=10
Avoid second fetch
> git rev-parse refs/remotes/origin/5.6.x^{commit} # timeout=10
Checking out Revision 54c5ad852fc497eb27213e4239607c403349e7dd (refs/remotes/origin/5.6.x)
> git config core.sparsecheckout # timeout=10
> git checkout -f 54c5ad852fc497eb27213e4239607c403349e7dd # timeout=10
Commit message: "Fix spurious TCP resets when initiating TLS connection closure"
> git rev-list --no-walk d45ad3a3ce6652a837df6079d56fa7e651d0cb4d # timeout=10
Parsing POMs
Downloaded artifact https://repo.maven.apache.org/maven2/org/apache/httpcomponents/httpcomponents-parent/14/httpcomponents-parent-14.pom
Downloaded artifact https://repo.maven.apache.org/maven2/org/apache/apache/27/apache-27.pom
Downloaded artifact https://repo.maven.apache.org/maven2/org/junit/junit-bom/5.13.3/junit-bom-5.13.3.pom
Established TCP socket on 45361
maven35-agent.jar already up to date
maven35-interceptor.jar already up to date
maven3-interceptor-commons.jar already up to date
[HttpComponents Client 5.6.x Java17] $ /home/jenkins/tools/java/latest17/bin/java -cp /home/jenkins/jenkins-agent/maven35-agent.jar:/home/jenkins/tools/maven/latest3/boot/plexus-classworlds-2.11.0.jar:/home/jenkins/tools/maven/latest3/conf/logging jenkins.maven3.agent.Maven35Main /home/jenkins/tools/maven/latest3 /home/jenkins/jenkins-agent/agent.jar /home/jenkins/jenkins-agent/maven35-interceptor.jar /home/jenkins/jenkins-agent/maven3-interceptor-commons.jar 45361
<===[JENKINS REMOTING CAPACITY]===> channel started
Executing Maven: -B -f <https://ci-builds.apache.org/job/HttpComponents/job/HttpComponents%20Client%205.6.x%20Java17/ws/pom.xml> clean verify install -P-use-toolchains -Pnodoclint
[INFO] Scanning for projects...
[HUDSON] Collecting dependencies info
[HUDSON] Collecting dependencies info
[HUDSON] Collecting dependencies info
[HUDSON] Collecting dependencies info
[HUDSON] Collecting dependencies info
[INFO] ------------------------------------------------------------------------
[INFO] Reactor Build Order:
[INFO]
[HUDSON] Collecting dependencies info
[INFO] Apache HttpComponents Client [pom]
[INFO] Apache HttpClient [jar]
[INFO] Apache HttpClient Cache [jar]
[INFO] Apache HttpClient Observation [jar]
[INFO] Apache HttpClient Fluent [jar]
[INFO] Apache HttpClient Integration Tests [jar]
[INFO]
[INFO] --------< org.apache.httpcomponents.client5:httpclient5-parent >--------
[INFO] Building Apache HttpComponents Client 5.6.6-SNAPSHOT [1/6]
[INFO] from pom.xml
[INFO] --------------------------------[ pom ]---------------------------------
[INFO] Downloading from central: https://repo.maven.apache.org/maven2/org/apache/maven/plugins/maven-remote-resources-plugin/1.7.0/maven-remote-resources-plugin-1.7.0.pom
[INFO] Downloaded from central: https://repo.maven.apache.org/maven2/org/apache/maven/plugins/maven-remote-resources-plugin/1.7.0/maven-remote-resources-plugin-1.7.0.pom (13 kB at 30 kB/s)
[INFO] Downloading from central: https://repo.maven.apache.org/maven2/org/apache/maven/plugins/maven-plugins/33/maven-plugins-33.pom
[INFO] Downloaded from central: https://repo.maven.apache.org/maven2/org/apache/maven/plugins/maven-plugins/33/maven-plugins-33.pom (11 kB at 305 kB/s)
[INFO] Downloading from central: https://repo.maven.apache.org/maven2/org/apache/maven/maven-parent/33/maven-parent-33.pom
[INFO] Downloaded from central: https://repo.maven.apache.org/maven2/org/apache/maven/maven-parent/33/maven-parent-33.pom (44 kB at 1.2 MB/s)
[INFO] Downloading from central: https://repo.maven.apache.org/maven2/org/apache/maven/plugins/maven-remote-resources-plugin/1.7.0/maven-remote-resources-plugin-1.7.0.jar
[INFO] Downloaded from central: https://repo.maven.apache.org/maven2/org/apache/maven/plugins/maven-remote-resources-plugin/1.7.0/maven-remote-resources-plugin-1.7.0.jar (71 kB at 1.4 MB/s)
[INFO] Downloading from central: https://repo.maven.apache.org/maven2/org/apache/maven/plugins/maven-enforcer-plugin/3.1.0/maven-enforcer-plugin-3.1.0.pom
[INFO] Downloaded from central: https://repo.maven.apache.org/maven2/org/apache/maven/plugins/maven-enforcer-plugin/3.1.0/maven-enforcer-plugin-3.1.0.pom (7.2 kB at 206 kB/s)
[INFO] Downloading from central: https://repo.maven.apache.org/maven2/org/apache/maven/enforcer/enforcer/3.1.0/enforcer-3.1.0.pom
[INFO] Downloaded from central: https://repo.maven.apache.org/maven2/org/apache/maven/enforcer/enforcer/3.1.0/enforcer-3.1.0.pom (8.3 kB at 190 kB/s)
[INFO] Downloading from central: https://repo.maven.apache.org/maven2/org/apache/maven/maven-parent/36/maven-parent-36.pom
[INFO] Downloaded from central: https://repo.maven.apache.org/maven2/org/apache/maven/maven-parent/36/maven-parent-36.pom (45 kB at 1.4 MB/s)
[INFO] Downloading from central: https://repo.maven.apache.org/maven2/org/apache/apache/26/apache-26.pom
[INFO] Downloaded from central: https://repo.maven.apache.org/maven2/org/apache/apache/26/apache-26.pom (21 kB at 663 kB/s)
[INFO] Downloading from central: https://repo.maven.apache.org/maven2/org/apache/maven/plugins/maven-enforcer-plugin/3.1.0/maven-enforcer-plugin-3.1.0.jar
[INFO] Downloaded from central: https://repo.maven.apache.org/maven2/org/apache/maven/plugins/maven-enforcer-plugin/3.1.0/maven-enforcer-plugin-3.1.0.jar (26 kB at 603 kB/s)
[INFO] Downloading from central: https://repo.maven.apache.org/maven2/org/apache/maven/plugins/maven-site-plugin/3.12.1/maven-site-plugin-3.12.1.pom
[INFO] Downloaded from central: https://repo.maven.apache.org/maven2/org/apache/maven/plugins/maven-site-plugin/3.12.1/maven-site-plugin-3.12.1.pom (20 kB at 414 kB/s)
[INFO] Downloading from central: https://repo.maven.apache.org/maven2/org/apache/maven/plugins/maven-plugins/36/maven-plugins-36.pom
[INFO] Downloaded from central: https://repo.maven.apache.org/maven2/org/apache/maven/plugins/maven-plugins/36/maven-plugins-36.pom (9.9 kB at 242 kB/s)
[INFO] Downloading from central: https://repo.maven.apache.org/maven2/org/apache/maven/plugins/maven-site-plugin/3.12.1/maven-site-plugin-3.12.1.jar
[INFO] Downloaded from central: https://repo.maven.apache.org/maven2/org/apache/maven/plugins/maven-site-plugin/3.12.1/maven-site-plugin-3.12.1.jar (119 kB at 2.7 MB/s)
[INFO] Downloading from central: https://repo.maven.apache.org/maven2/org/codehaus/mojo/build-helper-maven-plugin/3.2.0/build-helper-maven-plugin-3.2.0.pom
[INFO] Downloaded from central: https://repo.maven.apache.org/maven2/org/codehaus/mojo/build-helper-maven-plugin/3.2.0/build-helper-maven-plugin-3.2.0.pom (7.3 kB at 214 kB/s)
[INFO] Downloading from central: https://repo.maven.apache.org/maven2/org/codehaus/mojo/build-helper-maven-plugin/3.2.0/build-helper-maven-plugin-3.2.0.jar
[INFO] Downloaded from central: https://repo.maven.apache.org/maven2/org/codehaus/mojo/build-helper-maven-plugin/3.2.0/build-helper-maven-plugin-3.2.0.jar (69 kB at 2.1 MB/s)
[INFO] Downloading from central: https://repo.maven.apache.org/maven2/org/codehaus/mojo/animal-sniffer-maven-plugin/1.24/animal-sniffer-maven-plugin-1.24.pom
[INFO] Downloaded from central: https://repo.maven.apache.org/maven2/org/codehaus/mojo/animal-sniffer-maven-plugin/1.24/animal-sniffer-maven-plugin-1.24.pom (4.9 kB at 153 kB/s)
[INFO] Downloading from central: https://repo.maven.apache.org/maven2/org/codehaus/mojo/animal-sniffer-parent/1.24/animal-sniffer-parent-1.24.pom
[INFO] Downloaded from central: https://repo.maven.apache.org/maven2/org/codehaus/mojo/animal-sniffer-parent/1.24/animal-sniffer-parent-1.24.pom (5.8 kB at 200 kB/s)
[INFO] Downloading from central: https://repo.maven.apache.org/maven2/org/codehaus/mojo/mojo-parent/84/mojo-parent-84.pom
[INFO] Downloaded from central: https://repo.maven.apache.org/maven2/org/codehaus/mojo/mojo-parent/84/mojo-parent-84.pom (36 kB at 945 kB/s)
[WARNING] The POM for org.codehaus.mojo:animal-sniffer-maven-plugin:jar:1.24 is invalid, transitive dependencies (if any) will not be available: 1 problem was encountered while building the effective model for org.codehaus.mojo:animal-sniffer-maven-plugin:1.24
[FATAL] Non-readable POM /home/jenkins/.m2/repository/org/junit/junit-bom/5.10.2/junit-bom-5.10.2.pom: input contained no data @ /home/jenkins/.m2/repository/org/junit/junit-bom/5.10.2/junit-bom-5.10.2.pom
[WARNING] Attempt to (de-)serialize anonymous class org.jfrog.hudson.maven2.MavenDependenciesRecorder$1; see: https://jenkins.io/redirect/serialization-of-anonymous-classes/
[INFO] ------------------------------------------------------------------------
[INFO] Reactor Summary for Apache HttpComponents Client 5.6.6-SNAPSHOT:
[INFO]
[INFO] Apache HttpComponents Client ....................... FAILURE [ 3.871 s]
[INFO] Apache HttpClient .................................. SKIPPED
[INFO] Apache HttpClient Cache ............................ SKIPPED
[INFO] Apache HttpClient Observation ...................... SKIPPED
[INFO] Apache HttpClient Fluent ........................... SKIPPED
[INFO] Apache HttpClient Integration Tests ................ SKIPPED
[INFO] ------------------------------------------------------------------------
[INFO] BUILD FAILURE
[INFO] ------------------------------------------------------------------------
[INFO] Total time: 23.672 s
[INFO] Finished at: 2026-10-17T00:08:12Z
[INFO] ------------------------------------------------------------------------
Waiting for Jenkins to finish collecting data
[ERROR] Plugin org.codehaus.mojo:animal-sniffer-maven-plugin:1.24 or one of its dependencies could not be resolved:
[ERROR] 1 problem was encountered while building the effective model for org.codehaus.mojo:animal-sniffer-maven-plugin:1.24
[ERROR] [FATAL] Non-readable POM /home/jenkins/.m2/repository/org/junit/junit-bom/5.10.2/junit-bom-5.10.2.pom: input contained no data @ /home/jenkins/.m2/repository/org/junit/junit-bom/5.10.2/junit-bom-5.10.2.pom
[ERROR] -> [Help 1]
[ERROR]
[ERROR] To see the full stack trace of the errors, re-run Maven with the -e switch.
[ERROR] Re-run Maven using the -X switch to enable full debug logging.
[ERROR]
[ERROR] For more information about the errors and possible solutions, please read the following articles:
[ERROR] [Help 1] http://cwiki.apache.org/confluence/display/MAVEN/PluginResolutionException
[JENKINS] Archiving <https://ci-builds.apache.org/job/HttpComponents/job/HttpComponents%20Client%205.6.x%20Java17/ws/httpclient5-cache/pom.xml> to org.apache.httpcomponents.client5/httpclient5-cache/5.6.6-SNAPSHOT/httpclient5-cache-5.6.6-SNAPSHOT.pom
[JENKINS] Archiving <https://ci-builds.apache.org/job/HttpComponents/job/HttpComponents%20Client%205.6.x%20Java17/ws/httpclient5/pom.xml> to org.apache.httpcomponents.client5/httpclient5/5.6.6-SNAPSHOT/httpclient5-5.6.6-SNAPSHOT.pom
[JENKINS] Archiving <https://ci-builds.apache.org/job/HttpComponents/job/HttpComponents%20Client%205.6.x%20Java17/ws/httpclient5-fluent/pom.xml> to org.apache.httpcomponents.client5/httpclient5-fluent/5.6.6-SNAPSHOT/httpclient5-fluent-5.6.6-SNAPSHOT.pom
[JENKINS] Archiving <https://ci-builds.apache.org/job/HttpComponents/job/HttpComponents%20Client%205.6.x%20Java17/ws/httpclient5-testing/pom.xml> to org.apache.httpcomponents.client5/httpclient5-testing/5.6.6-SNAPSHOT/httpclient5-testing-5.6.6-SNAPSHOT.pom
[JENKINS] Archiving <https://ci-builds.apache.org/job/HttpComponents/job/HttpComponents%20Client%205.6.x%20Java17/ws/pom.xml> to org.apache.httpcomponents.client5/httpclient5-parent/5.6.6-SNAPSHOT/httpclient5-parent-5.6.6-SNAPSHOT.pom
[JENKINS] Archiving <https://ci-builds.apache.org/job/HttpComponents/job/HttpComponents%20Client%205.6.x%20Java17/ws/httpclient5-observation/pom.xml> to org.apache.httpcomponents.client5/httpclient5-observation/5.6.6-SNAPSHOT/httpclient5-observation-5.6.6-SNAPSHOT.pom
channel stopped
Jenkins build is back to normal : HttpComponents » HttpComponents Client 5.6.x Java17 #190
Posted by Apache Jenkins Server <je...@builds.apache.org>.
See <https://ci-builds.apache.org/job/HttpComponents/job/HttpComponents%20Client%205.6.x%20Java17/190/display/redirect>
Build failed in Jenkins: HttpComponents » HttpComponents Client 5.6.x Java17 #189
Posted by Apache Jenkins Server <je...@builds.apache.org>.
See <https://ci-builds.apache.org/job/HttpComponents/job/HttpComponents%20Client%205.6.x%20Java17/189/display/redirect?page=changes>
Changes:
[Oleg Kalnichevski] Upgrade brotli4j to 1.24.0 for CVE-2026-111497
------------------------------------------
Started by an SCM change
Running as SYSTEM
[EnvInject] - Loading node environment variables.
Building remotely on builds37 (ubuntu) in workspace <https://ci-builds.apache.org/job/HttpComponents/job/HttpComponents%20Client%205.6.x%20Java17/ws/>
The recommended git tool is: NONE
No credentials specified
> git rev-parse --resolve-git-dir <https://ci-builds.apache.org/job/HttpComponents/job/HttpComponents%20Client%205.6.x%20Java17/ws/.git> # timeout=10
Fetching changes from the remote Git repository
> git config remote.origin.url https://github.com/apache/httpcomponents-client.git # timeout=10
Fetching upstream changes from https://github.com/apache/httpcomponents-client.git
> git --version # timeout=10
> git --version # 'git version 2.34.1'
> git fetch --tags --force --progress -- https://github.com/apache/httpcomponents-client.git +refs/heads/*:refs/remotes/origin/* # timeout=10
> git rev-parse refs/remotes/origin/5.6.x^{commit} # timeout=10
Checking out Revision 676ed2b957391df43100f810aeed13ca0f751407 (refs/remotes/origin/5.6.x)
> git config core.sparsecheckout # timeout=10
> git checkout -f 676ed2b957391df43100f810aeed13ca0f751407 # timeout=10
Commit message: "Upgrade brotli4j to 1.24.0 for CVE-2026-111497"
> git rev-list --no-walk 54c5ad852fc497eb27213e4239607c403349e7dd # timeout=10
Parsing POMs
Modules changed, recalculating dependency graph
Established TCP socket on 39179
maven35-agent.jar already up to date
maven35-interceptor.jar already up to date
maven3-interceptor-commons.jar already up to date
[HttpComponents Client 5.6.x Java17] $ /home/jenkins/tools/java/latest17/bin/java -cp /home/jenkins/jenkins-agent/maven35-agent.jar:/home/jenkins/tools/maven/latest3/boot/plexus-classworlds-2.12.1.jar:/home/jenkins/tools/maven/latest3/conf/logging jenkins.maven3.agent.Maven35Main /home/jenkins/tools/maven/latest3 /home/jenkins/jenkins-agent/agent.jar /home/jenkins/jenkins-agent/maven35-interceptor.jar /home/jenkins/jenkins-agent/maven3-interceptor-commons.jar 39179
<===[JENKINS REMOTING CAPACITY]===> channel started
Executing Maven: -B -f <https://ci-builds.apache.org/job/HttpComponents/job/HttpComponents%20Client%205.6.x%20Java17/ws/pom.xml> clean verify install -P-use-toolchains -Pnodoclint
java.lang.reflect.InvocationTargetException
at java.base/jdk.internal.reflect.NativeMethodAccessorImpl.invoke0(Native Method)
at java.base/jdk.internal.reflect.NativeMethodAccessorImpl.invoke(NativeMethodAccessorImpl.java:77)
at java.base/jdk.internal.reflect.DelegatingMethodAccessorImpl.invoke(DelegatingMethodAccessorImpl.java:43)
at java.base/java.lang.reflect.Method.invoke(Method.java:569)
at org.codehaus.plexus.classworlds.launcher.Launcher.launchEnhanced(Launcher.java:255)
at org.codehaus.plexus.classworlds.launcher.Launcher.launch(Launcher.java:201)
at jenkins.maven3.agent.Maven35Main.launch(Maven35Main.java:179)
at java.base/jdk.internal.reflect.NativeMethodAccessorImpl.invoke0(Native Method)
at java.base/jdk.internal.reflect.NativeMethodAccessorImpl.invoke(NativeMethodAccessorImpl.java:77)
at java.base/jdk.internal.reflect.DelegatingMethodAccessorImpl.invoke(DelegatingMethodAccessorImpl.java:43)
at java.base/java.lang.reflect.Method.invoke(Method.java:569)
at PluginClassLoader for maven-plugin//hudson.maven.Maven3Builder.call(Maven3Builder.java:140)
at PluginClassLoader for maven-plugin//hudson.maven.Maven3Builder.call(Maven3Builder.java:71)
at hudson.remoting.UserRequest.perform(UserRequest.java:225)
at hudson.remoting.UserRequest.perform(UserRequest.java:50)
at hudson.remoting.Request$2.run(Request.java:391)
at hudson.remoting.InterceptingExecutorService.lambda$wrap$0(InterceptingExecutorService.java:81)
at java.base/java.util.concurrent.FutureTask.run(FutureTask.java:264)
at java.base/java.util.concurrent.ThreadPoolExecutor.runWorker(ThreadPoolExecutor.java:1136)
at java.base/java.util.concurrent.ThreadPoolExecutor$Worker.run(ThreadPoolExecutor.java:635)
at java.base/java.lang.Thread.run(Thread.java:840)
Caused by: java.lang.UnsupportedOperationException
at org.eclipse.sisu.wire.EntryListAdapter$ValueListIterator.add(EntryListAdapter.java:185)
at java.base/java.util.AbstractSequentialList.add(AbstractSequentialList.java:146)
at java.base/java.util.AbstractList.add(AbstractList.java:111)
at java.base/java.util.AbstractCollection.addAll(AbstractCollection.java:336)
at org.jvnet.hudson.maven3.launcher.Maven35Launcher.main(Maven35Launcher.java:127)
... 21 more
ERROR: Failed to parse POMs
java.io.IOException: java.lang.reflect.InvocationTargetException
at PluginClassLoader for maven-plugin//hudson.maven.Maven3Builder.call(Maven3Builder.java:178)
at PluginClassLoader for maven-plugin//hudson.maven.Maven3Builder.call(Maven3Builder.java:71)
at hudson.remoting.UserRequest.perform(UserRequest.java:225)
at hudson.remoting.UserRequest.perform(UserRequest.java:50)
at hudson.remoting.Request$2.run(Request.java:391)
at hudson.remoting.InterceptingExecutorService.lambda$wrap$0(InterceptingExecutorService.java:81)
at java.base/java.util.concurrent.FutureTask.run(FutureTask.java:264)
at java.base/java.util.concurrent.ThreadPoolExecutor.runWorker(ThreadPoolExecutor.java:1136)
at java.base/java.util.concurrent.ThreadPoolExecutor$Worker.run(ThreadPoolExecutor.java:635)
at java.base/java.lang.Thread.run(Thread.java:840)
Suppressed: hudson.remoting.Channel$CallSiteStackTrace: Remote call to Channel to Maven [/home/jenkins/tools/java/latest17/bin/java, -cp, /home/jenkins/jenkins-agent/maven35-agent.jar:/home/jenkins/tools/maven/latest3/boot/plexus-classworlds-2.12.1.jar:/home/jenkins/tools/maven/latest3/conf/logging, jenkins.maven3.agent.Maven35Main, /home/jenkins/tools/maven/latest3, /home/jenkins/jenkins-agent/agent.jar, /home/jenkins/jenkins-agent/maven35-interceptor.jar, /home/jenkins/jenkins-agent/maven3-interceptor-commons.jar, 39179]
at hudson.remoting.Channel.attachCallSiteStackTrace(Channel.java:1923)
at hudson.remoting.UserRequest$ExceptionResponse.retrieve(UserRequest.java:384)
at hudson.remoting.Channel.call(Channel.java:1112)
at PluginClassLoader for maven-plugin//hudson.maven.ProcessCache$MavenProcess.call(ProcessCache.java:161)
at PluginClassLoader for maven-plugin//hudson.maven.MavenModuleSetBuild$MavenModuleSetBuildExecution.doRun(MavenModuleSetBuild.java:877)
at hudson.model.AbstractBuild$AbstractBuildExecution.run(AbstractBuild.java:527)
at hudson.model.Run.execute(Run.java:1833)
at PluginClassLoader for maven-plugin//hudson.maven.MavenModuleSetBuild.run(MavenModuleSetBuild.java:543)
at hudson.model.ResourceController.execute(ResourceController.java:101)
at hudson.model.Executor.run(Executor.java:446)
Caused by: java.lang.reflect.InvocationTargetException
at java.base/jdk.internal.reflect.NativeMethodAccessorImpl.invoke0(Native Method)
at java.base/jdk.internal.reflect.NativeMethodAccessorImpl.invoke(NativeMethodAccessorImpl.java:77)
at java.base/jdk.internal.reflect.DelegatingMethodAccessorImpl.invoke(DelegatingMethodAccessorImpl.java:43)
at java.base/java.lang.reflect.Method.invoke(Method.java:569)
at PluginClassLoader for maven-plugin//hudson.maven.Maven3Builder.call(Maven3Builder.java:140)
... 9 more
Caused by: java.lang.Exception: java.lang.reflect.InvocationTargetException
at jenkins.maven3.agent.Maven35Main.launch(Maven35Main.java:182)
... 14 more
Caused by: java.lang.reflect.InvocationTargetException
at java.base/jdk.internal.reflect.NativeMethodAccessorImpl.invoke0(Native Method)
at java.base/jdk.internal.reflect.NativeMethodAccessorImpl.invoke(NativeMethodAccessorImpl.java:77)
at java.base/jdk.internal.reflect.DelegatingMethodAccessorImpl.invoke(DelegatingMethodAccessorImpl.java:43)
at java.base/java.lang.reflect.Method.invoke(Method.java:569)
at org.codehaus.plexus.classworlds.launcher.Launcher.launchEnhanced(Launcher.java:255)
at org.codehaus.plexus.classworlds.launcher.Launcher.launch(Launcher.java:201)
at jenkins.maven3.agent.Maven35Main.launch(Maven35Main.java:179)
... 14 more
Caused by: java.lang.UnsupportedOperationException
at org.eclipse.sisu.wire.EntryListAdapter$ValueListIterator.add(EntryListAdapter.java:185)
at java.base/java.util.AbstractSequentialList.add(AbstractSequentialList.java:146)
at java.base/java.util.AbstractList.add(AbstractList.java:111)
at java.base/java.util.AbstractCollection.addAll(AbstractCollection.java:336)
at org.jvnet.hudson.maven3.launcher.Maven35Launcher.main(Maven35Launcher.java:127)
... 21 more
channel stopped