You are viewing a plain text version of this content. The canonical link for it is here.
Posted to dev@kafka.apache.org by Apache Jenkins Server <je...@builds.apache.org> on 2019/05/11 05:40:27 UTC
Build failed in Jenkins: kafka-2.0-jdk8 #263
See <https://builds.apache.org/job/kafka-2.0-jdk8/263/display/redirect?page=changes>
Changes:
[rhauch] KAFKA-8352 : Fix Connect System test failure 404 Not Found (#6713)
------------------------------------------
[...truncated 671.38 KB...]
kafka.api.SaslSslAdminClientIntegrationTest > testAclDescribe PASSED
kafka.api.SaslSslAdminClientIntegrationTest > testLegacyAclOpsNeverAffectOrReturnPrefixed STARTED
kafka.api.SaslSslAdminClientIntegrationTest > testLegacyAclOpsNeverAffectOrReturnPrefixed PASSED
kafka.api.SaslSslAdminClientIntegrationTest > testAttemptToCreateInvalidAcls STARTED
kafka.api.SaslSslAdminClientIntegrationTest > testAttemptToCreateInvalidAcls PASSED
kafka.api.SaslSslAdminClientIntegrationTest > testAclAuthorizationDenied STARTED
kafka.api.SaslSslAdminClientIntegrationTest > testAclAuthorizationDenied PASSED
kafka.api.SaslSslAdminClientIntegrationTest > testAclOperations STARTED
kafka.api.SaslSslAdminClientIntegrationTest > testAclOperations PASSED
kafka.api.SaslSslAdminClientIntegrationTest > testAclOperations2 STARTED
kafka.api.SaslSslAdminClientIntegrationTest > testAclOperations2 PASSED
kafka.api.SaslSslAdminClientIntegrationTest > testAclDelete STARTED
kafka.api.SaslSslAdminClientIntegrationTest > testAclDelete PASSED
kafka.api.SaslSslAdminClientIntegrationTest > testDescribeReplicaLogDirs STARTED
kafka.api.SaslSslAdminClientIntegrationTest > testDescribeReplicaLogDirs PASSED
kafka.api.SaslSslAdminClientIntegrationTest > testInvalidAlterConfigs STARTED
kafka.api.SaslSslAdminClientIntegrationTest > testInvalidAlterConfigs PASSED
kafka.api.SaslSslAdminClientIntegrationTest > testAlterLogDirsAfterDeleteRecords STARTED
kafka.api.SaslSslAdminClientIntegrationTest > testAlterLogDirsAfterDeleteRecords PASSED
kafka.api.SaslSslAdminClientIntegrationTest > testConsumeAfterDeleteRecords STARTED
kafka.api.SaslSslAdminClientIntegrationTest > testConsumeAfterDeleteRecords PASSED
kafka.api.SaslSslAdminClientIntegrationTest > testClose STARTED
kafka.api.SaslSslAdminClientIntegrationTest > testClose PASSED
kafka.api.SaslSslAdminClientIntegrationTest > testReplicaCanFetchFromLogStartOffsetAfterDeleteRecords STARTED
kafka.api.SaslSslAdminClientIntegrationTest > testReplicaCanFetchFromLogStartOffsetAfterDeleteRecords PASSED
kafka.api.SaslSslAdminClientIntegrationTest > testMinimumRequestTimeouts STARTED
kafka.api.SaslSslAdminClientIntegrationTest > testMinimumRequestTimeouts PASSED
kafka.api.SaslSslAdminClientIntegrationTest > testForceClose STARTED
kafka.api.SaslSslAdminClientIntegrationTest > testForceClose PASSED
kafka.api.SaslSslAdminClientIntegrationTest > testListNodes STARTED
kafka.api.SaslSslAdminClientIntegrationTest > testListNodes PASSED
kafka.api.SaslSslAdminClientIntegrationTest > testDelayedClose STARTED
kafka.api.SaslSslAdminClientIntegrationTest > testDelayedClose PASSED
kafka.api.SaslSslAdminClientIntegrationTest > testCreateDeleteTopics STARTED
kafka.api.SaslSslAdminClientIntegrationTest > testCreateDeleteTopics PASSED
kafka.api.SaslSslAdminClientIntegrationTest > testOffsetsForTimesAfterDeleteRecords STARTED
kafka.api.SaslSslAdminClientIntegrationTest > testOffsetsForTimesAfterDeleteRecords PASSED
kafka.api.SaslSslAdminClientIntegrationTest > testDeleteRecordsWithException STARTED
kafka.api.SaslSslAdminClientIntegrationTest > testDeleteRecordsWithException PASSED
kafka.api.SaslSslAdminClientIntegrationTest > testDescribeLogDirs STARTED
kafka.api.SaslSslAdminClientIntegrationTest > testDescribeLogDirs PASSED
kafka.api.SaslSslAdminClientIntegrationTest > testAlterReplicaLogDirs STARTED
kafka.api.SaslSslAdminClientIntegrationTest > testAlterReplicaLogDirs PASSED
kafka.api.SaslSslAdminClientIntegrationTest > testLogStartOffsetCheckpoint STARTED
kafka.api.SaslSslAdminClientIntegrationTest > testLogStartOffsetCheckpoint PASSED
kafka.api.SaslSslAdminClientIntegrationTest > testDescribeCluster STARTED
kafka.api.SaslSslAdminClientIntegrationTest > testDescribeCluster PASSED
kafka.api.SaslSslAdminClientIntegrationTest > testCreatePartitions STARTED
kafka.api.SaslSslAdminClientIntegrationTest > testCreatePartitions PASSED
kafka.api.SaslSslAdminClientIntegrationTest > testDescribeNonExistingTopic STARTED
kafka.api.SaslSslAdminClientIntegrationTest > testDescribeNonExistingTopic PASSED
kafka.api.SaslSslAdminClientIntegrationTest > testMetadataRefresh STARTED
kafka.api.SaslSslAdminClientIntegrationTest > testMetadataRefresh PASSED
kafka.api.SaslSslAdminClientIntegrationTest > testDescribeAndAlterConfigs STARTED
kafka.api.SaslSslAdminClientIntegrationTest > testDescribeAndAlterConfigs PASSED
kafka.api.SaslSslAdminClientIntegrationTest > testLogStartOffsetAfterDeleteRecords STARTED
kafka.api.SaslSslAdminClientIntegrationTest > testLogStartOffsetAfterDeleteRecords PASSED
kafka.api.SaslSslAdminClientIntegrationTest > testSeekAfterDeleteRecords STARTED
kafka.api.SaslSslAdminClientIntegrationTest > testSeekAfterDeleteRecords PASSED
kafka.api.SaslSslAdminClientIntegrationTest > testCallInFlightTimeouts STARTED
kafka.api.SaslSslAdminClientIntegrationTest > testCallInFlightTimeouts PASSED
kafka.api.SaslSslAdminClientIntegrationTest > testDescribeConfigsForTopic STARTED
kafka.api.SaslSslAdminClientIntegrationTest > testDescribeConfigsForTopic PASSED
kafka.api.SaslSslAdminClientIntegrationTest > testConsumerGroups STARTED
kafka.api.SaslSslAdminClientIntegrationTest > testConsumerGroups PASSED
kafka.api.SslProducerSendTest > testSendNonCompressedMessageWithCreateTime STARTED
kafka.api.SslProducerSendTest > testSendNonCompressedMessageWithCreateTime PASSED
kafka.api.SslProducerSendTest > testClose STARTED
kafka.api.SslProducerSendTest > testClose PASSED
kafka.api.SslProducerSendTest > testFlush STARTED
kafka.api.SslProducerSendTest > testFlush PASSED
kafka.api.SslProducerSendTest > testSendToPartition STARTED
kafka.api.SslProducerSendTest > testSendToPartition PASSED
kafka.api.SslProducerSendTest > testSendOffset STARTED
kafka.api.SslProducerSendTest > testSendOffset PASSED
kafka.api.SslProducerSendTest > testSendCompressedMessageWithCreateTime STARTED
kafka.api.SslProducerSendTest > testSendCompressedMessageWithCreateTime PASSED
kafka.api.SslProducerSendTest > testCloseWithZeroTimeoutFromCallerThread STARTED
kafka.api.SslProducerSendTest > testCloseWithZeroTimeoutFromCallerThread PASSED
kafka.api.SslProducerSendTest > testCloseWithZeroTimeoutFromSenderThread STARTED
kafka.api.SslProducerSendTest > testCloseWithZeroTimeoutFromSenderThread PASSED
kafka.api.SslProducerSendTest > testSendBeforeAndAfterPartitionExpansion STARTED
kafka.api.SslProducerSendTest > testSendBeforeAndAfterPartitionExpansion PASSED
kafka.api.PlaintextConsumerTest > testEarliestOrLatestOffsets STARTED
kafka.api.PlaintextConsumerTest > testEarliestOrLatestOffsets PASSED
kafka.api.PlaintextConsumerTest > testPartitionsForAutoCreate STARTED
kafka.api.PlaintextConsumerTest > testPartitionsForAutoCreate PASSED
kafka.api.PlaintextConsumerTest > testShrinkingTopicSubscriptions STARTED
kafka.api.PlaintextConsumerTest > testShrinkingTopicSubscriptions PASSED
kafka.api.PlaintextConsumerTest > testMaxPollIntervalMs STARTED
kafka.api.PlaintextConsumerTest > testMaxPollIntervalMs PASSED
kafka.api.PlaintextConsumerTest > testOffsetsForTimes STARTED
kafka.api.PlaintextConsumerTest > testOffsetsForTimes PASSED
kafka.api.PlaintextConsumerTest > testSubsequentPatternSubscription STARTED
kafka.api.PlaintextConsumerTest > testSubsequentPatternSubscription PASSED
kafka.api.PlaintextConsumerTest > testPerPartitionLeadMetricsCleanUpWithAssign STARTED
kafka.api.PlaintextConsumerTest > testPerPartitionLeadMetricsCleanUpWithAssign PASSED
kafka.api.PlaintextConsumerTest > testConsumeMessagesWithCreateTime STARTED
kafka.api.PlaintextConsumerTest > testConsumeMessagesWithCreateTime PASSED
kafka.api.PlaintextConsumerTest > testAsyncCommit STARTED
kafka.api.PlaintextConsumerTest > testAsyncCommit PASSED
kafka.api.PlaintextConsumerTest > testLowMaxFetchSizeForRequestAndPartition STARTED
ERROR: Could not install GRADLE_4_8_1_HOME
java.lang.NullPointerException
ERROR: Could not install GRADLE_4_8_1_HOME
java.lang.NullPointerException
ERROR: Could not install GRADLE_4_8_1_HOME
java.lang.NullPointerException
ERROR: Could not install GRADLE_4_8_1_HOME
java.lang.NullPointerException
Build timed out (after 360 minutes). Marking the build as failed.
Build was aborted
[FINDBUGS] Collecting findbugs analysis files...
Setting GRADLE_4_8_1_HOME=/home/jenkins/tools/gradle/4.8.1
kafka.api.PlaintextConsumerTest > testLowMaxFetchSizeForRequestAndPartition SKIPPED
> Task :kafka-2.0-jdk8:core:test FAILED
> Task :testScala_2_12 FAILED
FAILURE: Build failed with an exception.
* What went wrong:
Execution failed for task ':kafka-2.0-jdk8:core:test'.
> Process 'Gradle Test Executor 7' finished with non-zero exit value 143
This problem might be caused by incorrect test process configuration.
Please refer to the test execution section in the user guide at https://docs.gradle.org/4.8.1/userguide/java_plugin.html#sec:test_execution
* Try:
Run with --stacktrace option to get the stack trace. Run with --info or --debug option to get more log output. Run with --scan to get full insights.
* Get more help at https://help.gradle.org
BUILD FAILED in 5h 59m 45s
26 actionable tasks: 4 executed, 22 up-to-date
[FINDBUGS] Searching for all files in <https://builds.apache.org/job/kafka-2.0-jdk8/ws/> that match the pattern **/build/reports/findbugs/*.xml
[FINDBUGS] Parsing 2 files in <https://builds.apache.org/job/kafka-2.0-jdk8/ws/>
[FINDBUGS] Successfully parsed file <https://builds.apache.org/job/kafka-2.0-jdk8/ws/core/build/reports/findbugs/main.xml> with 0 unique warnings and 0 duplicates.
[FINDBUGS] Successfully parsed file <https://builds.apache.org/job/kafka-2.0-jdk8/ws/streams/streams-scala/build/reports/findbugs/main.xml> with 0 unique warnings and 0 duplicates.
Setting GRADLE_4_8_1_HOME=/home/jenkins/tools/gradle/4.8.1
No credentials specified
Setting GRADLE_4_8_1_HOME=/home/jenkins/tools/gradle/4.8.1
<Git Blamer> Using GitBlamer to create author and commit information for all warnings.
<Git Blamer> GIT_COMMIT=1150745dc5dc06a001d9fe958a8234b14147a17b, workspace=<https://builds.apache.org/job/kafka-2.0-jdk8/ws/>
[FINDBUGS] Computing warning deltas based on reference build #262
Recording test results
Setting GRADLE_4_8_1_HOME=/home/jenkins/tools/gradle/4.8.1
Setting GRADLE_4_8_1_HOME=/home/jenkins/tools/gradle/4.8.1
Jenkins build is back to normal : kafka-2.0-jdk8 #264
Posted by Apache Jenkins Server <je...@builds.apache.org>.
See <https://builds.apache.org/job/kafka-2.0-jdk8/264/display/redirect?page=changes>