You are viewing a plain text version of this content. The canonical link for it is here.
Posted to builds@beam.apache.org by Apache Jenkins Server <je...@builds.apache.org> on 2021/08/02 13:06:19 UTC
Build failed in Jenkins: beam_PostCommit_Py_ValCont #8074
See <https://ci-beam.apache.org/job/beam_PostCommit_Py_ValCont/8074/display/redirect>
Changes:
------------------------------------------
[...truncated 108.65 KB...]
registries, e.g. `docker pull gcr.io/project-id/my-image`. Add
`--verbosity=error` to silence this warning: `gcloud docker
--verbosity=error -- pull gcr.io/project-id/my-image`.
See: https://cloud.google.com/container-registry/docs/support/deprecation-notices#gcloud-docker
> Task :sdks:python:test-suites:dataflow:py37:validatesContainer
function cleanup_container {
# Delete the container locally and remotely
docker rmi $CONTAINER:$TAG || echo "Failed to remove container image"
for image in $(docker images --format '{{.Repository}}:{{.Tag}}' | grep $PREBUILD_SDK_CONTAINER_REGISTRY_PATH)
do docker rmi $image || echo "Failed to remove prebuilt sdk container image"
done
gcloud --quiet container images delete $CONTAINER:$TAG || echo "Failed to delete container"
for digest in $(gcloud container images list-tags $PREBUILD_SDK_CONTAINER_REGISTRY_PATH/beam_python_prebuilt_sdk --format="get(digest)")
do gcloud container images delete $PREBUILD_SDK_CONTAINER_REGISTRY_PATH/beam_python_prebuilt_sdk@$digest --force-delete-tags --quiet || echo "Failed to remove prebuilt sdk container image"
done
echo "Removed the container"
}
trap cleanup_container EXIT
echo ">>> Successfully built and push container $CONTAINER"
cd sdks/python
SDK_LOCATION=$2
# Run ValidatesRunner tests on Google Cloud Dataflow service
echo ">>> RUNNING DATAFLOW RUNNER VALIDATESCONTAINER TEST"
pytest -o junit_suite_name=$IMAGE_NAME \
-m="it_validatescontainer" \
--show-capture=no \
--numprocesses=1 \
--timeout=900 \
--junitxml=$XUNIT_FILE \
--ignore-glob '.*py3\d?\.py$' \
--log-cli-level=INFO \
--test-pipeline-options=" \
--runner=TestDataflowRunner \
--project=$PROJECT \
--region=$REGION \
--sdk_container_image=$CONTAINER:$TAG \
--staging_location=$GCS_LOCATION/staging-validatesrunner-test \
--temp_location=$GCS_LOCATION/temp-validatesrunner-test \
--output=$GCS_LOCATION/output \
--sdk_location=$SDK_LOCATION \
--num_workers=1 \
--prebuild_sdk_container_base_image=$CONTAINER:$TAG \
--docker_registry_push_url=$PREBUILD_SDK_CONTAINER_REGISTRY_PATH"
> Task :sdks:python:test-suites:dataflow:py38:validatesContainer
function cleanup_container {
# Delete the container locally and remotely
docker rmi $CONTAINER:$TAG || echo "Failed to remove container image"
for image in $(docker images --format '{{.Repository}}:{{.Tag}}' | grep $PREBUILD_SDK_CONTAINER_REGISTRY_PATH)
do docker rmi $image || echo "Failed to remove prebuilt sdk container image"
done
gcloud --quiet container images delete $CONTAINER:$TAG || echo "Failed to delete container"
for digest in $(gcloud container images list-tags $PREBUILD_SDK_CONTAINER_REGISTRY_PATH/beam_python_prebuilt_sdk --format="get(digest)")
do gcloud container images delete $PREBUILD_SDK_CONTAINER_REGISTRY_PATH/beam_python_prebuilt_sdk@$digest --force-delete-tags --quiet || echo "Failed to remove prebuilt sdk container image"
done
echo "Removed the container"
}
trap cleanup_container EXIT
echo ">>> Successfully built and push container $CONTAINER"
cd sdks/python
SDK_LOCATION=$2
# Run ValidatesRunner tests on Google Cloud Dataflow service
echo ">>> RUNNING DATAFLOW RUNNER VALIDATESCONTAINER TEST"
pytest -o junit_suite_name=$IMAGE_NAME \
-m="it_validatescontainer" \
--show-capture=no \
--numprocesses=1 \
--timeout=900 \
--junitxml=$XUNIT_FILE \
--ignore-glob '.*py3\d?\.py$' \
--log-cli-level=INFO \
--test-pipeline-options=" \
--runner=TestDataflowRunner \
--project=$PROJECT \
--region=$REGION \
--sdk_container_image=$CONTAINER:$TAG \
--staging_location=$GCS_LOCATION/staging-validatesrunner-test \
--temp_location=$GCS_LOCATION/temp-validatesrunner-test \
--output=$GCS_LOCATION/output \
--sdk_location=$SDK_LOCATION \
--num_workers=1 \
--prebuild_sdk_container_base_image=$CONTAINER:$TAG \
--docker_registry_push_url=$PREBUILD_SDK_CONTAINER_REGISTRY_PATH"
> Task :sdks:python:test-suites:dataflow:py36:validatesContainer
function cleanup_container {
# Delete the container locally and remotely
docker rmi $CONTAINER:$TAG || echo "Failed to remove container image"
for image in $(docker images --format '{{.Repository}}:{{.Tag}}' | grep $PREBUILD_SDK_CONTAINER_REGISTRY_PATH)
do docker rmi $image || echo "Failed to remove prebuilt sdk container image"
done
gcloud --quiet container images delete $CONTAINER:$TAG || echo "Failed to delete container"
for digest in $(gcloud container images list-tags $PREBUILD_SDK_CONTAINER_REGISTRY_PATH/beam_python_prebuilt_sdk --format="get(digest)")
do gcloud container images delete $PREBUILD_SDK_CONTAINER_REGISTRY_PATH/beam_python_prebuilt_sdk@$digest --force-delete-tags --quiet || echo "Failed to remove prebuilt sdk container image"
done
echo "Removed the container"
}
trap cleanup_container EXIT
echo ">>> Successfully built and push container $CONTAINER"
cd sdks/python
SDK_LOCATION=$2
# Run ValidatesRunner tests on Google Cloud Dataflow service
echo ">>> RUNNING DATAFLOW RUNNER VALIDATESCONTAINER TEST"
pytest -o junit_suite_name=$IMAGE_NAME \
-m="it_validatescontainer" \
--show-capture=no \
--numprocesses=1 \
--timeout=900 \
--junitxml=$XUNIT_FILE \
--ignore-glob '.*py3\d?\.py$' \
--log-cli-level=INFO \
--test-pipeline-options=" \
--runner=TestDataflowRunner \
--project=$PROJECT \
--region=$REGION \
--sdk_container_image=$CONTAINER:$TAG \
--staging_location=$GCS_LOCATION/staging-validatesrunner-test \
--temp_location=$GCS_LOCATION/temp-validatesrunner-test \
--output=$GCS_LOCATION/output \
--sdk_location=$SDK_LOCATION \
--num_workers=1 \
--prebuild_sdk_container_base_image=$CONTAINER:$TAG \
--docker_registry_push_url=$PREBUILD_SDK_CONTAINER_REGISTRY_PATH"
> Task :sdks:python:test-suites:dataflow:py37:validatesContainer
echo ">>> SUCCESS DATAFLOW RUNNER VALIDATESCONTAINER TEST"
cleanup_container
docker images --format '{{.Repository}}:{{.Tag}}' | grep $PREBUILD_SDK_CONTAINER_REGISTRY_PATH
Digests:
- us.gcr.io/apache-beam-testing/jenkins/beam_python3.7_sdk@sha256:6d73cf93b5b42826c584d14aa83d294be7dbbc012b53a247d9cb0785b5ccf603
Associated tags:
- 20210802-121655380217549
Tags:
- us.gcr.io/apache-beam-testing/jenkins/beam_python3.7_sdk:20210802-121655380217549
Deleted [us.gcr.io/apache-beam-testing/jenkins/beam_python3.7_sdk:20210802-121655380217549].
Deleted [us.gcr.io/apache-beam-testing/jenkins/beam_python3.7_sdk@sha256:6d73cf93b5b42826c584d14aa83d294be7dbbc012b53a247d9cb0785b5ccf603].
gcloud container images list-tags $PREBUILD_SDK_CONTAINER_REGISTRY_PATH/beam_python_prebuilt_sdk --format="get(digest)"
Digests:
- us.gcr.io/apache-beam-testing/jenkins/prebuild_python37_sdk/beam_python_prebuilt_sdk@sha256:e00e7cab57fba632088df471db05e498496f8e9c40d5186c4be8a469f486e1f7
Associated tags:
- 53e4a5f7-ab83-41ef-87dd-d13179dc2fff
Deleted [us.gcr.io/apache-beam-testing/jenkins/prebuild_python37_sdk/beam_python_prebuilt_sdk:53e4a5f7-ab83-41ef-87dd-d13179dc2fff].
Deleted [us.gcr.io/apache-beam-testing/jenkins/prebuild_python37_sdk/beam_python_prebuilt_sdk@sha256:e00e7cab57fba632088df471db05e498496f8e9c40d5186c4be8a469f486e1f7].
Digests:
- us.gcr.io/apache-beam-testing/jenkins/prebuild_python37_sdk/beam_python_prebuilt_sdk@sha256:3404006d5de0d8e460349249c67820434527e102f281e49179e7b0835fd0a887
Associated tags:
- 066ea9f6-e214-460d-b022-ab304adbf2d2
Deleted [us.gcr.io/apache-beam-testing/jenkins/prebuild_python37_sdk/beam_python_prebuilt_sdk:066ea9f6-e214-460d-b022-ab304adbf2d2].
Deleted [us.gcr.io/apache-beam-testing/jenkins/prebuild_python37_sdk/beam_python_prebuilt_sdk@sha256:3404006d5de0d8e460349249c67820434527e102f281e49179e7b0835fd0a887].
> Task :sdks:python:test-suites:dataflow:py38:validatesContainer
echo ">>> SUCCESS DATAFLOW RUNNER VALIDATESCONTAINER TEST"
cleanup_container
docker images --format '{{.Repository}}:{{.Tag}}' | grep $PREBUILD_SDK_CONTAINER_REGISTRY_PATH
Digests:
- us.gcr.io/apache-beam-testing/jenkins/beam_python3.8_sdk@sha256:f344cc82d72d9b6310c5203b480b16d59f0ac3806f8a1ac983f83268dc43cafb
Associated tags:
- 20210802-121655643506343
Tags:
- us.gcr.io/apache-beam-testing/jenkins/beam_python3.8_sdk:20210802-121655643506343
Deleted [us.gcr.io/apache-beam-testing/jenkins/beam_python3.8_sdk:20210802-121655643506343].
Deleted [us.gcr.io/apache-beam-testing/jenkins/beam_python3.8_sdk@sha256:f344cc82d72d9b6310c5203b480b16d59f0ac3806f8a1ac983f83268dc43cafb].
gcloud container images list-tags $PREBUILD_SDK_CONTAINER_REGISTRY_PATH/beam_python_prebuilt_sdk --format="get(digest)"
Digests:
- us.gcr.io/apache-beam-testing/jenkins/prebuild_python38_sdk/beam_python_prebuilt_sdk@sha256:02203c52fd4f66e2e363121db4349ffc31f82d0058dc7eb86b99a958b62806d8
Associated tags:
- 8188d935-c65c-42e7-8651-55834b756a7f
Deleted [us.gcr.io/apache-beam-testing/jenkins/prebuild_python38_sdk/beam_python_prebuilt_sdk:8188d935-c65c-42e7-8651-55834b756a7f].
Deleted [us.gcr.io/apache-beam-testing/jenkins/prebuild_python38_sdk/beam_python_prebuilt_sdk@sha256:02203c52fd4f66e2e363121db4349ffc31f82d0058dc7eb86b99a958b62806d8].
Digests:
- us.gcr.io/apache-beam-testing/jenkins/prebuild_python38_sdk/beam_python_prebuilt_sdk@sha256:4b15c868df2b85cb6753e21b67ab47674feb2bbc7fb9e91cee9bed9324694816
Associated tags:
- 0aabc2a6-26d7-4dd6-8946-163e3292af3d
Deleted [us.gcr.io/apache-beam-testing/jenkins/prebuild_python38_sdk/beam_python_prebuilt_sdk:0aabc2a6-26d7-4dd6-8946-163e3292af3d].
Deleted [us.gcr.io/apache-beam-testing/jenkins/prebuild_python38_sdk/beam_python_prebuilt_sdk@sha256:4b15c868df2b85cb6753e21b67ab47674feb2bbc7fb9e91cee9bed9324694816].
> Task :sdks:python:test-suites:dataflow:py36:validatesContainer
cleanup_container
docker images --format '{{.Repository}}:{{.Tag}}' | grep $PREBUILD_SDK_CONTAINER_REGISTRY_PATH
Digests:
- us.gcr.io/apache-beam-testing/jenkins/beam_python3.6_sdk@sha256:84fb42c09359afe7e8dcbd1eb17db494c67b0c6a04b3e823302a6e07726e7b99
Associated tags:
- 20210802-121655823851375
Tags:
- us.gcr.io/apache-beam-testing/jenkins/beam_python3.6_sdk:20210802-121655823851375
Deleted [us.gcr.io/apache-beam-testing/jenkins/beam_python3.6_sdk:20210802-121655823851375].
Deleted [us.gcr.io/apache-beam-testing/jenkins/beam_python3.6_sdk@sha256:84fb42c09359afe7e8dcbd1eb17db494c67b0c6a04b3e823302a6e07726e7b99].
gcloud container images list-tags $PREBUILD_SDK_CONTAINER_REGISTRY_PATH/beam_python_prebuilt_sdk --format="get(digest)"
Digests:
- us.gcr.io/apache-beam-testing/jenkins/prebuild_python36_sdk/beam_python_prebuilt_sdk@sha256:c88b101d7578046499844a5b248c18335b7829f13312bf34e433045bdbedf1f9
Associated tags:
- 31559740-5c17-4cdc-8b64-c641b585721e
Deleted [us.gcr.io/apache-beam-testing/jenkins/prebuild_python36_sdk/beam_python_prebuilt_sdk:31559740-5c17-4cdc-8b64-c641b585721e].
Deleted [us.gcr.io/apache-beam-testing/jenkins/prebuild_python36_sdk/beam_python_prebuilt_sdk@sha256:c88b101d7578046499844a5b248c18335b7829f13312bf34e433045bdbedf1f9].
Digests:
- us.gcr.io/apache-beam-testing/jenkins/prebuild_python36_sdk/beam_python_prebuilt_sdk@sha256:d831bc9879cf7de08c8e1dc979beb24de2acb2ec6fdfefbea596fa84175d0bbf
Associated tags:
- 419e07a7-99d1-418a-8e59-a5b29cac179b
Deleted [us.gcr.io/apache-beam-testing/jenkins/prebuild_python36_sdk/beam_python_prebuilt_sdk:419e07a7-99d1-418a-8e59-a5b29cac179b].
Deleted [us.gcr.io/apache-beam-testing/jenkins/prebuild_python36_sdk/beam_python_prebuilt_sdk@sha256:d831bc9879cf7de08c8e1dc979beb24de2acb2ec6fdfefbea596fa84175d0bbf].
> Task :sdks:python:test-suites:dataflow:py36:validatesContainer FAILED
FAILURE: Build failed with an exception.
* Where:
Script '<https://ci-beam.apache.org/job/beam_PostCommit_Py_ValCont/ws/src/sdks/python/test-suites/dataflow/common.gradle'> line: 281
* What went wrong:
Execution failed for task ':sdks:python:test-suites:dataflow:py36:validatesContainer'.
> Process 'command 'sh'' finished with non-zero exit value 1
* Try:
Run with --stacktrace option to get the stack trace. Run with --info or --debug option to get more log output. Run with --scan to get full insights.
* Get more help at https://help.gradle.org
Deprecated Gradle features were used in this build, making it incompatible with Gradle 7.0.
Use '--warning-mode all' to show the individual deprecation warnings.
See https://docs.gradle.org/6.8.3/userguide/command_line_interface.html#sec:command_line_warnings
BUILD FAILED in 1h 5m 42s
51 actionable tasks: 47 executed, 4 up-to-date
Publishing build scan...
https://gradle.com/s/53ugolsqseuk2
Build step 'Invoke Gradle script' changed build result to FAILURE
Build step 'Invoke Gradle script' marked build as failure
---------------------------------------------------------------------
To unsubscribe, e-mail: builds-unsubscribe@beam.apache.org
For additional commands, e-mail: builds-help@beam.apache.org
Jenkins build is back to normal : beam_PostCommit_Py_ValCont #8075
Posted by Apache Jenkins Server <je...@builds.apache.org>.
See <https://ci-beam.apache.org/job/beam_PostCommit_Py_ValCont/8075/display/redirect?page=changes>
---------------------------------------------------------------------
To unsubscribe, e-mail: builds-unsubscribe@beam.apache.org
For additional commands, e-mail: builds-help@beam.apache.org