You are viewing a plain text version of this content. The canonical link for it is here.
Posted to issues@activemq.apache.org by "Matt Pavlovich (Jira)" <ji...@apache.org> on 2023/10/29 20:04:00 UTC

[jira] [Commented] (AMQ-9345) activemq-http AMQ9255Test is failing (testExpiredMessages)

    [ https://issues.apache.org/jira/browse/AMQ-9345?page=com.atlassian.jira.plugin.system.issuetabpanels:comment-tabpanel&focusedCommentId=17780765#comment-17780765 ] 

Matt Pavlovich commented on AMQ-9345:
-------------------------------------

Works for me on MacOS

{noformat}
[INFO] -------------------------------------------------------
[INFO]  T E S T S
[INFO] -------------------------------------------------------
[INFO] Running org.apache.activemq.bugs.AMQ9255Test
[INFO] Tests run: 1, Failures: 0, Errors: 0, Skipped: 0, Time elapsed: 33.71 s -- in org.apache.activemq.bugs.AMQ9255Test
[INFO] 
[INFO] Results:
[INFO] 
[INFO] Tests run: 1, Failures: 0, Errors: 0, Skipped: 0
{noformat}

> activemq-http AMQ9255Test is failing (testExpiredMessages)
> ----------------------------------------------------------
>
>                 Key: AMQ-9345
>                 URL: https://issues.apache.org/jira/browse/AMQ-9345
>             Project: ActiveMQ
>          Issue Type: Bug
>          Components: Test Cases, Transport
>    Affects Versions: 6.0.0, 5.18.3
>            Reporter: Jean-Baptiste Onofré
>            Assignee: Jean-Baptiste Onofré
>            Priority: Major
>             Fix For: 6.0.0, 5.18.4
>
>
> AMQ9255Test (in activemq-http module) is failing:
> {code:java}
> [ERROR] Tests run: 1, Failures: 1, Errors: 0, Skipped: 0, Time elapsed: 33.02 s <<< FAILURE! -- in org.apache.activemq.bugs.AMQ9255Test
> [ERROR] org.apache.activemq.bugs.AMQ9255Test.testExpiredMessages -- Time elapsed: 32.99 s <<< FAILURE!
> java.lang.AssertionError
>         at org.junit.Assert.fail(Assert.java:87)
>         at org.junit.Assert.assertTrue(Assert.java:42)
>         at org.junit.Assert.assertNotNull(Assert.java:713)
>         at org.junit.Assert.assertNotNull(Assert.java:723)
>         at org.apache.activemq.bugs.AMQ9255Test.testExpiredMessages(AMQ9255Test.java:147)
>         at java.base/jdk.internal.reflect.NativeMethodAccessorImpl.invoke0(Native Method)
>         at java.base/jdk.internal.reflect.NativeMethodAccessorImpl.invoke(NativeMethodAccessorImpl.java:77)
>         at java.base/jdk.internal.reflect.DelegatingMethodAccessorImpl.invoke(DelegatingMethodAccessorImpl.java:43)
>         at java.base/java.lang.reflect.Method.invoke(Method.java:568)
>         at org.junit.runners.model.FrameworkMethod$1.runReflectiveCall(FrameworkMethod.java:59)
>         at org.junit.internal.runners.model.ReflectiveCallable.run(ReflectiveCallable.java:12)
>         at org.junit.runners.model.FrameworkMethod.invokeExplosively(FrameworkMethod.java:56)
>         at org.junit.internal.runners.statements.InvokeMethod.evaluate(InvokeMethod.java:17)
>         at org.junit.internal.runners.statements.RunBefores.evaluate(RunBefores.java:26)
>         at org.junit.internal.runners.statements.RunAfters.evaluate(RunAfters.java:27)
>         at org.junit.rules.TestWatcher$1.evaluate(TestWatcher.java:61)
>         at org.junit.runners.ParentRunner$3.evaluate(ParentRunner.java:306)
>         at org.junit.runners.BlockJUnit4ClassRunner$1.evaluate(BlockJUnit4ClassRunner.java:100)
>         at org.junit.runners.ParentRunner.runLeaf(ParentRunner.java:366)
>         at org.junit.runners.BlockJUnit4ClassRunner.runChild(BlockJUnit4ClassRunner.java:103)
>         at org.junit.runners.BlockJUnit4ClassRunner.runChild(BlockJUnit4ClassRunner.java:63)
>         at org.junit.runners.ParentRunner$4.run(ParentRunner.java:331)
>         at org.junit.runners.ParentRunner$1.schedule(ParentRunner.java:79)
>         at org.junit.runners.ParentRunner.runChildren(ParentRunner.java:329)
>         at org.junit.runners.ParentRunner.access$100(ParentRunner.java:66)
>         at org.junit.runners.ParentRunner$2.evaluate(ParentRunner.java:293)
>         at org.junit.runners.ParentRunner$3.evaluate(ParentRunner.java:306)
>         at org.junit.runners.ParentRunner.run(ParentRunner.java:413)
>         at org.apache.maven.surefire.junit4.JUnit4Provider.execute(JUnit4Provider.java:316)
>         at org.apache.maven.surefire.junit4.JUnit4Provider.executeWithRerun(JUnit4Provider.java:240)
>         at org.apache.maven.surefire.junit4.JUnit4Provider.executeTestSet(JUnit4Provider.java:214)
>         at org.apache.maven.surefire.junit4.JUnit4Provider.invoke(JUnit4Provider.java:155)
>         at org.apache.maven.surefire.booter.ForkedBooter.runSuitesInProcess(ForkedBooter.java:385)
>         at org.apache.maven.surefire.booter.ForkedBooter.execute(ForkedBooter.java:162)
>         at org.apache.maven.surefire.booter.ForkedBooter.run(ForkedBooter.java:507)
>         at org.apache.maven.surefire.booter.ForkedBooter.main(ForkedBooter.java:495) {code}



--
This message was sent by Atlassian Jira
(v8.20.10#820010)