You are viewing a plain text version of this content. The canonical link for it is here.
Posted to builds@beam.apache.org by Apache Jenkins Server <je...@builds.apache.org> on 2022/02/15 00:34:59 UTC
Build failed in Jenkins: beam_PostCommit_Java_Examples_Dataflow_V2_java17 #229
See <https://ci-beam.apache.org/job/beam_PostCommit_Java_Examples_Dataflow_V2_java17/229/display/redirect?page=changes>
Changes:
[Kyle Weaver] [BEAM-12712] Spark: Exclude looping timer tests.
[Kyle Weaver] [BEAM-13919] Annotate PerKeyOrderingTest with UsesStatefulParDo.
[artur.khanin] Updated example link
[noreply] [BEAM-13894] Unit test utilities in the ptest package (#16830)
[noreply] [BEAM-13922] [Coverage] Make boot.go more testable and add tests
[noreply] Exclude SpannerChangeStream IT from Dataflow V1 postcommit (#16851)
[noreply] [BEAM-13930] Address StateSpec consistency issue between Runner and Fn
------------------------------------------
[...truncated 44.61 KB...]
Note: Recompile with -Xlint:unchecked for details.
> Task :runners:google-cloud-dataflow-java:jar
> Task :examples:java:classes
> Task :examples:java:jar
> Task :sdks:java:container:java17:docker
---> edecc9dd94ad
Step 6/19 : ADD target/slf4j-jdk14.jar /opt/apache/beam/jars/
---> c953d497440d
Step 7/19 : ADD target/beam-sdks-java-harness.jar /opt/apache/beam/jars/
---> c6de5315065e
Step 8/19 : ADD target/beam-sdks-java-io-kafka.jar /opt/apache/beam/jars/
---> 4bea9a9c7a7c
Step 9/19 : ADD target/kafka-clients.jar /opt/apache/beam/jars/
---> 3e6b5c42bb18
Step 10/19 : ADD target/jamm.jar /opt/apache/beam/jars/
---> 6bc50752fc76
Step 11/19 : ADD target/linux_amd64/boot /opt/apache/beam/
---> 432bae5a41d9
Step 12/19 : COPY target/LICENSE /opt/apache/beam/
---> 377ddfa38e2f
Step 13/19 : COPY target/NOTICE /opt/apache/beam/
---> a7121d1f35dd
Step 14/19 : ADD target/third_party_licenses /opt/apache/beam/third_party_licenses/
---> 7056853dec1b
Step 15/19 : COPY target/LICENSE target/go-licenses/* /opt/apache/beam/third_party_licenses/golang/
---> 6ee93f223e64
Step 16/19 : RUN rm /opt/apache/beam/third_party_licenses/golang/LICENSE
---> Running in cdb3e7ac90d0
Removing intermediate container cdb3e7ac90d0
---> caacbbe32a88
Step 17/19 : RUN if [ "${pull_licenses}" = "false" ] ; then rm -rf /opt/apache/beam/third_party_licenses ; fi
---> Running in e7ded5777f91
Removing intermediate container e7ded5777f91
---> dcbb0f39d8fe
Step 18/19 : COPY target/profiler/* /opt/google_cloud_profiler/
---> baf9edacc261
Step 19/19 : ENTRYPOINT ["/opt/apache/beam/boot"]
---> Running in 35e0e278383f
Removing intermediate container 35e0e278383f
---> 59a88fa39d3c
Successfully built 59a88fa39d3c
Successfully tagged apache/beam_java17_sdk:2.38.0.dev
> Task :runners:google-cloud-dataflow-java:buildAndPushDockerJavaContainer
WARNING: `gcloud docker` will not be supported for Docker client versions above 18.03.
As an alternative, use `gcloud auth configure-docker` to configure `docker` to
use `gcloud` as a credential helper, then use `docker` as you would for non-GCR
registries, e.g. `docker pull gcr.io/project-id/my-image`. Add
`--verbosity=error` to silence this warning: `gcloud docker
--verbosity=error -- pull gcr.io/project-id/my-image`.
See: https://cloud.google.com/container-registry/docs/support/deprecation-notices#gcloud-docker
> Task :examples:java:compileTestJava
Note: Some input files use or override a deprecated API.
Note: Recompile with -Xlint:deprecation for details.
Note: Some input files use unchecked or unsafe operations.
Note: Recompile with -Xlint:unchecked for details.
> Task :examples:java:testClasses
> Task :examples:java:testJar
> Task :runners:google-cloud-dataflow-java:buildAndPushDockerJavaContainer
The push refers to repository [us.gcr.io/apache-beam-testing/java-postcommit-it/java]
91f6a472ed9e: Preparing
3205d407683a: Preparing
7e1e527e8c16: Preparing
cbd474290242: Preparing
eecd47914e13: Preparing
cb55153cdec6: Preparing
1a3458adf17d: Preparing
e382e5279923: Preparing
ba6fcc742d4a: Preparing
3517a0677974: Preparing
72efb56fe512: Preparing
9e03587b1bd6: Preparing
c9fd851e8ac2: Preparing
5331ce361341: Preparing
babf5ef2e3ab: Preparing
613ab28cf833: Preparing
bed676ceab7a: Preparing
6398d5cccd2c: Preparing
ba6fcc742d4a: Waiting
1a3458adf17d: Waiting
e382e5279923: Waiting
3517a0677974: Waiting
cb55153cdec6: Waiting
c9fd851e8ac2: Waiting
72efb56fe512: Waiting
5331ce361341: Waiting
9e03587b1bd6: Waiting
613ab28cf833: Waiting
babf5ef2e3ab: Waiting
bed676ceab7a: Waiting
0b0f2f2f5279: Preparing
6398d5cccd2c: Waiting
0b0f2f2f5279: Waiting
3205d407683a: Pushed
eecd47914e13: Pushed
7e1e527e8c16: Pushed
91f6a472ed9e: Pushed
cb55153cdec6: Pushed
cbd474290242: Pushed
e382e5279923: Pushed
3517a0677974: Pushed
1a3458adf17d: Pushed
ba6fcc742d4a: Pushed
5331ce361341: Layer already exists
babf5ef2e3ab: Layer already exists
613ab28cf833: Layer already exists
bed676ceab7a: Layer already exists
6398d5cccd2c: Layer already exists
9e03587b1bd6: Pushed
0b0f2f2f5279: Layer already exists
c9fd851e8ac2: Pushed
72efb56fe512: Pushed
20220215000056: digest: sha256:671496c9076c12668ed5b04d08ce16c8ae8649eb985f2bace15458eeb97e5747 size: 4314
> Task :runners:google-cloud-dataflow-java:examplesJavaRunnerV2IntegrationTest
***********************************************************
***********************************************************
**********************Set Up Pubsub************************
The Pub/Sub topic has been set up for this example: projects/apache-beam-testing/topics/testpipeline-jenkins-0215000448-ca119a6c
The Pub/Sub subscription has been set up for this example: projects/apache-beam-testing/subscriptions/testpipeline-jenkins-0215000448-ca119a6c
******************Set Up Big Query Table*******************
The BigQuery table has been set up for this example: apache-beam-testing:traffic_max_lane_flow_1644883482502.traffic_max_lane_flow_table
*************************Tear Down*************************
The Pub/Sub topic has been deleted: projects/apache-beam-testing/topics/testpipeline-jenkins-0215000448-ca119a6c
The Pub/Sub subscription has been deleted: projects/apache-beam-testing/subscriptions/testpipeline-jenkins-0215000448-ca119a6c
The BigQuery table might contain the example's output, and it is not deleted automatically: apache-beam-testing:traffic_max_lane_flow_1644883482502.traffic_max_lane_flow_table
Please go to the Developers Console to delete it manually. Otherwise, you may be charged for its usage.
***********************************************************
***********************************************************
***********************************************************
***********************************************************
**********************Set Up Pubsub************************
The Pub/Sub topic has been set up for this example: projects/apache-beam-testing/topics/testpipeline-jenkins-0215000449-1bb6b785
The Pub/Sub subscription has been set up for this example: projects/apache-beam-testing/subscriptions/testpipeline-jenkins-0215000449-1bb6b785
******************Set Up Big Query Table*******************
The BigQuery table has been set up for this example: apache-beam-testing:traffic_routes_1644883482517.traffic_routes_table
*************************Tear Down*************************
The Pub/Sub topic has been deleted: projects/apache-beam-testing/topics/testpipeline-jenkins-0215000449-1bb6b785
The Pub/Sub subscription has been deleted: projects/apache-beam-testing/subscriptions/testpipeline-jenkins-0215000449-1bb6b785
The BigQuery table might contain the example's output, and it is not deleted automatically: apache-beam-testing:traffic_routes_1644883482517.traffic_routes_table
Please go to the Developers Console to delete it manually. Otherwise, you may be charged for its usage.
***********************************************************
***********************************************************
org.apache.beam.examples.snippets.transforms.io.gcp.bigquery.BigQuerySamplesIT > testTableIO FAILED
java.lang.RuntimeException at BigQuerySamplesIT.java:121
org.apache.beam.examples.cookbook.BigQueryTornadoesIT > testE2eBigQueryTornadoesWithStorageApiUsingQuery FAILED
java.lang.RuntimeException at BigQueryTornadoesIT.java:68
8 tests completed, 2 failed
> Task :runners:google-cloud-dataflow-java:examplesJavaRunnerV2IntegrationTest FAILED
> Task :runners:google-cloud-dataflow-java:cleanUpDockerJavaImages
Untagged: us.gcr.io/apache-beam-testing/java-postcommit-it/java:20220215000056
Untagged: us.gcr.io/apache-beam-testing/java-postcommit-it/java@sha256:671496c9076c12668ed5b04d08ce16c8ae8649eb985f2bace15458eeb97e5747
Deleted: sha256:59a88fa39d3c398d1564e1f5d837b0318edaeaaf4295b12f94dbf9aead348eee
Deleted: sha256:baf9edacc2619e06983df629291c96f51cd9dcd37c238dab82c23af1d03c3bf8
Deleted: sha256:618123dd574ccfb4668ab295ea7e2565a4801b213cd9e10e89b59a410b23abd0
Deleted: sha256:dcbb0f39d8fe397e24aca6e7c4868cb8f5207fd934520130a5190c1e5d90c0d9
Deleted: sha256:caacbbe32a88470ad23eaed75d320466372542b7db8608bf4c26704285f49d7d
Deleted: sha256:f85cf1154ce94d947387bd659daf45704db08c4640c94e790327da9ea147ebb2
Deleted: sha256:6ee93f223e64920f52ba23daec5b3bc25f3439a3fb98142ccbfb5f5955e1f9ab
Deleted: sha256:c69f3ec4bacad18cd840765ce5eca81850840e08954866706a3c359051a2b061
Deleted: sha256:7056853dec1bdd8b3908230735198b4f5cf0e3b46b35b0ae27ec03d242c8ed82
Deleted: sha256:141e698b6b6158e0a756cc2ba4ed1bdc88f6b3b14846275168540b17a9d15622
Deleted: sha256:a7121d1f35ddb2398d80d3a4b8dc7c6bd9b98d79dcec60c40f68e0f5fd023cfe
Deleted: sha256:9bcb0c814c66e8dcdf59f69c9ee48598eebb64e05c6b9092898c98a00d3755e6
Deleted: sha256:377ddfa38e2fe167a03df5711c9d4cd8e2b1520ec95987cf418a1285e43c887f
Deleted: sha256:942af29c4a2784b7ff69e998cc2b8d921e6a594479f86deed8d96878f2161790
Deleted: sha256:432bae5a41d91c9253c8b38ccbaa0b837eedd3657644e00dac602dce353ec19b
Deleted: sha256:cc32ab986ebfd0ea9f82c60a510ca75e38916a2b609767b6ae17a2b0ecc3c155
Deleted: sha256:6bc50752fc7681ced41908439c91eaf6a6fe1914afeb7ff27eb27586d47c01cb
Deleted: sha256:6c568aa6cfb0960799ccf83c6c328c255c43cf982585b8e972a15816bf051c12
Deleted: sha256:3e6b5c42bb18d786caffcec94b45031778c71c8e0797c583c145fa078830858b
Deleted: sha256:2eeb1154f0ee2da13ae19ce1023707841bccfbff1b2e826c275e4dbdc455be38
Deleted: sha256:4bea9a9c7a7cb1148a354aa21a826e95129883edd281a306eed94746a8c4ee48
Deleted: sha256:9744cb368f0256521501d0de32e94a3d7b16a71791b540f5edc457f93d2a1a2b
Deleted: sha256:c6de5315065e58db3cc2c0fba285e6da2d4782ff3b8c298f0a1f3c4c92b777c1
Deleted: sha256:867b6c0bd554abcefb73dcffc19feaa74249f0dbfcc8311f8e44895314cd0bd1
Deleted: sha256:c953d497440d32c04a728054faa31643521080ab9480b00c7eca7447bc887fe3
Deleted: sha256:967c92df908b534926f4f1647be6bfa8aa349eb3f8489fee5c9c8097513daa65
Deleted: sha256:edecc9dd94adaaf6b55b4cdfffe0c205dd165e4de91d1482b6b73c57917a390c
Deleted: sha256:b52b5b87c37e45b27f5ffa19a08b79b7d96f602735ed2d1c67bb0621ef572eb5
Deleted: sha256:4b1135b40696f7aa73afe6791a71700a1684fa6bcb78085bd87a895cf5c00f3e
Deleted: sha256:0c8ea672a5e5b430308aa5e83643919e7bedc777f20afcfdac140158a32838b7
ERROR: (gcloud.container.images.untag) Image could not be found: [us.gcr.io/apache-beam-testing/java-postcommit-it/java:20220215000056]
> Task :runners:google-cloud-dataflow-java:cleanUpDockerJavaImages FAILED
FAILURE: Build completed with 2 failures.
1: Task failed with an exception.
-----------
* What went wrong:
Execution failed for task ':runners:google-cloud-dataflow-java:examplesJavaRunnerV2IntegrationTest'.
> There were failing tests. See the report at: file://<https://ci-beam.apache.org/job/beam_PostCommit_Java_Examples_Dataflow_V2_java17/ws/src/runners/google-cloud-dataflow-java/build/reports/tests/examplesJavaRunnerV2IntegrationTest/index.html>
* Try:
> Run with --stacktrace option to get the stack trace.
> Run with --info or --debug option to get more log output.
> Run with --scan to get full insights.
==============================================================================
2: Task failed with an exception.
-----------
* Where:
Build file '<https://ci-beam.apache.org/job/beam_PostCommit_Java_Examples_Dataflow_V2_java17/ws/src/runners/google-cloud-dataflow-java/build.gradle'> line: 294
* What went wrong:
Execution failed for task ':runners:google-cloud-dataflow-java:cleanUpDockerJavaImages'.
> Process 'command 'gcloud'' finished with non-zero exit value 1
* Try:
> Run with --stacktrace option to get the stack trace.
> Run with --info or --debug option to get more log output.
> Run with --scan to get full insights.
==============================================================================
* Get more help at https://help.gradle.org
Deprecated Gradle features were used in this build, making it incompatible with Gradle 8.0.
You can use '--warning-mode all' to show the individual deprecation warnings and determine if they come from your own scripts or plugins.
See https://docs.gradle.org/7.3.2/userguide/command_line_interface.html#sec:command_line_warnings
Execution optimizations have been disabled for 1 invalid unit(s) of work during this build to ensure correctness.
Please consult deprecation warnings for more details.
BUILD FAILED in 34m 29s
88 actionable tasks: 77 executed, 9 from cache, 2 up-to-date
Publishing build scan...
https://gradle.com/s/b6aownmrv56zq
Build step 'Invoke Gradle script' changed build result to FAILURE
Build step 'Invoke Gradle script' marked build as failure
---------------------------------------------------------------------
To unsubscribe, e-mail: builds-unsubscribe@beam.apache.org
For additional commands, e-mail: builds-help@beam.apache.org
Jenkins build is back to normal : beam_PostCommit_Java_Examples_Dataflow_V2_java17 #230
Posted by Apache Jenkins Server <je...@builds.apache.org>.
See <https://ci-beam.apache.org/job/beam_PostCommit_Java_Examples_Dataflow_V2_java17/230/display/redirect?page=changes>
---------------------------------------------------------------------
To unsubscribe, e-mail: builds-unsubscribe@beam.apache.org
For additional commands, e-mail: builds-help@beam.apache.org