You are viewing a plain text version of this content. The canonical link for it is here.
Posted to dev@zookeeper.apache.org by Apache Jenkins Server <je...@builds.apache.org> on 2016/03/26 01:22:16 UTC
ZooKeeper-trunk - Build # 2868 - Failure
See https://builds.apache.org/job/ZooKeeper-trunk/2868/
###################################################################################
########################## LAST 60 LINES OF THE CONSOLE ###########################
[...truncated 390655 lines...]
[junit] at sun.nio.ch.SocketChannelImpl.checkConnect(Native Method)
[junit] at sun.nio.ch.SocketChannelImpl.finishConnect(SocketChannelImpl.java:744)
[junit] at org.apache.zookeeper.ClientCnxnSocketNIO.doTransport(ClientCnxnSocketNIO.java:355)
[junit] at org.apache.zookeeper.ClientCnxn$SendThread.run(ClientCnxn.java:1241)
[junit] 2016-03-26 00:21:52,581 [myid:] - INFO [main:JUnit4ZKTestRunner$LoggedInvokeMethod@82] - Memory used 20603
[junit] 2016-03-26 00:21:52,582 [myid:] - INFO [main:JUnit4ZKTestRunner$LoggedInvokeMethod@87] - Number of threads 55
[junit] 2016-03-26 00:21:52,582 [myid:] - INFO [main:JUnit4ZKTestRunner$LoggedInvokeMethod@102] - FINISHED TEST METHOD testManyChildWatchersAutoReset
[junit] 2016-03-26 00:21:52,582 [myid:] - INFO [main:ClientBase@537] - tearDown starting
[junit] 2016-03-26 00:21:52,583 [myid:] - INFO [ProcessThread(sid:0 cport:24690)::PrepRequestProcessor@647] - Processed session termination for sessionid: 0x101b9b42e8a0000
[junit] 2016-03-26 00:21:52,590 [myid:] - INFO [main:ZooKeeper@1110] - Session: 0x101b9b42e8a0000 closed
[junit] 2016-03-26 00:21:52,590 [myid:] - INFO [main-EventThread:ClientCnxn$EventThread@543] - EventThread shut down for session: 0x101b9b42e8a0000
[junit] 2016-03-26 00:21:52,591 [myid:] - INFO [ProcessThread(sid:0 cport:24690)::PrepRequestProcessor@647] - Processed session termination for sessionid: 0x101b9b42e8a0001
[junit] 2016-03-26 00:21:52,590 [myid:] - INFO [NIOWorkerThread-10:MBeanRegistry@128] - Unregister MBean [org.apache.ZooKeeperService:name0=StandaloneServer_port24690,name1=Connections,name2=127.0.0.1,name3=0x101b9b42e8a0000]
[junit] 2016-03-26 00:21:52,592 [myid:] - INFO [NIOWorkerThread-10:NIOServerCnxn@607] - Closed socket connection for client /127.0.0.1:37636 which had sessionid 0x101b9b42e8a0000
[junit] 2016-03-26 00:21:52,598 [myid:] - INFO [main:ZooKeeper@1110] - Session: 0x101b9b42e8a0001 closed
[junit] 2016-03-26 00:21:52,598 [myid:] - INFO [NIOWorkerThread-2:MBeanRegistry@128] - Unregister MBean [org.apache.ZooKeeperService:name0=StandaloneServer_port24690,name1=Connections,name2=127.0.0.1,name3=0x101b9b42e8a0001]
[junit] 2016-03-26 00:21:52,598 [myid:] - INFO [NIOWorkerThread-2:NIOServerCnxn@607] - Closed socket connection for client /127.0.0.1:37637 which had sessionid 0x101b9b42e8a0001
[junit] 2016-03-26 00:21:52,598 [myid:] - INFO [main-EventThread:ClientCnxn$EventThread@543] - EventThread shut down for session: 0x101b9b42e8a0001
[junit] 2016-03-26 00:21:52,598 [myid:] - INFO [main:ClientBase@507] - STOPPING server
[junit] 2016-03-26 00:21:52,599 [myid:] - INFO [ConnnectionExpirer:NIOServerCnxnFactory$ConnectionExpirerThread@583] - ConnnectionExpirerThread interrupted
[junit] 2016-03-26 00:21:52,601 [myid:] - INFO [NIOServerCxnFactory.AcceptThread:0.0.0.0/0.0.0.0:24690:NIOServerCnxnFactory$AcceptThread@219] - accept thread exitted run method
[junit] 2016-03-26 00:21:52,601 [myid:] - INFO [NIOServerCxnFactory.SelectorThread-1:NIOServerCnxnFactory$SelectorThread@420] - selector thread exitted run method
[junit] 2016-03-26 00:21:52,603 [myid:] - INFO [NIOServerCxnFactory.SelectorThread-0:NIOServerCnxnFactory$SelectorThread@420] - selector thread exitted run method
[junit] 2016-03-26 00:21:52,608 [myid:] - INFO [main:ZooKeeperServer@498] - shutting down
[junit] 2016-03-26 00:21:52,608 [myid:] - INFO [main:SessionTrackerImpl@232] - Shutting down
[junit] 2016-03-26 00:21:52,608 [myid:] - INFO [main:PrepRequestProcessor@965] - Shutting down
[junit] 2016-03-26 00:21:52,608 [myid:] - INFO [main:SyncRequestProcessor@191] - Shutting down
[junit] 2016-03-26 00:21:52,609 [myid:] - INFO [ProcessThread(sid:0 cport:24690)::PrepRequestProcessor@154] - PrepRequestProcessor exited loop!
[junit] 2016-03-26 00:21:52,610 [myid:] - INFO [SyncThread:0:SyncRequestProcessor@169] - SyncRequestProcessor exited!
[junit] 2016-03-26 00:21:52,610 [myid:] - INFO [main:FinalRequestProcessor@479] - shutdown of request processor complete
[junit] 2016-03-26 00:21:52,610 [myid:] - INFO [main:MBeanRegistry@128] - Unregister MBean [org.apache.ZooKeeperService:name0=StandaloneServer_port24690,name1=InMemoryDataTree]
[junit] 2016-03-26 00:21:52,611 [myid:] - INFO [main:MBeanRegistry@128] - Unregister MBean [org.apache.ZooKeeperService:name0=StandaloneServer_port24690]
[junit] 2016-03-26 00:21:52,611 [myid:] - INFO [main:FourLetterWordMain@85] - connecting to 127.0.0.1 24690
[junit] 2016-03-26 00:21:52,612 [myid:] - INFO [main:JMXEnv@146] - ensureOnly:[]
[junit] 2016-03-26 00:21:52,619 [myid:] - INFO [main:ClientBase@562] - fdcount after test is: 51 at start it was 51
[junit] 2016-03-26 00:21:52,619 [myid:] - INFO [main:ZKTestCase$1@65] - SUCCEEDED testManyChildWatchersAutoReset
[junit] 2016-03-26 00:21:52,619 [myid:] - INFO [main:ZKTestCase$1@60] - FINISHED testManyChildWatchersAutoReset
[junit] Tests run: 4, Failures: 0, Errors: 0, Skipped: 0, Time elapsed: 478.511 sec, Thread: 6, Class: org.apache.zookeeper.test.DisconnectedWatcherTest
BUILD FAILED
/home/jenkins/jenkins-slave/workspace/ZooKeeper-trunk/trunk/build.xml:1322: The following error occurred while executing this line:
/home/jenkins/jenkins-slave/workspace/ZooKeeper-trunk/trunk/build.xml:1207: Tests failed!
Total time: 11 minutes 5 seconds
Build step 'Execute shell' marked build as failure
[FINDBUGS] Skipping publisher since build result is FAILURE
[WARNINGS] Skipping publisher since build result is FAILURE
Archiving artifacts
Setting LATEST1_7_HOME=/home/jenkins/jenkins-slave/tools/hudson.model.JDK/latest1.7
Recording fingerprints
Setting LATEST1_7_HOME=/home/jenkins/jenkins-slave/tools/hudson.model.JDK/latest1.7
Recording test results
Setting LATEST1_7_HOME=/home/jenkins/jenkins-slave/tools/hudson.model.JDK/latest1.7
Publishing Javadoc
Setting LATEST1_7_HOME=/home/jenkins/jenkins-slave/tools/hudson.model.JDK/latest1.7
Email was triggered for: Failure - Any
Sending email for trigger: Failure - Any
Setting LATEST1_7_HOME=/home/jenkins/jenkins-slave/tools/hudson.model.JDK/latest1.7
Setting LATEST1_7_HOME=/home/jenkins/jenkins-slave/tools/hudson.model.JDK/latest1.7
###################################################################################
############################## FAILED TESTS (if any) ##############################
1 tests failed.
FAILED: org.apache.zookeeper.server.quorum.ReconfigRecoveryTest.testCurrentObserverIsParticipantInNewConfig
Error Message:
waiting for server 2 being up
Stack Trace:
junit.framework.AssertionFailedError: waiting for server 2 being up
at org.apache.zookeeper.server.quorum.ReconfigRecoveryTest.testCurrentObserverIsParticipantInNewConfig(ReconfigRecoveryTest.java:529)
at org.apache.zookeeper.JUnit4ZKTestRunner$LoggedInvokeMethod.evaluate(JUnit4ZKTestRunner.java:79)