You are viewing a plain text version of this content. The canonical link for it is here.
Posted to commits@activemq.apache.org by Apache Jenkins Server <je...@builds.apache.org> on 2023/07/04 17:23:51 UTC
Build failed in Jenkins: ActiveMQ » ActiveMQ-Artemis-JDK11 #1469
See <https://ci-builds.apache.org/job/ActiveMQ/job/ActiveMQ-Artemis-JDK11/1469/display/redirect?page=changes>
Changes:
[Robbie Gemmell] ARTEMIS-4341 refactor JavaDoc generation
------------------------------------------
[...truncated 1.08 MB...]
"accept" : [ "application/json; charset=utf-8" ]
},
"keepAlive" : true,
"secure" : true,
"protocol" : "HTTP_2",
"localAddress" : "127.0.0.1:40433",
"remoteAddress" : "127.0.0.1:39520",
"body" : "{\"apiVersion\":\"authentication.k8s.io/v1\",\"kind\":\"TokenReview\",\"spec\":{\"token\":\"other\"}}"
}
for action:
{
"statusCode" : 500
}
from expectation:
deda5f33-54a5-4579-94b1-4c154983620b
[MockServer-EventLog0] 17:20:51,464 INFO [org.mockserver.log.MockServerEventLog] 40433 verifying requests that match:
{
"httpRequest" : {
"path" : "/apis/authentication.k8s.io/v1/tokenreviews"
},
"times" : {
"atLeast" : 3,
"atMost" : 3
}
}
[MockServer-EventLog0] 17:20:51,470 INFO [org.mockserver.log.MockServerEventLog] request:
{
"path" : "/apis/authentication.k8s.io/v1/tokenreviews"
}
found exactly 3 times
[MockServer-EventLog0] 17:20:51,472 INFO [org.mockserver.log.MockServerEventLog] 40433 stopped for port: 40433
[INFO] Tests run: 2, Failures: 0, Errors: 0, Skipped: 0, Time elapsed: 3.799 s -- in org.apache.activemq.artemis.spi.core.security.jaas.kubernetes.client.KubernetesClientImplTest
[INFO] Running org.apache.activemq.artemis.spi.core.security.jaas.kubernetes.model.ServiceAccountPrincipalTest
[INFO] Tests run: 2, Failures: 0, Errors: 0, Skipped: 0, Time elapsed: 0 s -- in org.apache.activemq.artemis.spi.core.security.jaas.kubernetes.model.ServiceAccountPrincipalTest
[INFO] Running org.apache.activemq.artemis.spi.core.security.jaas.kubernetes.model.TokenReviewTest
[INFO] Tests run: 3, Failures: 0, Errors: 0, Skipped: 0, Time elapsed: 0 s -- in org.apache.activemq.artemis.spi.core.security.jaas.kubernetes.model.TokenReviewTest
[INFO] Running org.apache.activemq.artemis.tests.util.SimpleStringTest
[INFO] Tests run: 20, Failures: 0, Errors: 0, Skipped: 0, Time elapsed: 0.444 s -- in org.apache.activemq.artemis.tests.util.SimpleStringTest
[INFO] Running org.apache.activemq.artemis.uri.AcceptorParserTest
[INFO] Tests run: 3, Failures: 0, Errors: 0, Skipped: 0, Time elapsed: 0 s -- in org.apache.activemq.artemis.uri.AcceptorParserTest
[INFO] Running org.apache.activemq.artemis.uri.ClusterConnectionConfigurationTest
[INFO] Tests run: 6, Failures: 0, Errors: 0, Skipped: 0, Time elapsed: 0 s -- in org.apache.activemq.artemis.uri.ClusterConnectionConfigurationTest
[INFO]
[INFO] Results:
[INFO]
[ERROR] Failures:
[ERROR] JdbcLeaseLockTest.shouldNotifyOnceLostLockIfStopped:416->Assert.assertFalse:75->Assert.assertFalse:65->Assert.assertTrue:42->Assert.fail:87
[INFO]
[ERROR] Tests run: 999, Failures: 1, Errors: 0, Skipped: 110
[INFO]
[JENKINS] Recording test results
[INFO] ------------------------------------------------------------------------
[INFO] Reactor Summary for ActiveMQ Artemis Parent 2.30.0-SNAPSHOT:
[INFO]
[INFO] ActiveMQ Artemis Parent ............................ SUCCESS [ 15.082 s]
[INFO] ActiveMQ Artemis Unit Test Support ................. SUCCESS [ 12.959 s]
[INFO] ActiveMQ Log Annotation Processor .................. SUCCESS [ 30.768 s]
[INFO] ActiveMQ Artemis Commons ........................... SUCCESS [ 32.729 s]
[INFO] ActiveMQ Artemis Selector Implementation ........... SUCCESS [ 10.747 s]
[INFO] ActiveMQ Artemis Core Client ....................... SUCCESS [ 29.483 s]
[INFO] ActiveMQ Artemis Journal ........................... SUCCESS [ 14.483 s]
[INFO] ActiveMQ Artemis JDBC Store ........................ SUCCESS [ 58.106 s]
[INFO] ActiveMQ Artemis Quorum API ........................ SUCCESS [ 9.289 s]
[INFO] ActiveMQ Artemis Server ............................ FAILURE [02:48 min]
[INFO] ActiveMQ Artemis Protocols ......................... SKIPPED
[INFO] ActiveMQ Artemis AMQP Protocol ..................... SKIPPED
[INFO] ActiveMQ Artemis STOMP Protocol .................... SKIPPED
[INFO] ActiveMQ Artemis JMS Client ........................ SKIPPED
[INFO] ActiveMQ Artemis OpenWire Protocol ................. SKIPPED
[INFO] ActiveMQ Artemis HQClient Protocol ................. SKIPPED
[INFO] ActiveMQ Artemis HornetQ Protocol .................. SKIPPED
[INFO] ActiveMQ Artemis MQTT Protocol ..................... SKIPPED
[INFO] ActiveMQ Artemis DTO ............................... SKIPPED
[INFO] ActiveMQ Artemis Service Extensions ................ SKIPPED
[INFO] ActiveMQ Artemis JMS Server ........................ SKIPPED
[INFO] ActiveMQ Artemis CDI Integration ................... SKIPPED
[INFO] ActiveMQ Artemis Boot .............................. SKIPPED
[INFO] ActiveMQ Artemis JUnit ............................. SKIPPED
[INFO] ActiveMQ Artemis JUnit Commons ..................... SKIPPED
[INFO] ActiveMQ Artemis JUnit 4 Rules ..................... SKIPPED
[INFO] ActiveMQ Artemis CLI ............................... SKIPPED
[INFO] ActiveMQ Artemis Web ............................... SKIPPED
[INFO] ActiveMQ Artemis Core Client All ................... SKIPPED
[INFO] ActiveMQ Artemis Client OSGi ....................... SKIPPED
[INFO] ActiveMQ Artemis JUnit 5 Extensions ................ SKIPPED
[INFO] ActiveMQ Artemis JMS Client All .................... SKIPPED
[INFO] ActiveMQ Artemis JMS Client OSGi ................... SKIPPED
[INFO] ActiveMQ Artemis Jakarta Messaging Client .......... SKIPPED
[INFO] ActiveMQ Artemis Jakarta Messaging Client All ...... SKIPPED
[INFO] ActiveMQ Artemis Jakarta Service Extensions ........ SKIPPED
[INFO] ActiveMQ Artemis Jakarta Messaging Server .......... SKIPPED
[INFO] ActiveMQ Artemis RAR POM ........................... SKIPPED
[INFO] ActiveMQ Artemis Jakarta RAR ....................... SKIPPED
[INFO] ActiveMQ Artemis Maven Plugin ...................... SKIPPED
[INFO] ActiveMQ Artemis Server OSGi ....................... SKIPPED
[INFO] ActiveMQ Artemis Cons .............................. SKIPPED
[INFO] ActiveMQ Artemis HawtIO Branding ................... SKIPPED
[INFO] ActiveMQ Artemis HawtIO Plugin ..................... SKIPPED
[INFO] ActiveMQ Artemis Console ........................... SKIPPED
[INFO] ActiveMQ Artemis Spring Integration ................ SKIPPED
[INFO] ActiveMQ Artemis Quorum RI ......................... SKIPPED
[INFO] Apache ActiveMQ Artemis Distribution ............... SKIPPED
[INFO] ActiveMQ Artemis Tests POM ......................... SKIPPED
[INFO] ActiveMQ Artemis Test Support ...................... SKIPPED
[INFO] ActiveMQ Artemis Unit Tests ........................ SKIPPED
[INFO] ActiveMQ Artemis Joram Tests ....................... SKIPPED
[INFO] ActiveMQ Artemis timing Tests ...................... SKIPPED
[INFO] ActiveMQ Artemis JMS Tests ......................... SKIPPED
[INFO] ActiveMQ Artemis Integration Tests ................. SKIPPED
[INFO] ActiveMQ Artemis Isolated Integration Tests ........ SKIPPED
[INFO] ActiveMQ Artemis Features .......................... SKIPPED
[INFO] ActiveMQ Artemis Karaf Client Integration Tests .... SKIPPED
[INFO] ActiveMQ Artemis Karaf Server Integration Tests .... SKIPPED
[INFO] ActiveMQ Artemis Compatibility Tests ............... SKIPPED
[INFO] ActiveMQ Artemis soak Tests ........................ SKIPPED
[INFO] ActiveMQ Artemis stress Tests ...................... SKIPPED
[INFO] ActiveMQ Artemis performance Tests ................. SKIPPED
[INFO] Smoke Tests ........................................ SKIPPED
[INFO] End-to-End Tests ................................... SKIPPED
[INFO] ActiveMQ Artemis Leak Tests ........................ SKIPPED
[INFO] Apache ActiveMQ Artemis Image ...................... SKIPPED
[INFO] Apache ActiveMQ Artemis Image Examples ............. SKIPPED
[INFO] ------------------------------------------------------------------------
[INFO] BUILD FAILURE
[INFO] ------------------------------------------------------------------------
[INFO] Total time: 08:20 min
[INFO] Finished at: 2023-07-04T17:22:12Z
[INFO] ------------------------------------------------------------------------
[WARNING]
[WARNING] Plugin validation issues were detected in 6 plugin(s)
[WARNING]
[WARNING] * org.apache.maven.plugins:maven-site-plugin:3.12.1
[WARNING] * org.apache.felix:maven-bundle-plugin:5.1.9
[WARNING] * org.codehaus.mojo:javacc-maven-plugin:2.6
[WARNING] * org.codehaus.mojo:build-helper-maven-plugin:1.8
[WARNING] * org.apache.maven.plugins:maven-shade-plugin:3.4.1
[WARNING] * org.owasp:dependency-check-maven:6.1.0
[WARNING]
[WARNING] For more or less details, use 'maven.plugin.validation' property with one of the values (case insensitive): [BRIEF, DEFAULT, VERBOSE]
[WARNING]
Waiting for Jenkins to finish collecting data
[ERROR] Failed to execute goal org.apache.maven.plugins:maven-surefire-plugin:3.1.2:test (default-test) on project artemis-server: There are test failures.
[ERROR]
[ERROR] Please refer to <https://ci-builds.apache.org/job/ActiveMQ/job/ActiveMQ-Artemis-JDK11/ws/artemis-server/target/surefire-reports> for the individual test results.
[ERROR] Please refer to dump files (if any exist) [date].dump, [date]-jvmRun[N].dump and [date].dumpstream.
[ERROR] -> [Help 1]
[ERROR]
[ERROR] To see the full stack trace of the errors, re-run Maven with the -e switch.
[ERROR] Re-run Maven using the -X switch to enable full debug logging.
[ERROR]
[ERROR] For more information about the errors and possible solutions, please read the following articles:
[ERROR] [Help 1] http://cwiki.apache.org/confluence/display/MAVEN/MojoFailureException
[ERROR]
[ERROR] After correcting the problems, you can resume the build with the command
[ERROR] mvn <goals> -rf :artemis-server
[JENKINS] Archiving <https://ci-builds.apache.org/job/ActiveMQ/job/ActiveMQ-Artemis-JDK11/ws/artemis-server/pom.xml> to org.apache.activemq/artemis-server/2.30.0-SNAPSHOT/artemis-server-2.30.0-SNAPSHOT.pom
[JENKINS] Archiving <https://ci-builds.apache.org/job/ActiveMQ/job/ActiveMQ-Artemis-JDK11/ws/artemis-image/examples/pom.xml> to org.apache.activemq/artemis-image-examples/2.30.0-SNAPSHOT/artemis-image-examples-2.30.0-SNAPSHOT.pom
[JENKINS] Archiving <https://ci-builds.apache.org/job/ActiveMQ/job/ActiveMQ-Artemis-JDK11/ws/tests/compatibility-tests/pom.xml> to org.apache.activemq.tests/compatibility-tests/2.30.0-SNAPSHOT/compatibility-tests-2.30.0-SNAPSHOT.pom
[JENKINS] Archiving <https://ci-builds.apache.org/job/ActiveMQ/job/ActiveMQ-Artemis-JDK11/ws/artemis-jms-client/pom.xml> to org.apache.activemq/artemis-jms-client/2.30.0-SNAPSHOT/artemis-jms-client-2.30.0-SNAPSHOT.pom
[JENKINS] Archiving <https://ci-builds.apache.org/job/ActiveMQ/job/ActiveMQ-Artemis-JDK11/ws/artemis-hawtio/activemq-branding/pom.xml> to org.apache.activemq/activemq-branding/2.30.0-SNAPSHOT/activemq-branding-2.30.0-SNAPSHOT.pom
[JENKINS] Archiving <https://ci-builds.apache.org/job/ActiveMQ/job/ActiveMQ-Artemis-JDK11/ws/tests/smoke-tests/pom.xml> to org.apache.activemq.tests/smoke-tests/2.30.0-SNAPSHOT/smoke-tests-2.30.0-SNAPSHOT.pom
[JENKINS] Archiving <https://ci-builds.apache.org/job/ActiveMQ/job/ActiveMQ-Artemis-JDK11/ws/tests/joram-tests/pom.xml> to org.apache.activemq.tests/joram-tests/2.30.0-SNAPSHOT/joram-tests-2.30.0-SNAPSHOT.pom
[JENKINS] Archiving <https://ci-builds.apache.org/job/ActiveMQ/job/ActiveMQ-Artemis-JDK11/ws/artemis-log-annotation-processor/pom.xml> to org.apache.activemq/artemis-log-annotation-processor/2.30.0-SNAPSHOT/artemis-log-annotation-processor-2.30.0-SNAPSHOT.pom
[JENKINS] Archiving <https://ci-builds.apache.org/job/ActiveMQ/job/ActiveMQ-Artemis-JDK11/ws/artemis-log-annotation-processor/target/artemis-log-annotation-processor-2.30.0-SNAPSHOT.jar> to org.apache.activemq/artemis-log-annotation-processor/2.30.0-SNAPSHOT/artemis-log-annotation-processor-2.30.0-SNAPSHOT.jar
[JENKINS] Archiving <https://ci-builds.apache.org/job/ActiveMQ/job/ActiveMQ-Artemis-JDK11/ws/artemis-log-annotation-processor/target/artemis-log-annotation-processor-2.30.0-SNAPSHOT-sources.jar> to org.apache.activemq/artemis-log-annotation-processor/2.30.0-SNAPSHOT/artemis-log-annotation-processor-2.30.0-SNAPSHOT-sources.jar
[JENKINS] Archiving <https://ci-builds.apache.org/job/ActiveMQ/job/ActiveMQ-Artemis-JDK11/ws/artemis-jms-server/pom.xml> to org.apache.activemq/artemis-jms-server/2.30.0-SNAPSHOT/artemis-jms-server-2.30.0-SNAPSHOT.pom
[JENKINS] Archiving <https://ci-builds.apache.org/job/ActiveMQ/job/ActiveMQ-Artemis-JDK11/ws/artemis-cli/pom.xml> to org.apache.activemq/artemis-cli/2.30.0-SNAPSHOT/artemis-cli-2.30.0-SNAPSHOT.pom
[JENKINS] Archiving <https://ci-builds.apache.org/job/ActiveMQ/job/ActiveMQ-Artemis-JDK11/ws/artemis-jakarta-client-all/pom.xml> to org.apache.activemq/artemis-jakarta-client-all/2.30.0-SNAPSHOT/artemis-jakarta-client-all-2.30.0-SNAPSHOT.pom
[JENKINS] Archiving <https://ci-builds.apache.org/job/ActiveMQ/job/ActiveMQ-Artemis-JDK11/ws/artemis-core-client-all/pom.xml> to org.apache.activemq/artemis-core-client-all/2.30.0-SNAPSHOT/artemis-core-client-all-2.30.0-SNAPSHOT.pom
[JENKINS] Archiving <https://ci-builds.apache.org/job/ActiveMQ/job/ActiveMQ-Artemis-JDK11/ws/tests/pom.xml> to org.apache.activemq.tests/artemis-tests-pom/2.30.0-SNAPSHOT/artemis-tests-pom-2.30.0-SNAPSHOT.pom
[JENKINS] Archiving <https://ci-builds.apache.org/job/ActiveMQ/job/ActiveMQ-Artemis-JDK11/ws/artemis-protocols/artemis-openwire-protocol/pom.xml> to org.apache.activemq/artemis-openwire-protocol/2.30.0-SNAPSHOT/artemis-openwire-protocol-2.30.0-SNAPSHOT.pom
[JENKINS] Archiving <https://ci-builds.apache.org/job/ActiveMQ/job/ActiveMQ-Artemis-JDK11/ws/artemis-image/pom.xml> to org.apache.activemq/artemis-image/2.30.0-SNAPSHOT/artemis-image-2.30.0-SNAPSHOT.pom
[JENKINS] Archiving <https://ci-builds.apache.org/job/ActiveMQ/job/ActiveMQ-Artemis-JDK11/ws/artemis-distribution/pom.xml> to org.apache.activemq/apache-artemis/2.30.0-SNAPSHOT/apache-artemis-2.30.0-SNAPSHOT.pom
[JENKINS] Archiving <https://ci-builds.apache.org/job/ActiveMQ/job/ActiveMQ-Artemis-JDK11/ws/artemis-hawtio/artemis-console/pom.xml> to org.apache.activemq/artemis-console/2.30.0-SNAPSHOT/artemis-console-2.30.0-SNAPSHOT.pom
[JENKINS] Archiving <https://ci-builds.apache.org/job/ActiveMQ/job/ActiveMQ-Artemis-JDK11/ws/tests/artemis-test-support/pom.xml> to org.apache.activemq.tests/artemis-test-support/2.30.0-SNAPSHOT/artemis-test-support-2.30.0-SNAPSHOT.pom
[JENKINS] Archiving <https://ci-builds.apache.org/job/ActiveMQ/job/ActiveMQ-Artemis-JDK11/ws/artemis-selector/pom.xml> to org.apache.activemq/artemis-selector/2.30.0-SNAPSHOT/artemis-selector-2.30.0-SNAPSHOT.pom
[JENKINS] Archiving <https://ci-builds.apache.org/job/ActiveMQ/job/ActiveMQ-Artemis-JDK11/ws/artemis-selector/target/artemis-selector-2.30.0-SNAPSHOT.jar> to org.apache.activemq/artemis-selector/2.30.0-SNAPSHOT/artemis-selector-2.30.0-SNAPSHOT.jar
[JENKINS] Archiving <https://ci-builds.apache.org/job/ActiveMQ/job/ActiveMQ-Artemis-JDK11/ws/artemis-selector/target/artemis-selector-2.30.0-SNAPSHOT-sources.jar> to org.apache.activemq/artemis-selector/2.30.0-SNAPSHOT/artemis-selector-2.30.0-SNAPSHOT-sources.jar
[JENKINS] Archiving <https://ci-builds.apache.org/job/ActiveMQ/job/ActiveMQ-Artemis-JDK11/ws/artemis-jdbc-store/pom.xml> to org.apache.activemq/artemis-jdbc-store/2.30.0-SNAPSHOT/artemis-jdbc-store-2.30.0-SNAPSHOT.pom
[JENKINS] Archiving <https://ci-builds.apache.org/job/ActiveMQ/job/ActiveMQ-Artemis-JDK11/ws/artemis-jdbc-store/target/artemis-jdbc-store-2.30.0-SNAPSHOT.jar> to org.apache.activemq/artemis-jdbc-store/2.30.0-SNAPSHOT/artemis-jdbc-store-2.30.0-SNAPSHOT.jar
[JENKINS] Archiving <https://ci-builds.apache.org/job/ActiveMQ/job/ActiveMQ-Artemis-JDK11/ws/artemis-jdbc-store/target/artemis-jdbc-store-2.30.0-SNAPSHOT-sources.jar> to org.apache.activemq/artemis-jdbc-store/2.30.0-SNAPSHOT/artemis-jdbc-store-2.30.0-SNAPSHOT-sources.jar
[JENKINS] Archiving <https://ci-builds.apache.org/job/ActiveMQ/job/ActiveMQ-Artemis-JDK11/ws/integration/activemq-spring-integration/pom.xml> to org.apache.activemq/artemis-spring-integration/2.30.0-SNAPSHOT/artemis-spring-integration-2.30.0-SNAPSHOT.pom
[JENKINS] Archiving <https://ci-builds.apache.org/job/ActiveMQ/job/ActiveMQ-Artemis-JDK11/ws/artemis-quorum-ri/pom.xml> to org.apache.activemq/artemis-quorum-ri/2.30.0-SNAPSHOT/artemis-quorum-ri-2.30.0-SNAPSHOT.pom
[JENKINS] Archiving <https://ci-builds.apache.org/job/ActiveMQ/job/ActiveMQ-Artemis-JDK11/ws/artemis-web/pom.xml> to org.apache.activemq/artemis-web/2.30.0-SNAPSHOT/artemis-web-2.30.0-SNAPSHOT.pom
[JENKINS] Archiving <https://ci-builds.apache.org/job/ActiveMQ/job/ActiveMQ-Artemis-JDK11/ws/artemis-junit/artemis-junit-commons/pom.xml> to org.apache.activemq/artemis-junit-commons/2.30.0-SNAPSHOT/artemis-junit-commons-2.30.0-SNAPSHOT.pom
[JENKINS] Archiving <https://ci-builds.apache.org/job/ActiveMQ/job/ActiveMQ-Artemis-JDK11/ws/artemis-cdi-client/pom.xml> to org.apache.activemq/artemis-cdi-client/2.30.0-SNAPSHOT/artemis-cdi-client-2.30.0-SNAPSHOT.pom
[JENKINS] Archiving <https://ci-builds.apache.org/job/ActiveMQ/job/ActiveMQ-Artemis-JDK11/ws/tests/jms-tests/pom.xml> to org.apache.activemq.tests/jms-tests/2.30.0-SNAPSHOT/jms-tests-2.30.0-SNAPSHOT.pom
[JENKINS] Archiving <https://ci-builds.apache.org/job/ActiveMQ/job/ActiveMQ-Artemis-JDK11/ws/artemis-ra/pom.xml> to org.apache.activemq/artemis-ra/2.30.0-SNAPSHOT/artemis-ra-2.30.0-SNAPSHOT.pom
[JENKINS] Archiving <https://ci-builds.apache.org/job/ActiveMQ/job/ActiveMQ-Artemis-JDK11/ws/pom.xml> to org.apache.activemq/artemis-pom/2.30.0-SNAPSHOT/artemis-pom-2.30.0-SNAPSHOT.pom
[JENKINS] Archiving <https://ci-builds.apache.org/job/ActiveMQ/job/ActiveMQ-Artemis-JDK11/ws/tests/karaf-client-integration-tests/pom.xml> to org.apache.activemq.tests/karaf-client-integration-tests/2.30.0-SNAPSHOT/karaf-client-integration-tests-2.30.0-SNAPSHOT.pom
[JENKINS] Archiving <https://ci-builds.apache.org/job/ActiveMQ/job/ActiveMQ-Artemis-JDK11/ws/artemis-maven-plugin/pom.xml> to org.apache.activemq/artemis-maven-plugin/2.30.0-SNAPSHOT/artemis-maven-plugin-2.30.0-SNAPSHOT.pom
[JENKINS] Archiving <https://ci-builds.apache.org/job/ActiveMQ/job/ActiveMQ-Artemis-JDK11/ws/artemis-junit/artemis-junit-4/pom.xml> to org.apache.activemq/artemis-junit/2.30.0-SNAPSHOT/artemis-junit-2.30.0-SNAPSHOT.pom
[JENKINS] Archiving <https://ci-builds.apache.org/job/ActiveMQ/job/ActiveMQ-Artemis-JDK11/ws/artemis-service-extensions/pom.xml> to org.apache.activemq/artemis-service-extensions/2.30.0-SNAPSHOT/artemis-service-extensions-2.30.0-SNAPSHOT.pom
[JENKINS] Archiving <https://ci-builds.apache.org/job/ActiveMQ/job/ActiveMQ-Artemis-JDK11/ws/artemis-server-osgi/pom.xml> to org.apache.activemq/artemis-server-osgi/2.30.0-SNAPSHOT/artemis-server-osgi-2.30.0-SNAPSHOT.pom
[JENKINS] Archiving <https://ci-builds.apache.org/job/ActiveMQ/job/ActiveMQ-Artemis-JDK11/ws/artemis-junit/pom.xml> to org.apache.activemq/artemis-junit-parent/2.30.0-SNAPSHOT/artemis-junit-parent-2.30.0-SNAPSHOT.pom
[JENKINS] Archiving <https://ci-builds.apache.org/job/ActiveMQ/job/ActiveMQ-Artemis-JDK11/ws/tests/unit-tests/pom.xml> to org.apache.activemq.tests/unit-tests/2.30.0-SNAPSHOT/unit-tests-2.30.0-SNAPSHOT.pom
[JENKINS] Archiving <https://ci-builds.apache.org/job/ActiveMQ/job/ActiveMQ-Artemis-JDK11/ws/tests/leak-tests/pom.xml> to org.apache.activemq.tests/leak-tests/2.30.0-SNAPSHOT/leak-tests-2.30.0-SNAPSHOT.pom
[JENKINS] Archiving <https://ci-builds.apache.org/job/ActiveMQ/job/ActiveMQ-Artemis-JDK11/ws/artemis-protocols/artemis-stomp-protocol/pom.xml> to org.apache.activemq/artemis-stomp-protocol/2.30.0-SNAPSHOT/artemis-stomp-protocol-2.30.0-SNAPSHOT.pom
[JENKINS] Archiving <https://ci-builds.apache.org/job/ActiveMQ/job/ActiveMQ-Artemis-JDK11/ws/artemis-protocols/artemis-hornetq-protocol/pom.xml> to org.apache.activemq/artemis-hornetq-protocol/2.30.0-SNAPSHOT/artemis-hornetq-protocol-2.30.0-SNAPSHOT.pom
[JENKINS] Archiving <https://ci-builds.apache.org/job/ActiveMQ/job/ActiveMQ-Artemis-JDK11/ws/artemis-core-client-osgi/pom.xml> to org.apache.activemq/artemis-core-client-osgi/2.30.0-SNAPSHOT/artemis-core-client-osgi-2.30.0-SNAPSHOT.pom
[JENKINS] Archiving <https://ci-builds.apache.org/job/ActiveMQ/job/ActiveMQ-Artemis-JDK11/ws/tests/performance-tests/pom.xml> to org.apache.activemq.tests/performance-tests/2.30.0-SNAPSHOT/performance-tests-2.30.0-SNAPSHOT.pom
[JENKINS] Archiving <https://ci-builds.apache.org/job/ActiveMQ/job/ActiveMQ-Artemis-JDK11/ws/artemis-features/pom.xml> to org.apache.activemq/artemis-features/2.30.0-SNAPSHOT/artemis-features-2.30.0-SNAPSHOT.pom
[JENKINS] Archiving <https://ci-builds.apache.org/job/ActiveMQ/job/ActiveMQ-Artemis-JDK11/ws/artemis-commons/dependency-reduced-pom.xml> to org.apache.activemq/artemis-commons/2.30.0-SNAPSHOT/artemis-commons-2.30.0-SNAPSHOT.pom
[JENKINS] Archiving <https://ci-builds.apache.org/job/ActiveMQ/job/ActiveMQ-Artemis-JDK11/ws/artemis-commons/target/artemis-commons-2.30.0-SNAPSHOT.jar> to org.apache.activemq/artemis-commons/2.30.0-SNAPSHOT/artemis-commons-2.30.0-SNAPSHOT.jar
[JENKINS] Archiving <https://ci-builds.apache.org/job/ActiveMQ/job/ActiveMQ-Artemis-JDK11/ws/artemis-commons/target/artemis-commons-2.30.0-SNAPSHOT-sources.jar> to org.apache.activemq/artemis-commons/2.30.0-SNAPSHOT/artemis-commons-2.30.0-SNAPSHOT-sources.jar
[JENKINS] Archiving <https://ci-builds.apache.org/job/ActiveMQ/job/ActiveMQ-Artemis-JDK11/ws/artemis-journal/pom.xml> to org.apache.activemq/artemis-journal/2.30.0-SNAPSHOT/artemis-journal-2.30.0-SNAPSHOT.pom
[JENKINS] Archiving <https://ci-builds.apache.org/job/ActiveMQ/job/ActiveMQ-Artemis-JDK11/ws/artemis-journal/target/artemis-journal-2.30.0-SNAPSHOT.jar> to org.apache.activemq/artemis-journal/2.30.0-SNAPSHOT/artemis-journal-2.30.0-SNAPSHOT.jar
[JENKINS] Archiving <https://ci-builds.apache.org/job/ActiveMQ/job/ActiveMQ-Artemis-JDK11/ws/artemis-journal/target/artemis-journal-2.30.0-SNAPSHOT-sources.jar> to org.apache.activemq/artemis-journal/2.30.0-SNAPSHOT/artemis-journal-2.30.0-SNAPSHOT-sources.jar
[JENKINS] Archiving <https://ci-builds.apache.org/job/ActiveMQ/job/ActiveMQ-Artemis-JDK11/ws/tests/soak-tests/pom.xml> to org.apache.activemq.tests/soak-tests/2.30.0-SNAPSHOT/soak-tests-2.30.0-SNAPSHOT.pom
[JENKINS] Archiving <https://ci-builds.apache.org/job/ActiveMQ/job/ActiveMQ-Artemis-JDK11/ws/artemis-core-client/pom.xml> to org.apache.activemq/artemis-core-client/2.30.0-SNAPSHOT/artemis-core-client-2.30.0-SNAPSHOT.pom
[JENKINS] Archiving <https://ci-builds.apache.org/job/ActiveMQ/job/ActiveMQ-Artemis-JDK11/ws/artemis-core-client/target/artemis-core-client-2.30.0-SNAPSHOT.jar> to org.apache.activemq/artemis-core-client/2.30.0-SNAPSHOT/artemis-core-client-2.30.0-SNAPSHOT.jar
[JENKINS] Archiving <https://ci-builds.apache.org/job/ActiveMQ/job/ActiveMQ-Artemis-JDK11/ws/artemis-core-client/target/artemis-core-client-2.30.0-SNAPSHOT-sources.jar> to org.apache.activemq/artemis-core-client/2.30.0-SNAPSHOT/artemis-core-client-2.30.0-SNAPSHOT-sources.jar
[JENKINS] Archiving <https://ci-builds.apache.org/job/ActiveMQ/job/ActiveMQ-Artemis-JDK11/ws/tests/integration-tests-isolated/pom.xml> to org.apache.activemq.tests/integration-tests-isolated/2.30.0-SNAPSHOT/integration-tests-isolated-2.30.0-SNAPSHOT.pom
[JENKINS] Archiving <https://ci-builds.apache.org/job/ActiveMQ/job/ActiveMQ-Artemis-JDK11/ws/artemis-jakarta-ra/pom.xml> to org.apache.activemq/artemis-jakarta-ra/2.30.0-SNAPSHOT/artemis-jakarta-ra-2.30.0-SNAPSHOT.pom
[JENKINS] Archiving <https://ci-builds.apache.org/job/ActiveMQ/job/ActiveMQ-Artemis-JDK11/ws/tests/timing-tests/pom.xml> to org.apache.activemq.tests/timing-tests/2.30.0-SNAPSHOT/timing-tests-2.30.0-SNAPSHOT.pom
[JENKINS] Archiving <https://ci-builds.apache.org/job/ActiveMQ/job/ActiveMQ-Artemis-JDK11/ws/artemis-junit/artemis-junit-5/pom.xml> to org.apache.activemq/artemis-junit-5/2.30.0-SNAPSHOT/artemis-junit-5-2.30.0-SNAPSHOT.pom
[JENKINS] Archiving <https://ci-builds.apache.org/job/ActiveMQ/job/ActiveMQ-Artemis-JDK11/ws/artemis-jms-client-all/pom.xml> to org.apache.activemq/artemis-jms-client-all/2.30.0-SNAPSHOT/artemis-jms-client-all-2.30.0-SNAPSHOT.pom
[JENKINS] Archiving <https://ci-builds.apache.org/job/ActiveMQ/job/ActiveMQ-Artemis-JDK11/ws/artemis-protocols/pom.xml> to org.apache.activemq/artemis-protocols/2.30.0-SNAPSHOT/artemis-protocols-2.30.0-SNAPSHOT.pom
[JENKINS] Archiving <https://ci-builds.apache.org/job/ActiveMQ/job/ActiveMQ-Artemis-JDK11/ws/tests/karaf-server-integration-tests/pom.xml> to org.apache.activemq.tests/karaf-server-integration-tests/2.30.0-SNAPSHOT/karaf-server-integration-tests-2.30.0-SNAPSHOT.pom
[JENKINS] Archiving <https://ci-builds.apache.org/job/ActiveMQ/job/ActiveMQ-Artemis-JDK11/ws/artemis-hawtio/artemis-plugin/pom.xml> to org.apache.activemq/artemis-plugin/2.30.0-SNAPSHOT/artemis-plugin-2.30.0-SNAPSHOT.pom
[JENKINS] Archiving <https://ci-builds.apache.org/job/ActiveMQ/job/ActiveMQ-Artemis-JDK11/ws/artemis-quorum-api/pom.xml> to org.apache.activemq/artemis-quorum-api/2.30.0-SNAPSHOT/artemis-quorum-api-2.30.0-SNAPSHOT.pom
[JENKINS] Archiving <https://ci-builds.apache.org/job/ActiveMQ/job/ActiveMQ-Artemis-JDK11/ws/artemis-quorum-api/target/artemis-quorum-api-2.30.0-SNAPSHOT.jar> to org.apache.activemq/artemis-quorum-api/2.30.0-SNAPSHOT/artemis-quorum-api-2.30.0-SNAPSHOT.jar
[JENKINS] Archiving <https://ci-builds.apache.org/job/ActiveMQ/job/ActiveMQ-Artemis-JDK11/ws/artemis-quorum-api/target/artemis-quorum-api-2.30.0-SNAPSHOT-sources.jar> to org.apache.activemq/artemis-quorum-api/2.30.0-SNAPSHOT/artemis-quorum-api-2.30.0-SNAPSHOT-sources.jar
[JENKINS] Archiving <https://ci-builds.apache.org/job/ActiveMQ/job/ActiveMQ-Artemis-JDK11/ws/artemis-dto/pom.xml> to org.apache.activemq/artemis-dto/2.30.0-SNAPSHOT/artemis-dto-2.30.0-SNAPSHOT.pom
[JENKINS] Archiving <https://ci-builds.apache.org/job/ActiveMQ/job/ActiveMQ-Artemis-JDK11/ws/artemis-unit-test-support/pom.xml> to org.apache.activemq/artemis-unit-test-support/2.30.0-SNAPSHOT/artemis-unit-test-support-2.30.0-SNAPSHOT.pom
[JENKINS] Archiving <https://ci-builds.apache.org/job/ActiveMQ/job/ActiveMQ-Artemis-JDK11/ws/artemis-unit-test-support/target/artemis-unit-test-support-2.30.0-SNAPSHOT.jar> to org.apache.activemq/artemis-unit-test-support/2.30.0-SNAPSHOT/artemis-unit-test-support-2.30.0-SNAPSHOT.jar
[JENKINS] Archiving <https://ci-builds.apache.org/job/ActiveMQ/job/ActiveMQ-Artemis-JDK11/ws/artemis-unit-test-support/target/artemis-unit-test-support-2.30.0-SNAPSHOT-sources.jar> to org.apache.activemq/artemis-unit-test-support/2.30.0-SNAPSHOT/artemis-unit-test-support-2.30.0-SNAPSHOT-sources.jar
[JENKINS] Archiving <https://ci-builds.apache.org/job/ActiveMQ/job/ActiveMQ-Artemis-JDK11/ws/artemis-jakarta-service-extensions/pom.xml> to org.apache.activemq/artemis-jakarta-service-extensions/2.30.0-SNAPSHOT/artemis-jakarta-service-extensions-2.30.0-SNAPSHOT.pom
[JENKINS] Archiving <https://ci-builds.apache.org/job/ActiveMQ/job/ActiveMQ-Artemis-JDK11/ws/artemis-protocols/artemis-hqclient-protocol/pom.xml> to org.apache.activemq/artemis-hqclient-protocol/2.30.0-SNAPSHOT/artemis-hqclient-protocol-2.30.0-SNAPSHOT.pom
[JENKINS] Archiving <https://ci-builds.apache.org/job/ActiveMQ/job/ActiveMQ-Artemis-JDK11/ws/artemis-jms-client-osgi/pom.xml> to org.apache.activemq/artemis-jms-client-osgi/2.30.0-SNAPSHOT/artemis-jms-client-osgi-2.30.0-SNAPSHOT.pom
[JENKINS] Archiving <https://ci-builds.apache.org/job/ActiveMQ/job/ActiveMQ-Artemis-JDK11/ws/tests/integration-tests/pom.xml> to org.apache.activemq.tests/integration-tests/2.30.0-SNAPSHOT/integration-tests-2.30.0-SNAPSHOT.pom
[JENKINS] Archiving <https://ci-builds.apache.org/job/ActiveMQ/job/ActiveMQ-Artemis-JDK11/ws/artemis-boot/pom.xml> to org.apache.activemq/artemis-boot/2.30.0-SNAPSHOT/artemis-boot-2.30.0-SNAPSHOT.pom
[JENKINS] Archiving <https://ci-builds.apache.org/job/ActiveMQ/job/ActiveMQ-Artemis-JDK11/ws/artemis-jakarta-client/pom.xml> to org.apache.activemq/artemis-jakarta-client/2.30.0-SNAPSHOT/artemis-jakarta-client-2.30.0-SNAPSHOT.pom
[JENKINS] Archiving <https://ci-builds.apache.org/job/ActiveMQ/job/ActiveMQ-Artemis-JDK11/ws/artemis-protocols/artemis-amqp-protocol/pom.xml> to org.apache.activemq/artemis-amqp-protocol/2.30.0-SNAPSHOT/artemis-amqp-protocol-2.30.0-SNAPSHOT.pom
[JENKINS] Archiving <https://ci-builds.apache.org/job/ActiveMQ/job/ActiveMQ-Artemis-JDK11/ws/artemis-jakarta-server/pom.xml> to org.apache.activemq/artemis-jakarta-server/2.30.0-SNAPSHOT/artemis-jakarta-server-2.30.0-SNAPSHOT.pom
[JENKINS] Archiving <https://ci-builds.apache.org/job/ActiveMQ/job/ActiveMQ-Artemis-JDK11/ws/artemis-protocols/artemis-mqtt-protocol/pom.xml> to org.apache.activemq/artemis-mqtt-protocol/2.30.0-SNAPSHOT/artemis-mqtt-protocol-2.30.0-SNAPSHOT.pom
[JENKINS] Archiving <https://ci-builds.apache.org/job/ActiveMQ/job/ActiveMQ-Artemis-JDK11/ws/tests/e2e-tests/pom.xml> to org.apache.activemq.tests/e2e-tests/2.30.0-SNAPSHOT/e2e-tests-2.30.0-SNAPSHOT.pom
[JENKINS] Archiving <https://ci-builds.apache.org/job/ActiveMQ/job/ActiveMQ-Artemis-JDK11/ws/artemis-hawtio/pom.xml> to org.apache.activemq/artemis-hawtio-pom/2.30.0-SNAPSHOT/artemis-hawtio-pom-2.30.0-SNAPSHOT.pom
[JENKINS] Archiving <https://ci-builds.apache.org/job/ActiveMQ/job/ActiveMQ-Artemis-JDK11/ws/tests/stress-tests/pom.xml> to org.apache.activemq.tests/stress-tests/2.30.0-SNAPSHOT/stress-tests-2.30.0-SNAPSHOT.pom
channel stopped
Jenkins build is back to normal : ActiveMQ » ActiveMQ-Artemis-JDK11 #1470
Posted by Apache Jenkins Server <je...@builds.apache.org>.
See <https://ci-builds.apache.org/job/ActiveMQ/job/ActiveMQ-Artemis-JDK11/1470/display/redirect?page=changes>