You are viewing a plain text version of this content. The canonical link for it is here.
Posted to dev@lucene.apache.org by Policeman Jenkins Server <je...@thetaphi.de> on 2016/09/12 21:56:49 UTC
[JENKINS] Lucene-Solr-5.5-Linux (32bit/jdk1.8.0_102) - Build # 430
- Still Unstable!
Build: http://jenkins.thetaphi.de/job/Lucene-Solr-5.5-Linux/430/
Java: 32bit/jdk1.8.0_102 -server -XX:+UseConcMarkSweepGC
1 tests failed.
FAILED: junit.framework.TestSuite.org.apache.solr.handler.TestSolrConfigHandlerCloud
Error Message:
1 thread leaked from SUITE scope at org.apache.solr.handler.TestSolrConfigHandlerCloud: 1) Thread[id=4420, name=Thread-1996, state=TIMED_WAITING, group=TGRP-TestSolrConfigHandlerCloud] at java.lang.Thread.sleep(Native Method) at org.apache.solr.cloud.ZkSolrResourceLoader.openResource(ZkSolrResourceLoader.java:101) at org.apache.solr.core.SolrResourceLoader.openSchema(SolrResourceLoader.java:355) at org.apache.solr.schema.IndexSchemaFactory.create(IndexSchemaFactory.java:48) at org.apache.solr.schema.IndexSchemaFactory.buildIndexSchema(IndexSchemaFactory.java:70) at org.apache.solr.core.ConfigSetService.createIndexSchema(ConfigSetService.java:108) at org.apache.solr.core.ConfigSetService.getConfig(ConfigSetService.java:79) at org.apache.solr.core.CoreContainer.reload(CoreContainer.java:920) at org.apache.solr.core.SolrCore$11.run(SolrCore.java:2623) at org.apache.solr.cloud.ZkController$5.run(ZkController.java:2480)
Stack Trace:
com.carrotsearch.randomizedtesting.ThreadLeakError: 1 thread leaked from SUITE scope at org.apache.solr.handler.TestSolrConfigHandlerCloud:
1) Thread[id=4420, name=Thread-1996, state=TIMED_WAITING, group=TGRP-TestSolrConfigHandlerCloud]
at java.lang.Thread.sleep(Native Method)
at org.apache.solr.cloud.ZkSolrResourceLoader.openResource(ZkSolrResourceLoader.java:101)
at org.apache.solr.core.SolrResourceLoader.openSchema(SolrResourceLoader.java:355)
at org.apache.solr.schema.IndexSchemaFactory.create(IndexSchemaFactory.java:48)
at org.apache.solr.schema.IndexSchemaFactory.buildIndexSchema(IndexSchemaFactory.java:70)
at org.apache.solr.core.ConfigSetService.createIndexSchema(ConfigSetService.java:108)
at org.apache.solr.core.ConfigSetService.getConfig(ConfigSetService.java:79)
at org.apache.solr.core.CoreContainer.reload(CoreContainer.java:920)
at org.apache.solr.core.SolrCore$11.run(SolrCore.java:2623)
at org.apache.solr.cloud.ZkController$5.run(ZkController.java:2480)
at __randomizedtesting.SeedInfo.seed([64370980C7089CB8]:0)
Build Log:
[...truncated 11173 lines...]
[junit4] Suite: org.apache.solr.handler.TestSolrConfigHandlerCloud
[junit4] 2> Creating dataDir: /home/jenkins/workspace/Lucene-Solr-5.5-Linux/solr/build/solr-core/test/J0/temp/solr.handler.TestSolrConfigHandlerCloud_64370980C7089CB8-001/init-core-data-001
[junit4] 2> 435741 INFO (SUITE-TestSolrConfigHandlerCloud-seed#[64370980C7089CB8]-worker) [ ] o.a.s.SolrTestCaseJ4 Randomized ssl (false) and clientAuth (false)
[junit4] 2> 435741 INFO (SUITE-TestSolrConfigHandlerCloud-seed#[64370980C7089CB8]-worker) [ ] o.a.s.BaseDistributedSearchTestCase Setting hostContext system property: /
[junit4] 2> 435743 INFO (TEST-TestSolrConfigHandlerCloud.test-seed#[64370980C7089CB8]) [ ] o.a.s.c.ZkTestServer STARTING ZK TEST SERVER
[junit4] 2> 435744 INFO (Thread-1916) [ ] o.a.s.c.ZkTestServer client port:0.0.0.0/0.0.0.0:0
[junit4] 2> 435744 INFO (Thread-1916) [ ] o.a.s.c.ZkTestServer Starting server
[junit4] 2> 435844 INFO (TEST-TestSolrConfigHandlerCloud.test-seed#[64370980C7089CB8]) [ ] o.a.s.c.ZkTestServer start zk server on port:35061
[junit4] 2> 435845 INFO (TEST-TestSolrConfigHandlerCloud.test-seed#[64370980C7089CB8]) [ ] o.a.s.c.c.SolrZkClient Using default ZkCredentialsProvider
[junit4] 2> 435845 INFO (TEST-TestSolrConfigHandlerCloud.test-seed#[64370980C7089CB8]) [ ] o.a.s.c.c.ConnectionManager Waiting for client to connect to ZooKeeper
[junit4] 2> 435847 INFO (zkCallback-462-thread-1) [ ] o.a.s.c.c.ConnectionManager Watcher org.apache.solr.common.cloud.ConnectionManager@a76fbf name:ZooKeeperConnection Watcher:127.0.0.1:35061 got event WatchedEvent state:SyncConnected type:None path:null path:null type:None
[junit4] 2> 435847 INFO (TEST-TestSolrConfigHandlerCloud.test-seed#[64370980C7089CB8]) [ ] o.a.s.c.c.ConnectionManager Client is connected to ZooKeeper
[junit4] 2> 435847 INFO (TEST-TestSolrConfigHandlerCloud.test-seed#[64370980C7089CB8]) [ ] o.a.s.c.c.SolrZkClient Using default ZkACLProvider
[junit4] 2> 435847 INFO (TEST-TestSolrConfigHandlerCloud.test-seed#[64370980C7089CB8]) [ ] o.a.s.c.c.SolrZkClient makePath: /solr
[junit4] 2> 435848 INFO (TEST-TestSolrConfigHandlerCloud.test-seed#[64370980C7089CB8]) [ ] o.a.s.c.c.SolrZkClient Using default ZkCredentialsProvider
[junit4] 2> 435848 INFO (TEST-TestSolrConfigHandlerCloud.test-seed#[64370980C7089CB8]) [ ] o.a.s.c.c.ConnectionManager Waiting for client to connect to ZooKeeper
[junit4] 2> 435849 INFO (zkCallback-463-thread-1) [ ] o.a.s.c.c.ConnectionManager Watcher org.apache.solr.common.cloud.ConnectionManager@552496 name:ZooKeeperConnection Watcher:127.0.0.1:35061/solr got event WatchedEvent state:SyncConnected type:None path:null path:null type:None
[junit4] 2> 435849 INFO (TEST-TestSolrConfigHandlerCloud.test-seed#[64370980C7089CB8]) [ ] o.a.s.c.c.ConnectionManager Client is connected to ZooKeeper
[junit4] 2> 435849 INFO (TEST-TestSolrConfigHandlerCloud.test-seed#[64370980C7089CB8]) [ ] o.a.s.c.c.SolrZkClient Using default ZkACLProvider
[junit4] 2> 435849 INFO (TEST-TestSolrConfigHandlerCloud.test-seed#[64370980C7089CB8]) [ ] o.a.s.c.c.SolrZkClient makePath: /collections/collection1
[junit4] 2> 435850 INFO (TEST-TestSolrConfigHandlerCloud.test-seed#[64370980C7089CB8]) [ ] o.a.s.c.c.SolrZkClient makePath: /collections/collection1/shards
[junit4] 2> 435851 INFO (TEST-TestSolrConfigHandlerCloud.test-seed#[64370980C7089CB8]) [ ] o.a.s.c.c.SolrZkClient makePath: /collections/control_collection
[junit4] 2> 435851 INFO (TEST-TestSolrConfigHandlerCloud.test-seed#[64370980C7089CB8]) [ ] o.a.s.c.c.SolrZkClient makePath: /collections/control_collection/shards
[junit4] 2> 435852 INFO (TEST-TestSolrConfigHandlerCloud.test-seed#[64370980C7089CB8]) [ ] o.a.s.c.AbstractZkTestCase put /home/jenkins/workspace/Lucene-Solr-5.5-Linux/solr/core/src/test-files/solr/collection1/conf/solrconfig-tlog.xml to /configs/conf1/solrconfig.xml
[junit4] 2> 435852 INFO (TEST-TestSolrConfigHandlerCloud.test-seed#[64370980C7089CB8]) [ ] o.a.s.c.c.SolrZkClient makePath: /configs/conf1/solrconfig.xml
[junit4] 2> 435853 INFO (TEST-TestSolrConfigHandlerCloud.test-seed#[64370980C7089CB8]) [ ] o.a.s.c.AbstractZkTestCase put /home/jenkins/workspace/Lucene-Solr-5.5-Linux/solr/core/src/test-files/solr/collection1/conf/schema.xml to /configs/conf1/schema.xml
[junit4] 2> 435853 INFO (TEST-TestSolrConfigHandlerCloud.test-seed#[64370980C7089CB8]) [ ] o.a.s.c.c.SolrZkClient makePath: /configs/conf1/schema.xml
[junit4] 2> 435854 INFO (TEST-TestSolrConfigHandlerCloud.test-seed#[64370980C7089CB8]) [ ] o.a.s.c.AbstractZkTestCase put /home/jenkins/workspace/Lucene-Solr-5.5-Linux/solr/core/src/test-files/solr/collection1/conf/solrconfig.snippet.randomindexconfig.xml to /configs/conf1/solrconfig.snippet.randomindexconfig.xml
[junit4] 2> 435854 INFO (TEST-TestSolrConfigHandlerCloud.test-seed#[64370980C7089CB8]) [ ] o.a.s.c.c.SolrZkClient makePath: /configs/conf1/solrconfig.snippet.randomindexconfig.xml
[junit4] 2> 435854 INFO (TEST-TestSolrConfigHandlerCloud.test-seed#[64370980C7089CB8]) [ ] o.a.s.c.AbstractZkTestCase put /home/jenkins/workspace/Lucene-Solr-5.5-Linux/solr/core/src/test-files/solr/collection1/conf/stopwords.txt to /configs/conf1/stopwords.txt
[junit4] 2> 435855 INFO (TEST-TestSolrConfigHandlerCloud.test-seed#[64370980C7089CB8]) [ ] o.a.s.c.c.SolrZkClient makePath: /configs/conf1/stopwords.txt
[junit4] 2> 435855 INFO (TEST-TestSolrConfigHandlerCloud.test-seed#[64370980C7089CB8]) [ ] o.a.s.c.AbstractZkTestCase put /home/jenkins/workspace/Lucene-Solr-5.5-Linux/solr/core/src/test-files/solr/collection1/conf/protwords.txt to /configs/conf1/protwords.txt
[junit4] 2> 435855 INFO (TEST-TestSolrConfigHandlerCloud.test-seed#[64370980C7089CB8]) [ ] o.a.s.c.c.SolrZkClient makePath: /configs/conf1/protwords.txt
[junit4] 2> 435857 INFO (TEST-TestSolrConfigHandlerCloud.test-seed#[64370980C7089CB8]) [ ] o.a.s.c.AbstractZkTestCase put /home/jenkins/workspace/Lucene-Solr-5.5-Linux/solr/core/src/test-files/solr/collection1/conf/currency.xml to /configs/conf1/currency.xml
[junit4] 2> 435857 INFO (TEST-TestSolrConfigHandlerCloud.test-seed#[64370980C7089CB8]) [ ] o.a.s.c.c.SolrZkClient makePath: /configs/conf1/currency.xml
[junit4] 2> 435858 INFO (TEST-TestSolrConfigHandlerCloud.test-seed#[64370980C7089CB8]) [ ] o.a.s.c.AbstractZkTestCase put /home/jenkins/workspace/Lucene-Solr-5.5-Linux/solr/core/src/test-files/solr/collection1/conf/enumsConfig.xml to /configs/conf1/enumsConfig.xml
[junit4] 2> 435858 INFO (TEST-TestSolrConfigHandlerCloud.test-seed#[64370980C7089CB8]) [ ] o.a.s.c.c.SolrZkClient makePath: /configs/conf1/enumsConfig.xml
[junit4] 2> 435859 INFO (TEST-TestSolrConfigHandlerCloud.test-seed#[64370980C7089CB8]) [ ] o.a.s.c.AbstractZkTestCase put /home/jenkins/workspace/Lucene-Solr-5.5-Linux/solr/core/src/test-files/solr/collection1/conf/open-exchange-rates.json to /configs/conf1/open-exchange-rates.json
[junit4] 2> 435859 INFO (TEST-TestSolrConfigHandlerCloud.test-seed#[64370980C7089CB8]) [ ] o.a.s.c.c.SolrZkClient makePath: /configs/conf1/open-exchange-rates.json
[junit4] 2> 435859 INFO (TEST-TestSolrConfigHandlerCloud.test-seed#[64370980C7089CB8]) [ ] o.a.s.c.AbstractZkTestCase put /home/jenkins/workspace/Lucene-Solr-5.5-Linux/solr/core/src/test-files/solr/collection1/conf/mapping-ISOLatin1Accent.txt to /configs/conf1/mapping-ISOLatin1Accent.txt
[junit4] 2> 435859 INFO (TEST-TestSolrConfigHandlerCloud.test-seed#[64370980C7089CB8]) [ ] o.a.s.c.c.SolrZkClient makePath: /configs/conf1/mapping-ISOLatin1Accent.txt
[junit4] 2> 435860 INFO (TEST-TestSolrConfigHandlerCloud.test-seed#[64370980C7089CB8]) [ ] o.a.s.c.AbstractZkTestCase put /home/jenkins/workspace/Lucene-Solr-5.5-Linux/solr/core/src/test-files/solr/collection1/conf/old_synonyms.txt to /configs/conf1/old_synonyms.txt
[junit4] 2> 435860 INFO (TEST-TestSolrConfigHandlerCloud.test-seed#[64370980C7089CB8]) [ ] o.a.s.c.c.SolrZkClient makePath: /configs/conf1/old_synonyms.txt
[junit4] 2> 435861 INFO (TEST-TestSolrConfigHandlerCloud.test-seed#[64370980C7089CB8]) [ ] o.a.s.c.AbstractZkTestCase put /home/jenkins/workspace/Lucene-Solr-5.5-Linux/solr/core/src/test-files/solr/collection1/conf/synonyms.txt to /configs/conf1/synonyms.txt
[junit4] 2> 435861 INFO (TEST-TestSolrConfigHandlerCloud.test-seed#[64370980C7089CB8]) [ ] o.a.s.c.c.SolrZkClient makePath: /configs/conf1/synonyms.txt
[junit4] 2> 435933 INFO (TEST-TestSolrConfigHandlerCloud.test-seed#[64370980C7089CB8]) [ ] o.a.s.SolrTestCaseJ4 Writing core.properties file to /home/jenkins/workspace/Lucene-Solr-5.5-Linux/solr/build/solr-core/test/J0/temp/solr.handler.TestSolrConfigHandlerCloud_64370980C7089CB8-001/control-001/cores/collection1
[junit4] 2> 435934 INFO (TEST-TestSolrConfigHandlerCloud.test-seed#[64370980C7089CB8]) [ ] o.e.j.s.Server jetty-9.2.13.v20150730
[junit4] 2> 435935 INFO (TEST-TestSolrConfigHandlerCloud.test-seed#[64370980C7089CB8]) [ ] o.e.j.s.h.ContextHandler Started o.e.j.s.ServletContextHandler@1dcaa12{/,null,AVAILABLE}
[junit4] 2> 435935 INFO (TEST-TestSolrConfigHandlerCloud.test-seed#[64370980C7089CB8]) [ ] o.e.j.s.ServerConnector Started ServerConnector@8ecdf5{HTTP/1.1}{127.0.0.1:46039}
[junit4] 2> 435935 INFO (TEST-TestSolrConfigHandlerCloud.test-seed#[64370980C7089CB8]) [ ] o.e.j.s.Server Started @437679ms
[junit4] 2> 435935 INFO (TEST-TestSolrConfigHandlerCloud.test-seed#[64370980C7089CB8]) [ ] o.a.s.c.s.e.JettySolrRunner Jetty properties: {solr.data.dir=/home/jenkins/workspace/Lucene-Solr-5.5-Linux/solr/build/solr-core/test/J0/temp/solr.handler.TestSolrConfigHandlerCloud_64370980C7089CB8-001/tempDir-001/control/data, hostContext=/, hostPort=46039, coreRootDirectory=/home/jenkins/workspace/Lucene-Solr-5.5-Linux/solr/build/solr-core/test/J0/../../../../../../../../../home/jenkins/workspace/Lucene-Solr-5.5-Linux/solr/build/solr-core/test/J0/temp/solr.handler.TestSolrConfigHandlerCloud_64370980C7089CB8-001/control-001/cores}
[junit4] 2> 435935 INFO (TEST-TestSolrConfigHandlerCloud.test-seed#[64370980C7089CB8]) [ ] o.a.s.s.SolrDispatchFilter SolrDispatchFilter.init(): sun.misc.Launcher$AppClassLoader@1d16e93
[junit4] 2> 435936 INFO (TEST-TestSolrConfigHandlerCloud.test-seed#[64370980C7089CB8]) [ ] o.a.s.c.SolrResourceLoader new SolrResourceLoader for directory: '/home/jenkins/workspace/Lucene-Solr-5.5-Linux/solr/build/solr-core/test/J0/temp/solr.handler.TestSolrConfigHandlerCloud_64370980C7089CB8-001/control-001'
[junit4] 2> 435936 INFO (TEST-TestSolrConfigHandlerCloud.test-seed#[64370980C7089CB8]) [ ] o.a.s.c.SolrResourceLoader JNDI not configured for solr (NoInitialContextEx)
[junit4] 2> 435936 INFO (TEST-TestSolrConfigHandlerCloud.test-seed#[64370980C7089CB8]) [ ] o.a.s.c.SolrResourceLoader solr home defaulted to 'solr/' (could not find system property or JNDI)
[junit4] 2> 435936 INFO (TEST-TestSolrConfigHandlerCloud.test-seed#[64370980C7089CB8]) [ ] o.a.s.c.c.SolrZkClient Using default ZkCredentialsProvider
[junit4] 2> 435936 INFO (TEST-TestSolrConfigHandlerCloud.test-seed#[64370980C7089CB8]) [ ] o.a.s.c.c.ConnectionManager Waiting for client to connect to ZooKeeper
[junit4] 2> 435937 INFO (zkCallback-464-thread-1) [ ] o.a.s.c.c.ConnectionManager Watcher org.apache.solr.common.cloud.ConnectionManager@6b8e67 name:ZooKeeperConnection Watcher:127.0.0.1:35061/solr got event WatchedEvent state:SyncConnected type:None path:null path:null type:None
[junit4] 2> 435937 INFO (TEST-TestSolrConfigHandlerCloud.test-seed#[64370980C7089CB8]) [ ] o.a.s.c.c.ConnectionManager Client is connected to ZooKeeper
[junit4] 2> 435938 INFO (TEST-TestSolrConfigHandlerCloud.test-seed#[64370980C7089CB8]) [ ] o.a.s.c.c.SolrZkClient Using default ZkACLProvider
[junit4] 2> 435938 INFO (TEST-TestSolrConfigHandlerCloud.test-seed#[64370980C7089CB8]) [ ] o.a.s.s.SolrDispatchFilter Loading solr.xml from SolrHome (not found in ZooKeeper)
[junit4] 2> 435938 INFO (TEST-TestSolrConfigHandlerCloud.test-seed#[64370980C7089CB8]) [ ] o.a.s.c.SolrXmlConfig Loading container configuration from /home/jenkins/workspace/Lucene-Solr-5.5-Linux/solr/build/solr-core/test/J0/temp/solr.handler.TestSolrConfigHandlerCloud_64370980C7089CB8-001/control-001/solr.xml
[junit4] 2> 435942 INFO (TEST-TestSolrConfigHandlerCloud.test-seed#[64370980C7089CB8]) [ ] o.a.s.c.CorePropertiesLocator Config-defined core root directory: /home/jenkins/workspace/Lucene-Solr-5.5-Linux/solr/build/solr-core/test/J0/../../../../../../../../../home/jenkins/workspace/Lucene-Solr-5.5-Linux/solr/build/solr-core/test/J0/temp/solr.handler.TestSolrConfigHandlerCloud_64370980C7089CB8-001/control-001/cores
[junit4] 2> 435942 INFO (TEST-TestSolrConfigHandlerCloud.test-seed#[64370980C7089CB8]) [ ] o.a.s.c.CoreContainer New CoreContainer 25629677
[junit4] 2> 435942 INFO (TEST-TestSolrConfigHandlerCloud.test-seed#[64370980C7089CB8]) [ ] o.a.s.c.CoreContainer Loading cores into CoreContainer [instanceDir=/home/jenkins/workspace/Lucene-Solr-5.5-Linux/solr/build/solr-core/test/J0/temp/solr.handler.TestSolrConfigHandlerCloud_64370980C7089CB8-001/control-001]
[junit4] 2> 435943 WARN (TEST-TestSolrConfigHandlerCloud.test-seed#[64370980C7089CB8]) [ ] o.a.s.c.CoreContainer Couldn't add files from /home/jenkins/workspace/Lucene-Solr-5.5-Linux/solr/build/solr-core/test/J0/temp/solr.handler.TestSolrConfigHandlerCloud_64370980C7089CB8-001/control-001/lib to classpath: /home/jenkins/workspace/Lucene-Solr-5.5-Linux/solr/build/solr-core/test/J0/temp/solr.handler.TestSolrConfigHandlerCloud_64370980C7089CB8-001/control-001/lib
[junit4] 2> 435943 INFO (TEST-TestSolrConfigHandlerCloud.test-seed#[64370980C7089CB8]) [ ] o.a.s.h.c.HttpShardHandlerFactory created with socketTimeout : 90000,urlScheme : ,connTimeout : 15000,maxConnectionsPerHost : 20,maxConnections : 10000,corePoolSize : 0,maximumPoolSize : 2147483647,maxThreadIdleTime : 5,sizeOfQueue : -1,fairnessPolicy : false,useRetries : false,connectionsEvictorSleepDelay : 5000,maxConnectionIdleTime : 40000,
[junit4] 2> 435944 INFO (TEST-TestSolrConfigHandlerCloud.test-seed#[64370980C7089CB8]) [ ] o.a.s.u.UpdateShardHandler Creating UpdateShardHandler HTTP client with params: socketTimeout=340000&connTimeout=45000&retry=true
[junit4] 2> 435944 INFO (TEST-TestSolrConfigHandlerCloud.test-seed#[64370980C7089CB8]) [ ] o.a.s.l.LogWatcher SLF4J impl is org.slf4j.impl.Log4jLoggerFactory
[junit4] 2> 435944 INFO (TEST-TestSolrConfigHandlerCloud.test-seed#[64370980C7089CB8]) [ ] o.a.s.l.LogWatcher Registering Log Listener [Log4j (org.slf4j.impl.Log4jLoggerFactory)]
[junit4] 2> 435944 INFO (TEST-TestSolrConfigHandlerCloud.test-seed#[64370980C7089CB8]) [ ] o.a.s.c.ZkContainer Zookeeper client=127.0.0.1:35061/solr
[junit4] 2> 435944 INFO (TEST-TestSolrConfigHandlerCloud.test-seed#[64370980C7089CB8]) [ ] o.a.s.c.ZkController zkHost includes chroot
[junit4] 2> 435944 INFO (TEST-TestSolrConfigHandlerCloud.test-seed#[64370980C7089CB8]) [ ] o.a.s.c.c.SolrZkClient Using default ZkCredentialsProvider
[junit4] 2> 435944 INFO (TEST-TestSolrConfigHandlerCloud.test-seed#[64370980C7089CB8]) [ ] o.a.s.c.c.ConnectionManager Waiting for client to connect to ZooKeeper
[junit4] 2> 435946 INFO (zkCallback-467-thread-1) [ ] o.a.s.c.c.ConnectionManager Watcher org.apache.solr.common.cloud.ConnectionManager@10c4caf name:ZooKeeperConnection Watcher:127.0.0.1:35061 got event WatchedEvent state:SyncConnected type:None path:null path:null type:None
[junit4] 2> 435946 INFO (TEST-TestSolrConfigHandlerCloud.test-seed#[64370980C7089CB8]) [ ] o.a.s.c.c.ConnectionManager Client is connected to ZooKeeper
[junit4] 2> 435946 INFO (TEST-TestSolrConfigHandlerCloud.test-seed#[64370980C7089CB8]) [ ] o.a.s.c.c.SolrZkClient Using default ZkACLProvider
[junit4] 2> 435947 INFO (TEST-TestSolrConfigHandlerCloud.test-seed#[64370980C7089CB8]) [n:127.0.0.1:46039_ ] o.a.s.c.ZkController Added new OnReconnect listener org.apache.solr.cloud.ZkController$6@a23a08
[junit4] 2> 435947 INFO (TEST-TestSolrConfigHandlerCloud.test-seed#[64370980C7089CB8]) [n:127.0.0.1:46039_ ] o.a.s.c.c.ConnectionManager Waiting for client to connect to ZooKeeper
[junit4] 2> 435948 INFO (zkCallback-468-thread-1-processing-n:127.0.0.1:46039_) [n:127.0.0.1:46039_ ] o.a.s.c.c.ConnectionManager Watcher org.apache.solr.common.cloud.ConnectionManager@18a9204 name:ZooKeeperConnection Watcher:127.0.0.1:35061/solr got event WatchedEvent state:SyncConnected type:None path:null path:null type:None
[junit4] 2> 435948 INFO (TEST-TestSolrConfigHandlerCloud.test-seed#[64370980C7089CB8]) [n:127.0.0.1:46039_ ] o.a.s.c.c.ConnectionManager Client is connected to ZooKeeper
[junit4] 2> 435950 INFO (TEST-TestSolrConfigHandlerCloud.test-seed#[64370980C7089CB8]) [n:127.0.0.1:46039_ ] o.a.s.c.c.SolrZkClient makePath: /overseer/queue
[junit4] 2> 435951 INFO (TEST-TestSolrConfigHandlerCloud.test-seed#[64370980C7089CB8]) [n:127.0.0.1:46039_ ] o.a.s.c.c.SolrZkClient makePath: /overseer/collection-queue-work
[junit4] 2> 435954 INFO (TEST-TestSolrConfigHandlerCloud.test-seed#[64370980C7089CB8]) [n:127.0.0.1:46039_ ] o.a.s.c.c.SolrZkClient makePath: /overseer/collection-map-running
[junit4] 2> 435954 INFO (TEST-TestSolrConfigHandlerCloud.test-seed#[64370980C7089CB8]) [n:127.0.0.1:46039_ ] o.a.s.c.c.SolrZkClient makePath: /overseer/collection-map-completed
[junit4] 2> 435955 INFO (TEST-TestSolrConfigHandlerCloud.test-seed#[64370980C7089CB8]) [n:127.0.0.1:46039_ ] o.a.s.c.c.SolrZkClient makePath: /overseer/collection-map-failure
[junit4] 2> 435955 INFO (TEST-TestSolrConfigHandlerCloud.test-seed#[64370980C7089CB8]) [n:127.0.0.1:46039_ ] o.a.s.c.c.SolrZkClient makePath: /live_nodes
[junit4] 2> 435956 INFO (TEST-TestSolrConfigHandlerCloud.test-seed#[64370980C7089CB8]) [n:127.0.0.1:46039_ ] o.a.s.c.c.SolrZkClient makePath: /aliases.json
[junit4] 2> 435956 INFO (TEST-TestSolrConfigHandlerCloud.test-seed#[64370980C7089CB8]) [n:127.0.0.1:46039_ ] o.a.s.c.c.SolrZkClient makePath: /clusterstate.json
[junit4] 2> 435957 INFO (TEST-TestSolrConfigHandlerCloud.test-seed#[64370980C7089CB8]) [n:127.0.0.1:46039_ ] o.a.s.c.c.SolrZkClient makePath: /security.json
[junit4] 2> 435957 INFO (TEST-TestSolrConfigHandlerCloud.test-seed#[64370980C7089CB8]) [n:127.0.0.1:46039_ ] o.a.s.c.ZkController Register node as live in ZooKeeper:/live_nodes/127.0.0.1:46039_
[junit4] 2> 435957 INFO (TEST-TestSolrConfigHandlerCloud.test-seed#[64370980C7089CB8]) [n:127.0.0.1:46039_ ] o.a.s.c.c.SolrZkClient makePath: /live_nodes/127.0.0.1:46039_
[junit4] 2> 435958 INFO (TEST-TestSolrConfigHandlerCloud.test-seed#[64370980C7089CB8]) [n:127.0.0.1:46039_ ] o.a.s.c.c.SolrZkClient makePath: /overseer_elect
[junit4] 2> 435958 INFO (TEST-TestSolrConfigHandlerCloud.test-seed#[64370980C7089CB8]) [n:127.0.0.1:46039_ ] o.a.s.c.c.SolrZkClient makePath: /overseer_elect/election
[junit4] 2> 435959 INFO (TEST-TestSolrConfigHandlerCloud.test-seed#[64370980C7089CB8]) [n:127.0.0.1:46039_ ] o.a.s.c.Overseer Overseer (id=null) closing
[junit4] 2> 435959 INFO (TEST-TestSolrConfigHandlerCloud.test-seed#[64370980C7089CB8]) [n:127.0.0.1:46039_ ] o.a.s.c.LeaderElector Joined leadership election with path: /overseer_elect/election/96581376424083460-127.0.0.1:46039_-n_0000000000
[junit4] 2> 435959 INFO (TEST-TestSolrConfigHandlerCloud.test-seed#[64370980C7089CB8]) [n:127.0.0.1:46039_ ] o.a.s.c.OverseerElectionContext I am going to be the leader 127.0.0.1:46039_
[junit4] 2> 435959 INFO (TEST-TestSolrConfigHandlerCloud.test-seed#[64370980C7089CB8]) [n:127.0.0.1:46039_ ] o.a.s.c.c.SolrZkClient makePath: /overseer_elect/leader
[junit4] 2> 435960 INFO (TEST-TestSolrConfigHandlerCloud.test-seed#[64370980C7089CB8]) [n:127.0.0.1:46039_ ] o.a.s.c.Overseer Overseer (id=96581376424083460-127.0.0.1:46039_-n_0000000000) starting
[junit4] 2> 435960 INFO (TEST-TestSolrConfigHandlerCloud.test-seed#[64370980C7089CB8]) [n:127.0.0.1:46039_ ] o.a.s.c.c.SolrZkClient makePath: /overseer/queue-work
[junit4] 2> 435962 INFO (TEST-TestSolrConfigHandlerCloud.test-seed#[64370980C7089CB8]) [n:127.0.0.1:46039_ ] o.a.s.c.OverseerAutoReplicaFailoverThread Starting OverseerAutoReplicaFailoverThread autoReplicaFailoverWorkLoopDelay=10000 autoReplicaFailoverWaitAfterExpiration=30000 autoReplicaFailoverBadNodeExpiration=60000
[junit4] 2> 435962 INFO (OverseerCollectionConfigSetProcessor-96581376424083460-127.0.0.1:46039_-n_0000000000) [n:127.0.0.1:46039_ ] o.a.s.c.OverseerTaskProcessor Process current queue of overseer operations
[junit4] 2> 435962 INFO (TEST-TestSolrConfigHandlerCloud.test-seed#[64370980C7089CB8]) [n:127.0.0.1:46039_ ] o.a.s.c.c.ZkStateReader Updating cluster state from ZooKeeper...
[junit4] 2> 435962 INFO (OverseerStateUpdate-96581376424083460-127.0.0.1:46039_-n_0000000000) [n:127.0.0.1:46039_ ] o.a.s.c.Overseer Starting to work on the main queue
[junit4] 2> 435987 INFO (TEST-TestSolrConfigHandlerCloud.test-seed#[64370980C7089CB8]) [n:127.0.0.1:46039_ ] o.a.s.c.CoreContainer Security conf doesn't exist. Skipping setup for authorization module.
[junit4] 2> 435987 INFO (TEST-TestSolrConfigHandlerCloud.test-seed#[64370980C7089CB8]) [n:127.0.0.1:46039_ ] o.a.s.c.CoreContainer No authentication plugin used.
[junit4] 2> 435988 INFO (TEST-TestSolrConfigHandlerCloud.test-seed#[64370980C7089CB8]) [n:127.0.0.1:46039_ ] o.a.s.c.CorePropertiesLocator Looking for core definitions underneath /home/jenkins/workspace/Lucene-Solr-5.5-Linux/solr/build/solr-core/test/J0/../../../../../../../../../home/jenkins/workspace/Lucene-Solr-5.5-Linux/solr/build/solr-core/test/J0/temp/solr.handler.TestSolrConfigHandlerCloud_64370980C7089CB8-001/control-001/cores
[junit4] 2> 435989 INFO (TEST-TestSolrConfigHandlerCloud.test-seed#[64370980C7089CB8]) [n:127.0.0.1:46039_ ] o.a.s.c.CoreDescriptor Created CoreDescriptor: {name=collection1, config=solrconfig.xml, transient=false, schema=schema.xml, loadOnStartup=true, configSetProperties=configsetprops.json, collection=control_collection, coreNodeName=, dataDir=data/, shard=}
[junit4] 2> 435989 INFO (TEST-TestSolrConfigHandlerCloud.test-seed#[64370980C7089CB8]) [n:127.0.0.1:46039_ ] o.a.s.c.CorePropertiesLocator Found core collection1 in /home/jenkins/workspace/Lucene-Solr-5.5-Linux/solr/build/solr-core/test/J0/../../../../../../../../../home/jenkins/workspace/Lucene-Solr-5.5-Linux/solr/build/solr-core/test/J0/temp/solr.handler.TestSolrConfigHandlerCloud_64370980C7089CB8-001/control-001/cores/collection1
[junit4] 2> 435989 INFO (TEST-TestSolrConfigHandlerCloud.test-seed#[64370980C7089CB8]) [n:127.0.0.1:46039_ ] o.a.s.c.CorePropertiesLocator Found 1 core definitions
[junit4] 2> 435990 INFO (TEST-TestSolrConfigHandlerCloud.test-seed#[64370980C7089CB8]) [n:127.0.0.1:46039_ ] o.a.s.s.SolrDispatchFilter user.dir=/home/jenkins/workspace/Lucene-Solr-5.5-Linux/solr/build/solr-core/test/J0
[junit4] 2> 435990 INFO (TEST-TestSolrConfigHandlerCloud.test-seed#[64370980C7089CB8]) [n:127.0.0.1:46039_ ] o.a.s.s.SolrDispatchFilter SolrDispatchFilter.init() done
[junit4] 2> 435990 INFO (coreLoadExecutor-2478-thread-1-processing-n:127.0.0.1:46039_) [n:127.0.0.1:46039_ c:control_collection x:collection1] o.a.s.c.ZkController publishing state=down
[junit4] 2> 435990 INFO (coreLoadExecutor-2478-thread-1-processing-n:127.0.0.1:46039_) [n:127.0.0.1:46039_ c:control_collection x:collection1] o.a.s.c.ZkController numShards not found on descriptor - reading it from system property
[junit4] 2> 435991 INFO (OverseerStateUpdate-96581376424083460-127.0.0.1:46039_-n_0000000000) [n:127.0.0.1:46039_ ] o.a.s.c.Overseer processMessage: queueSize: 1, message = {
[junit4] 2> "core":"collection1",
[junit4] 2> "roles":null,
[junit4] 2> "base_url":"http://127.0.0.1:46039",
[junit4] 2> "node_name":"127.0.0.1:46039_",
[junit4] 2> "numShards":"1",
[junit4] 2> "state":"down",
[junit4] 2> "shard":null,
[junit4] 2> "collection":"control_collection",
[junit4] 2> "operation":"state"} current state version: 0
[junit4] 2> 435991 INFO (coreLoadExecutor-2478-thread-1-processing-n:127.0.0.1:46039_) [n:127.0.0.1:46039_ c:control_collection x:collection1] o.a.s.c.ZkController Collection control_collection not visible yet, but flagging it so a watch is registered when it becomes visible
[junit4] 2> 435991 INFO (coreLoadExecutor-2478-thread-1-processing-n:127.0.0.1:46039_) [n:127.0.0.1:46039_ c:control_collection x:collection1] o.a.s.c.c.ZkStateReader addZkWatch [control_collection]
[junit4] 2> 435991 INFO (OverseerStateUpdate-96581376424083460-127.0.0.1:46039_-n_0000000000) [n:127.0.0.1:46039_ ] o.a.s.c.o.ReplicaMutator Update state numShards=1 message={
[junit4] 2> "core":"collection1",
[junit4] 2> "roles":null,
[junit4] 2> "base_url":"http://127.0.0.1:46039",
[junit4] 2> "node_name":"127.0.0.1:46039_",
[junit4] 2> "numShards":"1",
[junit4] 2> "state":"down",
[junit4] 2> "shard":null,
[junit4] 2> "collection":"control_collection",
[junit4] 2> "operation":"state"}
[junit4] 2> 435991 INFO (coreLoadExecutor-2478-thread-1-processing-n:127.0.0.1:46039_) [n:127.0.0.1:46039_ c:control_collection x:collection1] o.a.s.c.c.ZkStateReader Deleting data for [control_collection]
[junit4] 2> 435991 INFO (OverseerStateUpdate-96581376424083460-127.0.0.1:46039_-n_0000000000) [n:127.0.0.1:46039_ ] o.a.s.c.o.ClusterStateMutator building a new cName: control_collection
[junit4] 2> 435992 INFO (OverseerStateUpdate-96581376424083460-127.0.0.1:46039_-n_0000000000) [n:127.0.0.1:46039_ ] o.a.s.c.o.ReplicaMutator Assigning new node to shard shard=shard1
[junit4] 2> 435992 INFO (coreLoadExecutor-2478-thread-1-processing-n:127.0.0.1:46039_) [n:127.0.0.1:46039_ c:control_collection x:collection1] o.a.s.c.ZkController look for our core node name
[junit4] 2> 435992 INFO (zkCallback-468-thread-1-processing-n:127.0.0.1:46039_) [n:127.0.0.1:46039_ ] o.a.s.c.c.ZkStateReader A cluster state change: [WatchedEvent state:SyncConnected type:NodeDataChanged path:/clusterstate.json], has occurred - updating... (live nodes size: [1])
[junit4] 2> 436992 INFO (coreLoadExecutor-2478-thread-1-processing-n:127.0.0.1:46039_) [n:127.0.0.1:46039_ c:control_collection x:collection1] o.a.s.c.ZkController waiting to find shard id in clusterstate for collection1
[junit4] 2> 436992 INFO (coreLoadExecutor-2478-thread-1-processing-n:127.0.0.1:46039_) [n:127.0.0.1:46039_ c:control_collection x:collection1] o.a.s.c.ZkController Check for collection zkNode:control_collection
[junit4] 2> 436993 INFO (coreLoadExecutor-2478-thread-1-processing-n:127.0.0.1:46039_) [n:127.0.0.1:46039_ c:control_collection x:collection1] o.a.s.c.ZkController Collection zkNode exists
[junit4] 2> 436993 INFO (coreLoadExecutor-2478-thread-1-processing-n:127.0.0.1:46039_) [n:127.0.0.1:46039_ c:control_collection x:collection1] o.a.s.c.c.ZkStateReader Load collection config from: [/collections/control_collection]
[junit4] 2> 436993 INFO (coreLoadExecutor-2478-thread-1-processing-n:127.0.0.1:46039_) [n:127.0.0.1:46039_ c:control_collection x:collection1] o.a.s.c.c.ZkStateReader path=[/collections/control_collection] [configName]=[conf1] specified config exists in ZooKeeper
[junit4] 2> 436993 INFO (coreLoadExecutor-2478-thread-1-processing-n:127.0.0.1:46039_) [n:127.0.0.1:46039_ c:control_collection x:collection1] o.a.s.c.SolrResourceLoader new SolrResourceLoader for directory: '/home/jenkins/workspace/Lucene-Solr-5.5-Linux/solr/build/solr-core/test/J0/temp/solr.handler.TestSolrConfigHandlerCloud_64370980C7089CB8-001/control-001/cores/collection1'
[junit4] 2> 436993 INFO (coreLoadExecutor-2478-thread-1-processing-n:127.0.0.1:46039_) [n:127.0.0.1:46039_ c:control_collection x:collection1] o.a.s.c.SolrResourceLoader JNDI not configured for solr (NoInitialContextEx)
[junit4] 2> 436993 INFO (coreLoadExecutor-2478-thread-1-processing-n:127.0.0.1:46039_) [n:127.0.0.1:46039_ c:control_collection x:collection1] o.a.s.c.SolrResourceLoader solr home defaulted to 'solr/' (could not find system property or JNDI)
[junit4] 2> 436994 INFO (coreLoadExecutor-2478-thread-1-processing-n:127.0.0.1:46039_) [n:127.0.0.1:46039_ c:control_collection x:collection1] o.a.s.c.Config loaded config solrconfig.xml with version 0
[junit4] 2> 436998 INFO (coreLoadExecutor-2478-thread-1-processing-n:127.0.0.1:46039_) [n:127.0.0.1:46039_ c:control_collection x:collection1] o.a.s.c.SolrConfig current version of requestparams : -1
[junit4] 2> 437001 WARN (coreLoadExecutor-2478-thread-1-processing-n:127.0.0.1:46039_) [n:127.0.0.1:46039_ c:control_collection x:collection1] o.a.s.c.Config Beginning with Solr 5.5, <mergePolicy> is deprecated, use <mergePolicyFactory> instead.
[junit4] 2> 437002 INFO (coreLoadExecutor-2478-thread-1-processing-n:127.0.0.1:46039_) [n:127.0.0.1:46039_ c:control_collection x:collection1] o.a.s.c.SolrConfig Using Lucene MatchVersion: 5.5.4
[junit4] 2> 437013 INFO (coreLoadExecutor-2478-thread-1-processing-n:127.0.0.1:46039_) [n:127.0.0.1:46039_ c:control_collection x:collection1] o.a.s.c.SolrConfig Loaded SolrConfig: solrconfig.xml
[junit4] 2> 437017 INFO (coreLoadExecutor-2478-thread-1-processing-n:127.0.0.1:46039_) [n:127.0.0.1:46039_ c:control_collection x:collection1] o.a.s.s.IndexSchema [collection1] Schema name=test
[junit4] 2> 437134 INFO (coreLoadExecutor-2478-thread-1-processing-n:127.0.0.1:46039_) [n:127.0.0.1:46039_ c:control_collection x:collection1] o.a.s.s.OpenExchangeRatesOrgProvider Initialized with rates=open-exchange-rates.json, refreshInterval=1440.
[junit4] 2> 437138 INFO (coreLoadExecutor-2478-thread-1-processing-n:127.0.0.1:46039_) [n:127.0.0.1:46039_ c:control_collection x:collection1] o.a.s.s.IndexSchema default search field in schema is text
[junit4] 2> 437139 INFO (coreLoadExecutor-2478-thread-1-processing-n:127.0.0.1:46039_) [n:127.0.0.1:46039_ c:control_collection x:collection1] o.a.s.s.IndexSchema unique key field: id
[junit4] 2> 437144 INFO (coreLoadExecutor-2478-thread-1-processing-n:127.0.0.1:46039_) [n:127.0.0.1:46039_ c:control_collection x:collection1] o.a.s.s.FileExchangeRateProvider Reloading exchange rates from file currency.xml
[junit4] 2> 437145 INFO (coreLoadExecutor-2478-thread-1-processing-n:127.0.0.1:46039_) [n:127.0.0.1:46039_ c:control_collection x:collection1] o.a.s.s.FileExchangeRateProvider Reloading exchange rates from file currency.xml
[junit4] 2> 437146 INFO (coreLoadExecutor-2478-thread-1-processing-n:127.0.0.1:46039_) [n:127.0.0.1:46039_ c:control_collection x:collection1] o.a.s.s.OpenExchangeRatesOrgProvider Reloading exchange rates from open-exchange-rates.json
[junit4] 2> 437147 INFO (coreLoadExecutor-2478-thread-1-processing-n:127.0.0.1:46039_) [n:127.0.0.1:46039_ c:control_collection x:collection1] o.a.s.s.OpenExchangeRatesOrgProvider Reloading exchange rates from open-exchange-rates.json
[junit4] 2> 437148 INFO (coreLoadExecutor-2478-thread-1-processing-n:127.0.0.1:46039_) [n:127.0.0.1:46039_ c:control_collection x:collection1] o.a.s.c.ConfigSetProperties Did not find ConfigSet properties, assuming default properties: Can't find resource 'configsetprops.json' in classpath or '/configs/conf1', cwd=/home/jenkins/workspace/Lucene-Solr-5.5-Linux/solr/build/solr-core/test/J0
[junit4] 2> 437148 INFO (coreLoadExecutor-2478-thread-1-processing-n:127.0.0.1:46039_) [n:127.0.0.1:46039_ c:control_collection x:collection1] o.a.s.c.CoreContainer Creating SolrCore 'collection1' using configuration from collection control_collection
[junit4] 2> 437148 INFO (coreLoadExecutor-2478-thread-1-processing-n:127.0.0.1:46039_) [n:127.0.0.1:46039_ c:control_collection s:shard1 r:core_node1 x:collection1] o.a.s.c.SolrCore org.apache.solr.core.MockDirectoryFactory
[junit4] 2> 437148 INFO (coreLoadExecutor-2478-thread-1-processing-n:127.0.0.1:46039_) [n:127.0.0.1:46039_ c:control_collection s:shard1 r:core_node1 x:collection1] o.a.s.c.SolrCore [[collection1] ] Opening new SolrCore at [/home/jenkins/workspace/Lucene-Solr-5.5-Linux/solr/build/solr-core/test/J0/temp/solr.handler.TestSolrConfigHandlerCloud_64370980C7089CB8-001/control-001/cores/collection1], dataDir=[/home/jenkins/workspace/Lucene-Solr-5.5-Linux/solr/build/solr-core/test/J0/../../../../../../../../../home/jenkins/workspace/Lucene-Solr-5.5-Linux/solr/build/solr-core/test/J0/temp/solr.handler.TestSolrConfigHandlerCloud_64370980C7089CB8-001/control-001/cores/collection1/data/]
[junit4] 2> 437148 INFO (coreLoadExecutor-2478-thread-1-processing-n:127.0.0.1:46039_) [n:127.0.0.1:46039_ c:control_collection s:shard1 r:core_node1 x:collection1] o.a.s.c.JmxMonitoredMap JMX monitoring is enabled. Adding Solr mbeans to JMX Server: com.sun.jmx.mbeanserver.JmxMBeanServer@16e7d1f
[junit4] 2> 437149 INFO (coreLoadExecutor-2478-thread-1-processing-n:127.0.0.1:46039_) [n:127.0.0.1:46039_ c:control_collection s:shard1 r:core_node1 x:collection1] o.a.s.c.CachingDirectoryFactory return new directory for /home/jenkins/workspace/Lucene-Solr-5.5-Linux/solr/build/solr-core/test/J0/../../../../../../../../../home/jenkins/workspace/Lucene-Solr-5.5-Linux/solr/build/solr-core/test/J0/temp/solr.handler.TestSolrConfigHandlerCloud_64370980C7089CB8-001/control-001/cores/collection1/data
[junit4] 2> 437149 INFO (coreLoadExecutor-2478-thread-1-processing-n:127.0.0.1:46039_) [n:127.0.0.1:46039_ c:control_collection s:shard1 r:core_node1 x:collection1] o.a.s.c.SolrCore New index directory detected: old=null new=/home/jenkins/workspace/Lucene-Solr-5.5-Linux/solr/build/solr-core/test/J0/../../../../../../../../../home/jenkins/workspace/Lucene-Solr-5.5-Linux/solr/build/solr-core/test/J0/temp/solr.handler.TestSolrConfigHandlerCloud_64370980C7089CB8-001/control-001/cores/collection1/data/index/
[junit4] 2> 437149 WARN (coreLoadExecutor-2478-thread-1-processing-n:127.0.0.1:46039_) [n:127.0.0.1:46039_ c:control_collection s:shard1 r:core_node1 x:collection1] o.a.s.c.SolrCore [collection1] Solr index directory '/home/jenkins/workspace/Lucene-Solr-5.5-Linux/solr/build/solr-core/test/J0/../../../../../../../../../home/jenkins/workspace/Lucene-Solr-5.5-Linux/solr/build/solr-core/test/J0/temp/solr.handler.TestSolrConfigHandlerCloud_64370980C7089CB8-001/control-001/cores/collection1/data/index' doesn't exist. Creating new index...
[junit4] 2> 437149 INFO (coreLoadExecutor-2478-thread-1-processing-n:127.0.0.1:46039_) [n:127.0.0.1:46039_ c:control_collection s:shard1 r:core_node1 x:collection1] o.a.s.c.CachingDirectoryFactory return new directory for /home/jenkins/workspace/Lucene-Solr-5.5-Linux/solr/build/solr-core/test/J0/../../../../../../../../../home/jenkins/workspace/Lucene-Solr-5.5-Linux/solr/build/solr-core/test/J0/temp/solr.handler.TestSolrConfigHandlerCloud_64370980C7089CB8-001/control-001/cores/collection1/data/index
[junit4] 2> 437149 INFO (coreLoadExecutor-2478-thread-1-processing-n:127.0.0.1:46039_) [n:127.0.0.1:46039_ c:control_collection s:shard1 r:core_node1 x:collection1] o.a.s.u.RandomMergePolicy RandomMergePolicy wrapping class org.apache.lucene.index.LogByteSizeMergePolicy: [LogByteSizeMergePolicy: minMergeSize=1677721, mergeFactor=29, maxMergeSize=2147483648, maxMergeSizeForForcedMerge=9223372036854775807, calibrateSizeByDeletes=false, maxMergeDocs=2147483647, maxCFSSegmentSizeMB=8.796093022207999E12, noCFSRatio=1.0]
[junit4] 2> 437149 INFO (coreLoadExecutor-2478-thread-1-processing-n:127.0.0.1:46039_) [n:127.0.0.1:46039_ c:control_collection s:shard1 r:core_node1 x:collection1] o.a.s.c.SolrDeletionPolicy SolrDeletionPolicy.onCommit: commits: num=1
[junit4] 2> commit{dir=MockDirectoryWrapper(RAMDirectory@66020 lockFactory=org.apache.lucene.store.SingleInstanceLockFactory@106bf45),segFN=segments_1,generation=1}
[junit4] 2> 437149 INFO (coreLoadExecutor-2478-thread-1-processing-n:127.0.0.1:46039_) [n:127.0.0.1:46039_ c:control_collection s:shard1 r:core_node1 x:collection1] o.a.s.c.SolrDeletionPolicy newest commit generation = 1
[junit4] 2> 437150 INFO (OldIndexDirectoryCleanupThreadForCore-collection1) [n:127.0.0.1:46039_ c:control_collection s:shard1 r:core_node1 x:collection1] o.a.s.c.SolrCore Looking for old index directories to cleanup for core collection1 in /home/jenkins/workspace/Lucene-Solr-5.5-Linux/solr/build/solr-core/test/J0/../../../../../../../../../home/jenkins/workspace/Lucene-Solr-5.5-Linux/solr/build/solr-core/test/J0/temp/solr.handler.TestSolrConfigHandlerCloud_64370980C7089CB8-001/control-001/cores/collection1/data/
[junit4] 2> 437150 WARN (OldIndexDirectoryCleanupThreadForCore-collection1) [n:127.0.0.1:46039_ c:control_collection s:shard1 r:core_node1 x:collection1] o.a.s.c.DirectoryFactory /home/jenkins/workspace/Lucene-Solr-5.5-Linux/solr/build/solr-core/test/J0/../../../../../../../../../home/jenkins/workspace/Lucene-Solr-5.5-Linux/solr/build/solr-core/test/J0/temp/solr.handler.TestSolrConfigHandlerCloud_64370980C7089CB8-001/control-001/cores/collection1/data/ does not point to a valid data directory; skipping clean-up of old index directories.
[junit4] 2> 437151 INFO (coreLoadExecutor-2478-thread-1-processing-n:127.0.0.1:46039_) [n:127.0.0.1:46039_ c:control_collection s:shard1 r:core_node1 x:collection1] o.a.s.u.p.UpdateRequestProcessorChain creating updateRequestProcessorChain "nodistrib"
[junit4] 2> 437151 INFO (coreLoadExecutor-2478-thread-1-processing-n:127.0.0.1:46039_) [n:127.0.0.1:46039_ c:control_collection s:shard1 r:core_node1 x:collection1] o.a.s.u.p.UpdateRequestProcessorChain creating updateRequestProcessorChain "dedupe"
[junit4] 2> 437152 INFO (coreLoadExecutor-2478-thread-1-processing-n:127.0.0.1:46039_) [n:127.0.0.1:46039_ c:control_collection s:shard1 r:core_node1 x:collection1] o.a.s.u.p.UpdateRequestProcessorChain inserting DistributedUpdateProcessorFactory into updateRequestProcessorChain "dedupe"
[junit4] 2> 437152 INFO (coreLoadExecutor-2478-thread-1-processing-n:127.0.0.1:46039_) [n:127.0.0.1:46039_ c:control_collection s:shard1 r:core_node1 x:collection1] o.a.s.u.p.UpdateRequestProcessorChain creating updateRequestProcessorChain "stored_sig"
[junit4] 2> 437152 INFO (coreLoadExecutor-2478-thread-1-processing-n:127.0.0.1:46039_) [n:127.0.0.1:46039_ c:control_collection s:shard1 r:core_node1 x:collection1] o.a.s.u.p.UpdateRequestProcessorChain inserting DistributedUpdateProcessorFactory into updateRequestProcessorChain "stored_sig"
[junit4] 2> 437152 INFO (coreLoadExecutor-2478-thread-1-processing-n:127.0.0.1:46039_) [n:127.0.0.1:46039_ c:control_collection s:shard1 r:core_node1 x:collection1] o.a.s.u.p.UpdateRequestProcessorChain creating updateRequestProcessorChain "distrib-dup-test-chain-explicit"
[junit4] 2> 437152 INFO (coreLoadExecutor-2478-thread-1-processing-n:127.0.0.1:46039_) [n:127.0.0.1:46039_ c:control_collection s:shard1 r:core_node1 x:collection1] o.a.s.u.p.UpdateRequestProcessorChain creating updateRequestProcessorChain "distrib-dup-test-chain-implicit"
[junit4] 2> 437152 INFO (coreLoadExecutor-2478-thread-1-processing-n:127.0.0.1:46039_) [n:127.0.0.1:46039_ c:control_collection s:shard1 r:core_node1 x:collection1] o.a.s.u.p.UpdateRequestProcessorChain inserting DistributedUpdateProcessorFactory into updateRequestProcessorChain "distrib-dup-test-chain-implicit"
[junit4] 2> 437153 INFO (coreLoadExecutor-2478-thread-1-processing-n:127.0.0.1:46039_) [n:127.0.0.1:46039_ c:control_collection s:shard1 r:core_node1 x:collection1] o.a.s.c.SolrCore no updateRequestProcessorChain defined as default, creating implicit default
[junit4] 2> 437153 WARN (coreLoadExecutor-2478-thread-1-processing-n:127.0.0.1:46039_) [n:127.0.0.1:46039_ c:control_collection s:shard1 r:core_node1 x:collection1] o.a.s.c.RequestHandlers INVALID paramSet a in requestHandler {type = requestHandler,name = /dump,class = DumpRequestHandler,args = {defaults={a=A,b=B}}}
[junit4] 2> 437154 INFO (coreLoadExecutor-2478-thread-1-processing-n:127.0.0.1:46039_) [n:127.0.0.1:46039_ c:control_collection s:shard1 r:core_node1 x:collection1] o.a.s.h.l.XMLLoader xsltCacheLifetimeSeconds=60
[junit4] 2> 437155 INFO (coreLoadExecutor-2478-thread-1-processing-n:127.0.0.1:46039_) [n:127.0.0.1:46039_ c:control_collection s:shard1 r:core_node1 x:collection1] o.a.s.h.l.XMLLoader xsltCacheLifetimeSeconds=60
[junit4] 2> 437155 INFO (coreLoadExecutor-2478-thread-1-processing-n:127.0.0.1:46039_) [n:127.0.0.1:46039_ c:control_collection s:shard1 r:core_node1 x:collection1] o.a.s.h.l.XMLLoader xsltCacheLifetimeSeconds=60
[junit4] 2> 437156 INFO (coreLoadExecutor-2478-thread-1-processing-n:127.0.0.1:46039_) [n:127.0.0.1:46039_ c:control_collection s:shard1 r:core_node1 x:collection1] o.a.s.h.l.XMLLoader xsltCacheLifetimeSeconds=60
[junit4] 2> 437157 INFO (coreLoadExecutor-2478-thread-1-processing-n:127.0.0.1:46039_) [n:127.0.0.1:46039_ c:control_collection s:shard1 r:core_node1 x:collection1] o.a.s.c.RequestHandlers Registered paths: /admin/mbeans,standard,/dump,/update/csv,/update/json/docs,/admin/luke,/admin/segments,/get,/admin/system,/replication,/admin/properties,/config,/schema,/admin/plugins,/admin/logging,/update/json,/admin/threads,/admin/ping,/update,/admin/file
[junit4] 2> 437158 INFO (coreLoadExecutor-2478-thread-1-processing-n:127.0.0.1:46039_) [n:127.0.0.1:46039_ c:control_collection s:shard1 r:core_node1 x:collection1] o.a.s.c.SolrCore Using default statsCache cache: org.apache.solr.search.stats.LocalStatsCache
[junit4] 2> 437158 INFO (coreLoadExecutor-2478-thread-1-processing-n:127.0.0.1:46039_) [n:127.0.0.1:46039_ c:control_collection s:shard1 r:core_node1 x:collection1] o.a.s.u.UpdateHandler Using UpdateLog implementation: org.apache.solr.update.UpdateLog
[junit4] 2> 437158 INFO (coreLoadExecutor-2478-thread-1-processing-n:127.0.0.1:46039_) [n:127.0.0.1:46039_ c:control_collection s:shard1 r:core_node1 x:collection1] o.a.s.u.UpdateLog Initializing UpdateLog: dataDir= defaultSyncLevel=FLUSH numRecordsToKeep=100 maxNumLogsToKeep=10 numVersionBuckets=65536
[junit4] 2> 437159 INFO (coreLoadExecutor-2478-thread-1-processing-n:127.0.0.1:46039_) [n:127.0.0.1:46039_ c:control_collection s:shard1 r:core_node1 x:collection1] o.a.s.u.CommitTracker Hard AutoCommit: disabled
[junit4] 2> 437159 INFO (coreLoadExecutor-2478-thread-1-processing-n:127.0.0.1:46039_) [n:127.0.0.1:46039_ c:control_collection s:shard1 r:core_node1 x:collection1] o.a.s.u.CommitTracker Soft AutoCommit: disabled
[junit4] 2> 437159 INFO (coreLoadExecutor-2478-thread-1-processing-n:127.0.0.1:46039_) [n:127.0.0.1:46039_ c:control_collection s:shard1 r:core_node1 x:collection1] o.a.s.u.RandomMergePolicy RandomMergePolicy wrapping class org.apache.lucene.index.TieredMergePolicy: [TieredMergePolicy: maxMergeAtOnce=44, maxMergeAtOnceExplicit=45, maxMergedSegmentMB=6.8779296875, floorSegmentMB=1.359375, forceMergeDeletesPctAllowed=21.340720529596794, segmentsPerTier=36.0, maxCFSSegmentSizeMB=8.796093022207999E12, noCFSRatio=1.0
[junit4] 2> 437159 INFO (coreLoadExecutor-2478-thread-1-processing-n:127.0.0.1:46039_) [n:127.0.0.1:46039_ c:control_collection s:shard1 r:core_node1 x:collection1] o.a.s.c.SolrDeletionPolicy SolrDeletionPolicy.onInit: commits: num=1
[junit4] 2> commit{dir=MockDirectoryWrapper(RAMDirectory@66020 lockFactory=org.apache.lucene.store.SingleInstanceLockFactory@106bf45),segFN=segments_1,generation=1}
[junit4] 2> 437159 INFO (coreLoadExecutor-2478-thread-1-processing-n:127.0.0.1:46039_) [n:127.0.0.1:46039_ c:control_collection s:shard1 r:core_node1 x:collection1] o.a.s.c.SolrDeletionPolicy newest commit generation = 1
[junit4] 2> 437159 INFO (coreLoadExecutor-2478-thread-1-processing-n:127.0.0.1:46039_) [n:127.0.0.1:46039_ c:control_collection s:shard1 r:core_node1 x:collection1] o.a.s.s.SolrIndexSearcher Opening Searcher@b3e282[collection1] main
[junit4] 2> 437159 INFO (coreLoadExecutor-2478-thread-1-processing-n:127.0.0.1:46039_) [n:127.0.0.1:46039_ c:control_collection s:shard1 r:core_node1 x:collection1] o.a.s.c.c.ZkStateReader Load collection config from: [/collections/control_collection]
[junit4] 2> 437160 INFO (coreLoadExecutor-2478-thread-1-processing-n:127.0.0.1:46039_) [n:127.0.0.1:46039_ c:control_collection s:shard1 r:core_node1 x:collection1] o.a.s.c.c.ZkStateReader path=[/collections/control_collection] [configName]=[conf1] specified config exists in ZooKeeper
[junit4] 2> 437160 INFO (coreLoadExecutor-2478-thread-1-processing-n:127.0.0.1:46039_) [n:127.0.0.1:46039_ c:control_collection s:shard1 r:core_node1 x:collection1] o.a.s.r.ManagedResourceStorage Setting up ZooKeeper-based storage for the RestManager with znodeBase: /configs/conf1
[junit4] 2> 437160 INFO (coreLoadExecutor-2478-thread-1-processing-n:127.0.0.1:46039_) [n:127.0.0.1:46039_ c:control_collection s:shard1 r:core_node1 x:collection1] o.a.s.r.ManagedResourceStorage Configured ZooKeeperStorageIO with znodeBase: /configs/conf1
[junit4] 2> 437160 INFO (coreLoadExecutor-2478-thread-1-processing-n:127.0.0.1:46039_) [n:127.0.0.1:46039_ c:control_collection s:shard1 r:core_node1 x:collection1] o.a.s.r.RestManager Initializing RestManager with initArgs: {}
[junit4] 2> 437160 INFO (coreLoadExecutor-2478-thread-1-processing-n:127.0.0.1:46039_) [n:127.0.0.1:46039_ c:control_collection s:shard1 r:core_node1 x:collection1] o.a.s.r.ManagedResourceStorage Reading _rest_managed.json using ZooKeeperStorageIO:path=/configs/conf1
[junit4] 2> 437161 INFO (coreLoadExecutor-2478-thread-1-processing-n:127.0.0.1:46039_) [n:127.0.0.1:46039_ c:control_collection s:shard1 r:core_node1 x:collection1] o.a.s.r.ManagedResourceStorage No data found for znode /configs/conf1/_rest_managed.json
[junit4] 2> 437161 INFO (coreLoadExecutor-2478-thread-1-processing-n:127.0.0.1:46039_) [n:127.0.0.1:46039_ c:control_collection s:shard1 r:core_node1 x:collection1] o.a.s.r.ManagedResourceStorage Loaded null at path _rest_managed.json using ZooKeeperStorageIO:path=/configs/conf1
[junit4] 2> 437161 INFO (coreLoadExecutor-2478-thread-1-processing-n:127.0.0.1:46039_) [n:127.0.0.1:46039_ c:control_collection s:shard1 r:core_node1 x:collection1] o.a.s.r.RestManager Initializing 0 registered ManagedResources
[junit4] 2> 437161 INFO (coreLoadExecutor-2478-thread-1-processing-n:127.0.0.1:46039_) [n:127.0.0.1:46039_ c:control_collection s:shard1 r:core_node1 x:collection1] o.a.s.h.ReplicationHandler Commits will be reserved for 10000
[junit4] 2> 437161 INFO (searcherExecutor-2479-thread-1-processing-n:127.0.0.1:46039_ x:collection1 s:shard1 c:control_collection r:core_node1) [n:127.0.0.1:46039_ c:control_collection s:shard1 r:core_node1 x:collection1] o.a.s.c.SolrCore [collection1] Registered new searcher Searcher@b3e282[collection1] main{ExitableDirectoryReader(UninvertingDirectoryReader())}
[junit4] 2> 437161 INFO (coreLoadExecutor-2478-thread-1-processing-n:127.0.0.1:46039_) [n:127.0.0.1:46039_ c:control_collection s:shard1 r:core_node1 x:collection1] o.a.s.u.UpdateLog Looking up max value of version field to seed version buckets
[junit4] 2> 437161 INFO (coreLoadExecutor-2478-thread-1-processing-n:127.0.0.1:46039_) [n:127.0.0.1:46039_ c:control_collection s:shard1 r:core_node1 x:collection1] o.a.s.u.VersionInfo Refreshing highest value of _version_ for 65536 version buckets from index
[junit4] 2> 437161 INFO (coreLoadExecutor-2478-thread-1-processing-n:127.0.0.1:46039_) [n:127.0.0.1:46039_ c:control_collection s:shard1 r:core_node1 x:collection1] o.a.s.u.VersionInfo No terms found for _version_, cannot seed version bucket highest value from index
[junit4] 2> 437162 INFO (coreLoadExecutor-2478-thread-1-processing-n:127.0.0.1:46039_) [n:127.0.0.1:46039_ c:control_collection s:shard1 r:core_node1 x:collection1] o.a.s.u.UpdateLog Could not find max version in index or recent updates, using new clock 1545302024271167488
[junit4] 2> 437163 INFO (coreLoadExecutor-2478-thread-1-processing-n:127.0.0.1:46039_) [n:127.0.0.1:46039_ c:control_collection s:shard1 r:core_node1 x:collection1] o.a.s.u.UpdateLog Took 1.0ms to seed version buckets with highest version 1545302024271167488
[junit4] 2> 437163 INFO (coreLoadExecutor-2478-thread-1-processing-n:127.0.0.1:46039_) [n:127.0.0.1:46039_ c:control_collection s:shard1 r:core_node1 x:collection1] o.a.s.c.ZkController watch zkdir /configs/conf1
[junit4] 2> 437164 INFO (coreLoadExecutor-2478-thread-1-processing-n:127.0.0.1:46039_) [n:127.0.0.1:46039_ c:control_collection s:shard1 r:core_node1 x:collection1] o.a.s.c.CoreContainer registering core: collection1
[junit4] 2> 437164 INFO (coreZkRegister-2472-thread-1-processing-n:127.0.0.1:46039_ x:collection1 s:shard1 c:control_collection r:core_node1) [n:127.0.0.1:46039_ c:control_collection s:shard1 r:core_node1 x:collection1] o.a.s.c.ZkController Register replica - core:collection1 address:http://127.0.0.1:46039 collection:control_collection shard:shard1
[junit4] 2> 437165 INFO (coreZkRegister-2472-thread-1-processing-n:127.0.0.1:46039_ x:collection1 s:shard1 c:control_collection r:core_node1) [n:127.0.0.1:46039_ c:control_collection s:shard1 r:core_node1 x:collection1] o.a.s.c.c.SolrZkClient makePath: /collections/control_collection/leader_elect/shard1/election
[junit4] 2> 437167 INFO (coreZkRegister-2472-thread-1-processing-n:127.0.0.1:46039_ x:collection1 s:shard1 c:control_collection r:core_node1) [n:127.0.0.1:46039_ c:control_collection s:shard1 r:core_node1 x:collection1] o.a.s.c.LeaderElector Joined leadership election with path: /collections/control_collection/leader_elect/shard1/election/96581376424083460-core_node1-n_0000000000
[junit4] 2> 437168 INFO (coreZkRegister-2472-thread-1-processing-n:127.0.0.1:46039_ x:collection1 s:shard1 c:control_collection r:core_node1) [n:127.0.0.1:46039_ c:control_collection s:shard1 r:core_node1 x:collection1] o.a.s.c.ShardLeaderElectionContext Running the leader process for shard=shard1 and weAreReplacement=false and leaderVoteWait=10000
[junit4] 2> 437168 INFO (coreZkRegister-2472-thread-1-processing-n:127.0.0.1:46039_ x:collection1 s:shard1 c:control_collection r:core_node1) [n:127.0.0.1:46039_ c:control_collection s:shard1 r:core_node1 x:collection1] o.a.s.c.ShardLeaderElectionContext Enough replicas found to continue.
[junit4] 2> 437168 INFO (coreZkRegister-2472-thread-1-processing-n:127.0.0.1:46039_ x:collection1 s:shard1 c:control_collection r:core_node1) [n:127.0.0.1:46039_ c:control_collection s:shard1 r:core_node1 x:collection1] o.a.s.c.ShardLeaderElectionContext I may be the new leader - try and sync
[junit4] 2> 437169 INFO (coreZkRegister-2472-thread-1-processing-n:127.0.0.1:46039_ x:collection1 s:shard1 c:control_collection r:core_node1) [n:127.0.0.1:46039_ c:control_collection s:shard1 r:core_node1 x:collection1] o.a.s.c.SyncStrategy Sync replicas to http://127.0.0.1:46039/collection1/
[junit4] 2> 437169 INFO (coreZkRegister-2472-thread-1-processing-n:127.0.0.1:46039_ x:collection1 s:shard1 c:control_collection r:core_node1) [n:127.0.0.1:46039_ c:control_collection s:shard1 r:core_node1 x:collection1] o.a.s.c.SyncStrategy Sync Success - now sync replicas to me
[junit4] 2> 437169 INFO (coreZkRegister-2472-thread-1-processing-n:127.0.0.1:46039_ x:collection1 s:shard1 c:control_collection r:core_node1) [n:127.0.0.1:46039_ c:control_collection s:shard1 r:core_node1 x:collection1] o.a.s.c.SyncStrategy http://127.0.0.1:46039/collection1/ has no replicas
[junit4] 2> 437169 INFO (OverseerStateUpdate-96581376424083460-127.0.0.1:46039_-n_0000000000) [n:127.0.0.1:46039_ ] o.a.s.c.Overseer processMessage: queueSize: 1, message = {
[junit4] 2> "operation":"leader",
[junit4] 2> "shard":"shard1",
[junit4] 2> "collection":"control_collection"} current state version: 1
[junit4] 2> 437169 INFO (coreZkRegister-2472-thread-1-processing-n:127.0.0.1:46039_ x:collection1 s:shard1 c:control_collection r:core_node1) [n:127.0.0.1:46039_ c:control_collection s:shard1 r:core_node1 x:collection1] o.a.s.c.c.SolrZkClient makePath: /collections/control_collection/leaders/shard1
[junit4] 2> 437170 INFO (coreZkRegister-2472-thread-1-processing-n:127.0.0.1:46039_ x:collection1 s:shard1 c:control_collection r:core_node1) [n:127.0.0.1:46039_ c:control_collection s:shard1 r:core_node1 x:collection1] o.a.s.c.ShardLeaderElectionContextBase Creating leader registration node /collections/control_collection/leaders/shard1/leader after winning as /collections/control_collection/leader_elect/shard1/election/96581376424083460-core_node1-n_0000000000
[junit4] 2> 437171 INFO (coreZkRegister-2472-thread-1-processing-n:127.0.0.1:46039_ x:collection1 s:shard1 c:control_collection r:core_node1) [n:127.0.0.1:46039_ c:control_collection s:shard1 r:core_node1 x:collection1] o.a.s.c.ShardLeaderElectionContext I am the new leader: http://127.0.0.1:46039/collection1/ shard1
[junit4] 2> 437171 INFO (OverseerStateUpdate-96581376424083460-127.0.0.1:46039_-n_0000000000) [n:127.0.0.1:46039_ ] o.a.s.c.Overseer processMessage: queueSize: 1, message = {
[junit4] 2> "operation":"leader",
[junit4] 2> "shard":"shard1",
[junit4] 2> "collection":"control_collection",
[junit4] 2> "base_url":"http://127.0.0.1:46039",
[junit4] 2> "core":"collection1",
[junit4] 2> "state":"active"} current state version: 1
[junit4] 2> 437274 INFO (zkCallback-468-thread-1-processing-n:127.0.0.1:46039_) [n:127.0.0.1:46039_ ] o.a.s.c.c.ZkStateReader A cluster state change: [WatchedEvent state:SyncConnected type:NodeDataChanged path:/clusterstate.json], has occurred - updating... (live nodes size: [1])
[junit4] 2> 437322 INFO (coreZkRegister-2472-thread-1-processing-n:127.0.0.1:46039_ x:collection1 s:shard1 c:control_collection r:core_node1) [n:127.0.0.1:46039_ c:control_collection s:shard1 r:core_node1 x:collection1] o.a.s.c.ZkController We are http://127.0.0.1:46039/collection1/ and leader is http://127.0.0.1:46039/collection1/
[junit4] 2> 437322 INFO (coreZkRegister-2472-thread-1-processing-n:127.0.0.1:46039_ x:collection1 s:shard1 c:control_collection r:core_node1) [n:127.0.0.1:46039_ c:control_collection s:shard1 r:core_node1 x:collection1] o.a.s.c.ZkController No LogReplay needed for core=collection1 baseURL=http://127.0.0.1:46039
[junit4] 2> 437322 INFO (coreZkRegister-2472-thread-1-processing-n:127.0.0.1:46039_ x:collection1 s:shard1 c:control_collection r:core_node1) [n:127.0.0.1:46039_ c:control_collection s:shard1 r:core_node1 x:collection1] o.a.s.c.ZkController I am the leader, no recovery necessary
[junit4] 2> 437322 INFO (coreZkRegister-2472-thread-1-processing-n:127.0.0.1:46039_ x:collection1 s:shard1 c:control_collection r:core_node1) [n:127.0.0.1:46039_ c:control_collection s:shard1 r:core_node1 x:collection1] o.a.s.c.ZkController publishing state=active
[junit4] 2> 437322 INFO (coreZkRegister-2472-thread-1-processing-n:127.0.0.1:46039_ x:collection1 s:shard1 c:control_collection r:core_node1) [n:127.0.0.1:46039_ c:control_collection s:shard1 r:core_node1 x:collection1] o.a.s.c.ZkController numShards not found on descriptor - reading it from system property
[junit4] 2> 437323 INFO (OverseerStateUpdate-96581376424083460-127.0.0.1:46039_-n_0000000000) [n:127.0.0.1:46039_ ] o.a.s.c.Overseer processMessage: queueSize: 1, message = {
[junit4] 2> "core":"collection1",
[junit4] 2> "core_node_name":"core_node1",
[junit4] 2> "roles":null,
[junit4] 2> "base_url":"http://127.0.0.1:46039",
[junit4] 2> "node_name":"127.0.0.1:46039_",
[junit4] 2> "numShards":"1",
[junit4] 2> "state":"active",
[junit4] 2> "shard":"shard1",
[junit4] 2> "collection":"control_collection",
[junit4] 2> "operation":"state"} current state version: 2
[junit4] 2> 437323 INFO (OverseerStateUpdate-96581376424083460-127.0.0.1:46039_-n_0000000000) [n:127.0.0.1:46039_ ] o.a.s.c.o.ReplicaMutator Update state numShards=1 message={
[junit4] 2> "core":"collection1",
[junit4] 2> "core_node_name":"core_node1",
[junit4] 2> "roles":null,
[junit4] 2> "base_url":"http://127.0.0.1:46039",
[junit4] 2> "node_name":"127.0.0.1:46039_",
[junit4] 2> "numShards":"1",
[junit4] 2> "state":"active",
[junit4] 2> "shard":"shard1",
[junit4] 2> "collection":"control_collection",
[junit4] 2> "operation":"state"}
[junit4] 2> 437424 INFO (zkCallback-468-thread-3-processing-n:127.0.0.1:46039_) [n:127.0.0.1:46039_ ] o.a.s.c.c.ZkStateReader A cluster state change: [WatchedEvent state:SyncConnected type:NodeDataChanged path:/clusterstate.json], has occurred - updating... (live nodes size: [1])
[junit4] 2> 437491 INFO (TEST-TestSolrConfigHandlerCloud.test-seed#[64370980C7089CB8]) [ ] o.a.s.c.c.SolrZkClient Using default ZkCredentialsProvider
[junit4] 2> 437492 INFO (TEST-TestSolrConfigHandlerCloud.test-seed#[64370980C7089CB8]) [ ] o.a.s.c.c.ConnectionManager Waiting for client to connect to ZooKeeper
[junit4] 2> 437493 INFO (zkCallback-470-thread-1) [ ] o.a.s.c.c.ConnectionManager Watcher org.apache.solr.common.cloud.ConnectionManager@36b8af name:ZooKeeperConnection Watcher:127.0.0.1:35061/solr got event WatchedEvent state:SyncConnected type:None path:null path:null type:None
[junit4] 2> 437493 INFO (TEST-TestSolrConfigHandlerCloud.test-seed#[64370980C7089CB8]) [ ] o.a.s.c.c.ConnectionManager Client is connected to ZooKeeper
[junit4] 2> 437493 INFO (TEST-TestSolrConfigHandlerCloud.test-seed#[64370980C7089CB8]) [ ] o.a.s.c.c.SolrZkClient Using default ZkACLProvider
[junit4] 2> 437493 INFO (TEST-TestSolrConfigHandlerCloud.test-seed#[64370980C7089CB8]) [ ] o.a.s.c.c.ZkStateReader Updating cluster state from ZooKeeper...
[junit4] 2> 437494 INFO (TEST-TestSolrConfigHandlerCloud.test-seed#[64370980C7089CB8]) [ ] o.a.s.c.ChaosMonkey monkey: init - expire sessions:false cause connection loss:false
[junit4] 2> 437560 INFO (TEST-TestSolrConfigHandlerCloud.test-seed#[64370980C7089CB8]) [ ] o.a.s.SolrTestCaseJ4 Writing core.properties file to /home/jenkins/workspace/Lucene-Solr-5.5-Linux/solr/build/solr-core/test/J0/temp/solr.handler.TestSolrConfigHandlerCloud_64370980C7089CB8-001/shard-1-001/cores/collection1
[junit4] 2> 437560 INFO (TEST-TestSolrConfigHandlerCloud.test-seed#[64370980C7089CB8]) [ ] o.a.s.c.AbstractFullDistribZkTestBase create jetty 1 in directory /home/jenkins/workspace/Lucene-Solr-5.5-Linux/solr/build/solr-core/test/J0/temp/solr.handler.TestSolrConfigHandlerCloud_64370980C7089CB8-001/shard-1-001
[junit4] 2> 437561 INFO (TEST-TestSolrConfigHandlerCloud.test-seed#[64370980C7089CB8]) [ ] o.e.j.s.Server jetty-9.2.13.v20150730
[junit4] 2> 437562 INFO (TEST-TestSolrConfigHandlerCloud.test-seed#[64370980C7089CB8]) [ ] o.e.j.s.h.ContextHandler Started o.e.j.s.ServletContextHandler@1886c23{/,null,AVAILABLE}
[junit4] 2> 437562 INFO (TEST-TestSolrConfigHandlerCloud.test-seed#[64370980C7089CB8]) [ ] o.e.j.s.ServerConnector Started ServerConnector@1a681bc{HTTP/1.1}{127.0.0.1:43827}
[junit4] 2> 437562 INFO (TEST-TestSolrConfigHandlerCloud.test-seed#[64370980C7089CB8]) [ ] o.e.j.s.Server Started @439306ms
[junit4] 2> 437562 INFO (TEST-TestSolrConfigHandlerCloud.test-seed#[64370980C7089CB8]) [ ] o.a.s.c.s.e.JettySolrRunner Jetty properties: {solr.data.dir=/home/jenkins/workspace/Lucene-Solr-5.5-Linux/solr/build/solr-core/test/J0/temp/solr.handler.TestSolrConfigHandlerCloud_64370980C7089CB8-001/tempDir-001/jetty1, solrconfig=solrconfig.xml, hostContext=/, hostPort=43827, coreRootDirectory=/home/jenkins/workspace/Lucene-Solr-5.5-Linux/solr/build/solr-core/test/J0/temp/solr.handler.TestSolrConfigHandlerCloud_64370980C7089CB8-001/shard-1-001/cores}
[junit4] 2> 437562 INFO (TEST-TestSolrConfigHandlerCloud.test-seed#[64370980C7089CB8]) [ ] o.a.s.s.SolrDispatchFilter SolrDispatchFilter.init(): sun.misc.Launcher$AppClassLoader@1d16e93
[junit4] 2> 437562 INFO (TEST-TestSolrConfigHandlerCloud.test-seed#[64370980C7089CB8]) [ ] o.a.s.c.SolrResourceLoader new SolrResourceLoader for directory: '/home/jenkins/workspace/Lucene-Solr-5.5-Linux/solr/build/solr-core/test/J0/temp/solr.handler.TestSolrConfigHandlerCloud_64370980C7089CB8-001/shard-1-001'
[junit4] 2> 437562 INFO (TEST-TestSolrConfigHandlerCloud.test-seed#[64370980C7089CB8]) [ ] o.a.s.c.SolrResourceLoader JNDI not configured for solr (NoInitialContextEx)
[junit4] 2> 437562 INFO (TEST-TestSolrConfigHandlerCloud.test-seed#[64370980C7089CB8]) [ ] o.a.s.c.SolrResourceLoader solr home defaulted to 'solr/' (could not find system property or JNDI)
[junit4] 2> 437563 INFO (TEST-TestSolrConfigHandlerCloud.test-seed#[64370980C7089CB8]) [ ] o.a.s.c.c.SolrZkClient Using default ZkCredentialsProvider
[junit4] 2> 437567 INFO (TEST-TestSolrConfigHandlerCloud.test-seed#[64370980C7089CB8]) [ ] o.a.s.c.c.ConnectionManager Waiting for client to connect to ZooKeeper
[junit4] 2> 437568 INFO (zkCallback-471-thread-1) [ ] o.a.s.c.c.ConnectionManager Watcher org.apache.solr.common.cloud.ConnectionManager@1c00c4f name:ZooKeeperConnection Watcher:127.0.0.1:35061/solr got event WatchedEvent state:SyncConnected type:None path:null path:null type:None
[junit4] 2> 437568 INFO (TEST-TestSolrConfigHandlerCloud.test-seed#[64370980C7089CB8]) [ ] o.a.s.c.c.ConnectionManager Client is connected to ZooKeeper
[junit4] 2> 437569 INFO (TEST-TestSolrConfigHandlerCloud.test-seed#[64370980C7089CB8]) [ ] o.a.s.c.c.SolrZkClient Using default ZkACLProvider
[junit4] 2> 437569 INFO (TEST-TestSolrConfigHandlerCloud.test-seed#[64370980C7089CB8]) [ ] o.a.s.s.SolrDispatchFilter Loading solr.xml from SolrHome (not found in ZooKeeper)
[junit4] 2> 437569 INFO (TEST-TestSolrConfigHandlerCloud.test-seed#[64370980C7089CB8]) [ ] o.a.s.c.SolrXmlConfig Loading container configuration from /home/jenkins/workspace/Lucene-Solr-5.5-Linux/solr/build/solr-core/test/J0/temp/solr.handler.TestSolrConfigHandlerCloud_64370980C7089CB8-001/shard-1-001/solr.xml
[junit4] 2> 437573 INFO (TEST-TestSolrConfigHandlerCloud.test-seed#[64370980C7089CB8]) [ ] o.a.s.c.CorePropertiesLocator Config-defined core root directory: /home/jenkins/workspace/Lucene-Solr-5.5-Linux/solr/build/solr-core/test/J0/temp/solr.handler.TestSolrConfigHandlerCloud_64370980C7089CB8-001/shard-1-001/cores
[junit4] 2> 437574 INFO (TEST-TestSolrConfigHandlerCloud.test-seed#[64370980C7089CB8]) [ ] o.a.s.c.CoreContainer New CoreContainer 24494762
[junit4] 2> 437574 INFO (TEST-TestSolrConfigHandlerCloud.test-seed#[64370980C7089CB8]) [ ] o.a.s.c.CoreContainer Loading cores into CoreContainer [instanceDir=/home/jenkins/workspace/Lucene-Solr-5.5-Linux/solr/build/solr-core/test/J0/temp/solr.handler.TestSolrConfigHandlerCloud_64370980C7089CB8-001/shard-1-001]
[junit4] 2> 437574 WARN (TEST-TestSolrConfigHandlerCloud.test-seed#[64370980C7089CB8]) [ ] o.a.s.c.CoreContainer Couldn't add files from /home/jenkins/workspace/Lucene-Solr-5.5-Linux/solr/build/solr-core/test/J0/temp/solr.handler.TestSolrConfigHandlerCloud_64370980C7089CB8-001/shard-1-001/lib to classpath: /home/jenkins/workspace/Lucene-Solr-5.5-Linux/solr/build/solr-core/test/J0/temp/solr.handler.TestSolrConfigHandlerCloud_64370980C7089CB8-001/shard-1-001/lib
[junit4] 2> 437574 INFO (TEST-TestSolrConfigHandlerCloud.test-seed#[64370980C7089CB8]) [ ] o.a.s.h.c.HttpShardHandlerFactory created with socketTimeout : 90000,urlScheme : ,connTimeout : 15000,maxConnectionsPerHost : 20,maxConnections : 10000,corePoolSize : 0,maximumPoolSize : 2147483647,maxThreadIdleTime : 5,sizeOfQueue : -1,fairnessPolicy : false,useRetries : false,connectionsEvictorSleepDelay : 5000,maxConnectionIdleTime : 40000,
[junit4] 2> 437575 INFO (TEST-TestSolrConfigHandlerCloud.test-seed#[64370980C7089CB8]) [ ] o.a.s.u.UpdateShardHandler Creating UpdateShardHandler HTTP client with params: socketTimeout=340000&connTimeout=45000&retry=true
[junit4] 2> 437575 INFO (TEST-TestSolrConfigHandlerCloud.test-seed#[64370980C7089CB8]) [ ] o.a.s.l.LogWatcher SLF4J impl is org.slf4j.impl.Log4jLoggerFactory
[junit4] 2> 437575 INFO (TEST-TestSolrConfigHandlerCloud.test-seed#[64370980C7089CB8]) [ ] o.a.s.l.LogWatcher Registering Log Listener [Log4j (org.slf4j.impl.Log4jLoggerFactory)]
[junit4] 2> 437575 INFO (TEST-TestSolrConfigHandlerCloud.test-seed#[64370980C7089CB8]) [ ] o.a.s.c.ZkContainer Zookeeper client=127.0.0.1:35061/solr
[junit4] 2> 437575 INFO (TEST-TestSolrConfigHandlerCloud.test-seed#[64370980C7089CB8]) [ ] o.a.s.c.ZkController zkHost includes chroot
[junit4] 2> 437575 INFO (TEST-TestSolrConfigHandlerCloud.test-seed#[64370980C7089CB8]) [ ] o.a.s.c.c.SolrZkClient Using default ZkCredentialsProvider
[junit4] 2> 437575 INFO (TEST-TestSolrConfigHandlerCloud.test-seed#[64370980C7089CB8]) [ ] o.a.s.c.c.ConnectionManager Waiting for client to connect to ZooKeeper
[junit4] 2> 437577 INFO (zkCallback-474-thread-1) [ ] o.a.s.c.c.ConnectionManager Watcher org.apache.solr.common.cloud.ConnectionManager@16a981f name:ZooKeeperConnection Watcher:127.0.0.1:35061 got event WatchedEvent state:SyncConnected type:None path:null path:null type:None
[junit4] 2> 437577 INFO (TEST-TestSolrConfigHandlerCloud.test-seed#[64370980C7089CB8]) [ ] o.a.s.c.c.ConnectionManager Client is connected to ZooKeeper
[junit4] 2> 437577 INFO (TEST-TestSolrConfigHandlerCloud.test-seed#[64370980C7089CB8]) [ ] o.a.s.c.c.SolrZkClient Using default ZkACLProvider
[junit4] 2> 437578 INFO (TEST-TestSolrConfigHandlerCloud.test-seed#[64370980C7089CB8]) [n:127.0.0.1:43827_ ] o.a.s.c.ZkController Added new OnReconnect listener org.apache.solr.cloud.ZkController$6@12d4611
[junit4] 2> 437578 INFO (TEST-TestSolrConfigHandlerCloud.test-seed#[64370980C7089CB8]) [n:127.0.0.1:43827_ ] o.a.s.c.c.ConnectionManager Waiting for client to connect to ZooKeeper
[junit4] 2> 437579 INFO (zkCallback-475-thread-1-processing-n:127.0.0.1:43827_) [n:127.0.0.1:43827_ ] o.a.s.c.c.ConnectionManager Watcher org.apache.solr.common.cloud.ConnectionManager@e38f5d name:ZooKeeperConnection Watcher:127.0.0.1:35061/solr got event WatchedEvent state:SyncConnected type:None path:null path:null type:None
[junit4] 2> 437579 INFO (TEST-TestSolrConfigHandlerCloud.test-seed#[64370980C7089CB8]) [n:127.0.0.1:43827_ ] o.a.s.c.c.ConnectionManager Client is connected to ZooKeeper
[junit4] 2> 437581 INFO (TEST-TestSolrConfigHandlerCloud.test-seed#[64370980C7089CB8]) [n:127.0.0.1:43827_ ] o.a.s.c.c.ZkStateReader Updating cluster state from ZooKeeper...
[junit4] 2> 438583 INFO (TEST-TestSolrConfigHandlerCloud.test-seed#[64370980C7089CB8]) [n:127.0.0.1:43827_ ] o.a.s.c.ZkController Register node as live in ZooKeeper:/live_nodes/127.0.0.1:43827_
[junit4] 2> 438584 INFO (TEST-TestSolrConfigHandlerCloud.test-seed#[64370980C7089CB8]) [n:127.0.0.1:43827_ ] o.a.s.c.c.SolrZkClient makePath: /live_nodes/127.0.0.1:43827_
[junit4] 2> 438584 INFO (zkCallback-475-thread-1-processing-n:127.0.0.1:43827_) [n:127.0.0.1:43827_ ] o.a.s.c.c.ZkStateReader A live node change: [WatchedEvent state:SyncConnected type:NodeChildrenChanged path:/live_nodes], has occurred - updating... (live nodes size: [1])
[junit4] 2> 438584 INFO (zkCallback-470-thread-1) [ ] o.a.s.c.c.ZkStateReader A live node change: [WatchedEvent state:SyncConnected type:NodeChildrenChanged path:/live_nodes], has occurred - updating... (live nodes size: [1])
[junit4] 2> 438584 INFO (zkCallback-468-thread-3-processing-n:127.0.0.1:46039_) [n:127.0.0.1:46039_ ] o.a.s.c.c.ZkStateReader A live node change: [WatchedEvent state:SyncConnected type:NodeChildrenChanged path:/live_nodes], has occurred - updating... (live nodes size: [1])
[junit4] 2> 438585 INFO (TEST-TestSolrConfigHandlerCloud.test-seed#[64370980C7089CB8]) [n:127.0.0.1:43827_ ] o.a.s.c.Overseer Overseer (id=null) closing
[junit4] 2> 438585 INFO (TEST-TestSolrConfigHandlerCloud.test-seed#[64370980C7089CB8]) [n:127.0.0.1:43827_ ] o.a.s.c.LeaderElector Joined leadership election with path: /overseer_elect/election/96581376424083464-127.0.0.1:43827_-n_0000000001
[junit4] 2> 438585 INFO (TEST-TestSolrConfigHandlerCloud.test-seed#[64370980C7089CB8]) [n:127.0.0.1:43827_ ] o.a.s.c.LeaderElector Watching path /overseer_elect/election/96581376424083460-127.0.0.1:46039_-n_0000000000 to know if I could be the leader
[junit4] 2> 438618 INFO (TEST-TestSolrConfigHandlerCloud.test-seed#[64370980C7089CB8]) [n:127.0.0.1:43827_ ] o.a.s.c.CoreContainer Security conf doesn't exist. Skipping setup for authorization module.
[junit4] 2> 438618 INFO (TEST-TestSolrConfigHandlerCloud.test-seed#[64370980C7089CB8]) [n:127.0.0.1:43827_ ] o.a.s.c.CoreContainer No authentication plugin used.
[junit4] 2> 438618 INFO (TEST-TestSolrConfigHandlerCloud.test-seed#[64370980C7089CB8]) [n:127.0.0.1:43827_ ] o.a.s.c.CorePropertiesLocator Looking for core definitions underneath /home/jenkins/workspace/Lucene-Solr-5.5-Linux/solr/build/solr-core/test/J0/temp/solr.handler.TestSolrConfigHandlerCloud_64370980C7089CB8-001/shard-1-001/cores
[junit4] 2> 438619 INFO (TEST-TestSolrConfigHandlerCloud.test-seed#[64370980C7089CB8]) [n:127.0.0.1:43827_ ] o.a.s.c.CoreDescriptor Created CoreDescriptor: {name=collection1, config=solrconfig.xml, transient=false, schema=schema.xml, loadOnStartup=true, configSetProperties=configsetprops.json, collection=collection1, coreNodeName=, dataDir=data/, shard=}
[junit4] 2> 438619 INFO (TEST-TestSolrConfigHandlerCloud.test-seed#[64370980C7089CB8]) [n:127.0.0.1:43827_ ] o.a.s.c.CorePropertiesLocator Found core collection1 in /home/jenkins/workspace/Lucene-Solr-5.5-Linux/solr/build/solr-core/test/J0/temp/solr.handler.TestSolrConfigHandlerCloud_64370980C7089CB8-001/shard-1-001/cores/collection1
[junit4] 2> 438619 INFO (TEST-TestSolrConfigHandlerCloud.test-seed#[64370980C7089CB8]) [n:127.0.0.1:43827_ ] o.a.s.c.CorePropertiesLocator Found 1 core definitions
[junit4] 2> 438619 INFO (TEST-TestSolrConfigHandlerCloud.test-seed#[64370980C7089CB8]) [n:127.0.0.1:43827_ ] o.a.s.s.SolrDispatchFilter user.dir=/home/jenkins/workspace/Lucene-Solr-5.5-Linux/solr/build/solr-core/test/J0
[junit4] 2> 438619 INFO (TEST-TestSolrConfigHandlerCloud.test-seed#[64370980C7089CB8]) [n:127.0.0.1:43827_ ] o.a.s.s.SolrDispatchFilter SolrDispatchFilter.init() done
[junit4] 2> 438619 INFO (coreLoadExecutor-2489-thread-1-processing-n:127.0.0.1:43827_) [n:127.0.0.1:43827_ c:collection1 x:collection1] o.a.s.c.ZkController publishing state=down
[junit4] 2> 438619 INFO (coreLoadExecutor-2489-thread-1-processing-n:127.0.0.1:43827_) [n:127.0.0.1:43827_ c:collection1 x:collection1] o.a.s.c.ZkController numShards not found on descriptor - reading it from system property
[junit4] 2> 438620 INFO (coreLoadExecutor-2489-thread-1-processing-n:127.0.0.1:43827_) [n:127.0.0.1:43827_ c:collection1 x:collection1] o.a.s.c.ZkController Collection collection1 not visible yet, but flagging it so a watch is registered when it becomes visible
[junit4] 2> 438620 INFO (coreLoadExecutor-2489-thread-1-processing-n:127.0.0.1:43827_) [n:127.0.0.1:43827_ c:collection1 x:collection1] o.a.s.c.c.ZkStateReader addZkWatch [collection1]
[junit4] 2> 438620 INFO (OverseerStateUpdate-96581376424083460-127.0.0.1:46039_-n_0000000000) [n:127.0.0.1:46039_ ] o.a.s.c.Overseer processMessage: queueSize: 1, message = {
[junit4] 2> "core":"collection1",
[junit4] 2> "roles":null,
[junit4] 2> "base_url":"http://127.0.0.1:43827",
[junit4] 2> "node_name":"127.0.0.1:43827_",
[junit4] 2> "numShards":"2",
[junit4] 2> "state":"down",
[junit4] 2> "shard":null,
[junit4] 2> "collection":"collection1",
[junit4] 2> "operation":"state"} current state version: 3
[junit4] 2> 438620 INFO (coreLoadExecutor-2489-thread-1-processing-n:127.0.0.1:43827_) [n:127.0.0.1:43827_ c:collection1 x:collection1] o.a.s.c.c.ZkStateReader Deleting data for [collection1]
[junit4] 2> 438620 INFO (OverseerStateUpdate-96581376424083460-127.0.0.1:46039_-n_0000000000) [n:127.0.0.1:46039_ ] o.a.s.c.o.ReplicaMutator Update state numShards=2 message={
[junit4] 2> "core":"collection1",
[junit4] 2> "roles":null,
[junit4] 2> "base_url":"http://127.0.0.1:43827",
[junit4] 2> "node_name":"127.0.0.1:43827_",
[junit4] 2> "numShards":"2",
[junit4] 2> "state":"down",
[junit4] 2> "shard":null,
[junit4] 2> "collection":"collection1",
[junit4] 2> "operation":"state"}
[junit4] 2> 438621 INFO (OverseerStateUpdate-96581376424083460-127.0.0.1:46039_-n_0000000000) [n:127.0.0.1:46039_ ] o.a.s.c.o.ClusterStateMutator building a new cName: collection1
[junit4] 2> 438621 INFO (coreLoadExecutor-2489-thread-1-processing-n:127.0.0.1:43827_) [n:127.0.0.1:43827_ c:collection1 x:collection1] o.a.s.c.ZkController look for our core node name
[junit4] 2> 438621 INFO (OverseerStateUpdate-96581376424083460-127.0.0.1:46039_-n_0000000000) [n:127.0.0.1:46039_ ] o.a.s.c.o.ReplicaMutator Assigning new node to shard shard=shard2
[junit4] 2> 438722 INFO (zkCallback-470-thread-1) [ ] o.a.s.c.c.ZkStateReader A cluster state change: [WatchedEvent state:SyncConnected type:NodeDataChanged path:/clusterstate.json], has occurred - updating... (live nodes size: [2])
[junit4] 2> 438722 INFO (zkCallback-468-thread-1-processing-n:127.0.0.1:46039_) [n:127.0.0.1:46039_ ] o.a.s.c.c.ZkStateReader A cluster state change: [WatchedEvent state:SyncConnected type:NodeDataChanged path:/clusterstate.json], has occurred - updating... (live nodes size: [2])
[junit4] 2> 438722 INFO (zkCallback-475-thread-1-processing-n:127.0.0.1:43827_) [n:127.0.0.1:43827_ ] o.a.s.c.c.ZkStateReader A cluster state change: [WatchedEvent state:SyncConnected type:NodeDataChanged path:/clusterstate.json], has occurred - updating... (live nodes size: [2])
[junit4] 2> 439621 INFO (coreLoadExecutor-2489-thread-1-processing-n:127.0.0.1:43827_) [n:127.0.0.1:43827_ c:collection1 x:collection1] o.a.s.c.ZkController waiting to find shard id in clusterstate for collection1
[junit4] 2> 439621 INFO (coreLoadExecutor-2489-thread-1-processing-n:127.0.0.1:43827_) [n:127.0.0.1:43827_ c:collection1 x:collection1] o.a.s.c.ZkController Check for collection zkNode:collection1
[junit4] 2> 439621 INFO (coreLoadExecutor-2489-thread-1-processing-n:127.0.0.1:43827_) [n:127.0.0.1:43827_ c:collection1 x:collection1] o.a.s.c.ZkController Collection zkNode exists
[junit4] 2> 439621 INFO (coreLoadExecutor-2489-thread-1-processing-n:127.0.0.1:43827_) [n:127.0.0.1:43827_ c:collection1 x:collection1] o.a.s.c.c.ZkStateReader Load collection config from: [/collections/collection1]
[junit4] 2> 439621 INFO (coreLoadExecutor-2489-thread-1-processing-n:127.0.0.1:43827_) [n:127.0.0.1:43827_ c:collection1 x:collection1] o.a.s.c.c.ZkStateReader path=[/collections/collection1] [configName]=[conf1] specified config exists in ZooKeeper
[junit4] 2> 439622 INFO (coreLoadExecutor-2489-thread-1-processing-n:127.0.0.1:43827_) [n:127.0.0.1:43827_ c:collection1 x:collection1] o.a.s.c.SolrResourceLoader new SolrResourceLoader for directory: '/home/jenkins/workspace/Lucene-Solr-5.5-Linux/solr/build/solr-core/test/J0/temp/solr.handler.TestSolrConfigHandlerCloud_64370980C7089CB8-001/shard-1-001/cores/collection1'
[junit4] 2> 439622 INFO (coreLoadExecutor-2489-thread-1-processing-n:127.0.0.1:43827_) [n:127.0.0.1:43827_ c:collection1 x:collection1] o.a.s.c.SolrResourceLoader JNDI not configured for solr (NoInitialContextEx)
[junit4] 2> 439622 INFO (coreLoadExecutor-2489-thread-1-processing-n:127.0.0.1:43827_) [n:127.0.0.1:43827_ c:collection1 x:collection1] o.a.s.c.SolrResourceLoader solr home defaulted to 'solr/' (could not find system property or JNDI)
[junit4] 2> 439623 INFO (coreLoadExecutor-2489-thread-1-processing-n:127.0.0.1:43827_) [n:127.0.0.1:43827_ c:collection1 x:collection1] o.a.s.c.Config loaded config solrconfig.xml with version 0
[junit4] 2> 439626 INFO (coreLoadExecutor-2489-thread-1-processing-n:127.0.0.1:43827_) [n:127.0.0.1:43827_ c:collection1 x:collection1] o.a.s.c.SolrConfig current version of requestparams : -1
[junit4] 2> 439636 WARN (coreLoadExecutor-2489-thread-1-processing-n:127.0.0.1:43827_) [n:127.0.0.1:43827_ c:collection1 x:collection1] o.a.s.c.Config Beginning with Solr 5.5, <mergePolicy> is deprecated, use <mergePolicyFactory> instead.
[junit4] 2> 439636 INFO (coreLoadExecutor-2489-thread-1-processing-n:127.0.0.1:43827_) [n:127.0.0.1:43827_ c:collection1 x:collection1] o.a.s.c.SolrConfig Using Lucene MatchVersion: 5.5.4
[junit4] 2> 439644 INFO (coreLoadExecutor-2489-thread-1-processing-n:127.0.0.1:43827_) [n:127.0.0.1:43827_ c:collection1 x:collection1] o.a.s.c.SolrConfig Loaded SolrConfig: solrconfig.xml
[junit4] 2> 439649 INFO (coreLoadExecutor-2489-thread-1-processing-n:127.0.0.1:43827_) [n:127.0.0.1:43827_ c:collection1 x:collection1] o.a.s.s.IndexSchema [collection1] Schema name=test
[junit4] 2> 439711 INFO (coreLoadExecutor-2489-thread-1-processing-n:127.0.0.1:43827_) [n:127.0.0.1:43827_ c:collection1 x:collection1] o.a.s.s.OpenExchangeRatesOrgProvider Initialized with rates=open-exchange-rates.json, refreshInterval=1440.
[junit4] 2> 439717 INFO (coreLoadExecutor-2489-thread-1-processing-n:127.0.0.1:43827_) [n:127.0.0.1:43827_ c:collection1 x:collection1] o.a.s.s.IndexSchema default search field in schema is text
[junit4] 2> 439718 INFO (coreLoadExecutor-2489-thread-1-processing-n:127.0.0.1:43827_) [n:127.0.0.1:43827_ c:collection1 x:collection1] o.a.s.s.IndexSchema unique key field: id
[junit4] 2> 439722 INFO (coreLoadExecutor-2489-thread-1-processing-n:127.0.0.1:43827_) [n:127.0.0.1:43827_ c:collection1 x:collection1] o.a.s.s.FileExchangeRateProvider Reloading exchange rates from file currency.xml
[junit4] 2> 439723 INFO (coreLoadExecutor-2489-thread-1-processing-n:127.0.0.1:43827_) [n:127.0.0.1:43827_ c:collection1 x:collection1] o.a.s.s.FileExchangeRateProvider Reloading exchange rates from file currency.xml
[junit4] 2> 439724 INFO (coreLoadExecutor-2489-thread-1-processing-n:127.0.0.1:43827_) [n:127.0.0.1:43827_ c:collection1 x:collection1] o.a.s.s.OpenExchangeRatesOrgProvider Reloading exchange rates from open-exchange-rates.json
[junit4] 2> 439724 INFO (coreLoadExecutor-2489-thread-1-processing-n:127.0.0.1:43827_) [n:127.0.0.1:43827_ c:collection1 x:collection1] o.a.s.s.OpenExchangeRatesOrgProvider Reloading exchange rates from open-exchange-rates.json
[junit4] 2> 439725 INFO (coreLoadExecutor-2489-thread-1-processing-n:127.0.0.1:43827_) [n:127.0.0.1:43827_ c:collection1 x:collection1] o.a.s.c.ConfigSetProperties Did not find ConfigSet properties, assuming default properties: Can't find resource 'configsetprops.json' in classpath or '/configs/conf1', cwd=/home/jenkins/workspace/Lucene-Solr-5.5-Linux/solr/build/solr-core/test/J0
[junit4] 2> 439725 INFO (coreLoadExecutor-2489-thread-1-processing-n:127.0.0.1:43827_) [n:127.0.0.1:43827_ c:collection1 x:collection1] o.a.s.c.CoreContainer Creating SolrCore 'collection1' using configuration from collection collection1
[junit4] 2> 439725 INFO (coreLoadExecutor-2489-thread-1-processing-n:127.0.0.1:43827_) [n:127.0.0.1:43827_ c:collection1 s:shard2 r:core_node1 x:collection1] o.a.s.c.SolrCore org.apache.solr.core.MockDirectoryFactory
[junit4] 2> 439725 INFO (coreLoadExecutor-2489-thread-1-processing-n:127.0.0.1:43827_) [n:127.0.0.1:43827_ c:collection1 s:shard2 r:core_node1 x:collection1] o.a.s.c.SolrCore [[collection1] ] Opening new SolrCore at [/home/jenkins/workspace/Lucene-Solr-5.5-Linux/solr/build/solr-core/test/J0/temp/solr.handler.TestSolrConfigHandlerCloud_64370980C7089CB8-001/shard-1-001/cores/collection1], dataDir=[/home/jenkins/workspace/Lucene-Solr-5.5-Linux/solr/build/solr-core/test/J0/temp/solr.handler.TestSolrConfigHandlerCloud_64370980C7089CB8-001/shard-1-001/cores/collection1/data/]
[junit4] 2> 439725 INFO (coreLoadExecutor-2489-thread-1-processing-n:127.0.0.1:43827_) [n:127.0.0.1:43827_ c:collection1 s:shard2 r:core_node1 x:collection1] o.a.s.c.JmxMonitoredMap JMX monitoring is enabled. Adding Solr mbeans to JMX Server: com.sun.jmx.mbeanserver.JmxMBeanServer@16e7d1f
[junit4] 2> 439726 INFO (coreLoadExecutor-2489-thread-1-processing-n:127.0.0.1:43827_) [n:127.0.0.1:43827_ c:collection1 s:shard2 r:core_node1 x:collection1] o.a.s.c.CachingDirectoryFactory return new directory for /home/jenkins/workspace/Lucene-Solr-5.5-Linux/solr/build/solr-core/test/J0/temp/solr.handler.TestSolrConfigHandlerCloud_64370980C7089CB8-001/shard-1-001/cores/collection1/data
[junit4] 2> 439726 INFO (coreLoadExecutor-2489-thread-1-processing-n:127.0.0.1:43827_) [n:127.0.0.1:43827_ c:collection1 s:shard2 r:core_node1 x:collection1] o.a.s.c.SolrCore New index directory detected: old=null new=/home/jenkins/workspace/Lucene-Solr-5.5-Linux/solr/build/solr-core/test/J0/temp/solr.handler.TestSolrConfigHandlerCloud_64370980C7089CB8-001/shard-1-001/cores/collection1/data/index/
[junit4] 2> 439726 WARN (coreLoadExecutor-2489-thread-1-processing-n:127.0.0.1:43827_) [n:127.0.0.1:43827_ c:collection1 s:shard2 r:core_node1 x:collection1] o.a.s.c.SolrCore [collection1] Solr index directory '/home/jenkins/workspace/Lucene-Solr-5.5-Linux/solr/build/solr-core/test/J0/temp/solr.handler.TestSolrConfigHandlerCloud_64370980C7089CB8-001/shard-1-001/cores/collection1/data/index' doesn't exist. Creating new index...
[junit4] 2> 439726 INFO (coreLoadExecutor-2489-thread-1-processing-n:127.0.0.1:43827_) [n:127.0.0.1:43827_ c:collection1 s:shard2 r:core_node1 x:collection1] o.a.s.c.CachingDirectoryFactory return new directory for /home/jenkins/workspace/Lucene-Solr-5.5-Linux/solr/build/solr-core/test/J0/temp/solr.handler.TestSolrConfigHandlerCloud_64370980C7089CB8-001/shard-1-001/cores/collection1/data/index
[junit4] 2> 439726 INFO (coreLoadExecutor-2489-thread-1-processing-n:127.0.0.1:43827_) [n:127.0.0.1:43827_ c:collection1 s:shard2 r:core_node1 x:collection1] o.a.s.u.RandomMergePolicy RandomMergePolicy wrapping class org.apache.lucene.index.LogByteSizeMergePolicy: [LogByteSizeMergePolicy: minMergeSize=1677721, mergeFactor=29, maxMergeSize=2147483648, maxMergeSizeForForcedMerge=9223372036854775807, calibrateSizeByDeletes=false, maxMergeDocs=2147483647, maxCFSSegmentSizeMB=8.796093022207999E12, noCFSRatio=1.0]
[junit4] 2> 439727 INFO (coreLoadExecutor-2489-thread-1-processing-n:127.0.0.1:43827_) [n:127.0.0.1:43827_ c:collection1 s:shard2 r:core_node1 x:collection1] o.a.s.c.SolrDeletionPolicy SolrDeletionPolicy.onCommit: commits: num=1
[junit4] 2> commit{dir=MockDirectoryWrapper(RAMDirectory@168e5de lockFactory=org.apache.lucene.store.SingleInstanceLockFactory@14dce81),segFN=segments_1,generation=1}
[junit4] 2> 439727 INFO (coreLoadExecutor-2489-thread-1-processing-n:127.0.0.1:43827_) [n:127.0.0.1:43827_ c:collection1 s:shard2 r:core_node1 x:collection1] o.a.s.c.SolrDeletionPolicy newest commit generation = 1
[junit4] 2> 439727 INFO (OldIndexDirectoryCleanupThreadForCore-collection1) [n:127.0.0.1:43827_ c:collection1 s:shard2 r:core_node1 x:collection1] o.a.s.c.SolrCore Looking for old index directories to cleanup for core collection1 in /home/jenkins/workspace/Lucene-Solr-5.5-Linux/solr/build/solr-core/test/J0/temp/solr.handler.TestSolrConfigHandlerCloud_64370980C7089CB8-001/shard-1-001/cores/collection1/data/
[junit4] 2> 439727 WARN (OldIndexDirectoryCleanupThreadForCore-collection1) [n:127.0.0.1:43827_ c:collection1 s:shard2 r:core_node1 x:collection1] o.a.s.c.DirectoryFactory /home/jenkins/workspace/Lucene-Solr-5.5-Linux/solr/build/solr-core/test/J0/temp/solr.handler.TestSolrConfigHandlerCloud_64370980C7089CB8-001/shard-1-001/cores/collection1/data/ does not point to a valid data directory; skipping clean-up of old index directories.
[junit4] 2> 439729 INFO (coreLoadExecutor-2489-thread-1-processing-n:127.0.0.1:43827_) [n:127.0.0.1:43827_ c:collection1 s:shard2 r:core_node1 x:collection1] o.a.s.u.p.UpdateRequestProcessorChain creating updateRequestProcessorChain "nodistrib"
[junit4] 2> 439729 INFO (coreLoadExecutor-2489-thread-1-processing-n:127.0.0.1:43827_) [n:127.0.0.1:43827_ c:collection1 s:shard2 r:core_node1 x:collection1] o.a.s.u.p.UpdateRequestProcessorChain creating updateRequestProcessorChain "dedupe"
[junit4] 2> 439729 INFO (coreLoadExecutor-2489-thread-1-processing-n:127.0.0.1:43827_) [n:127.0.0.1:43827_ c:collection1 s:shard2 r:core_node1 x:collection1] o.a.s.u.p.UpdateRequestProcessorChain inserting DistributedUpdateProcessorFactory into updateRequestProcessorChain "dedupe"
[junit4] 2> 439729 INFO (coreLoadExecutor-2489-thread-1-processing-n:127.0.0.1:43827_) [n:127.0.0.1:43827_ c:collection1 s:shard2 r:core_node1 x:collection1] o.a.s.u.p.UpdateRequestProcessorChain creating updateRequestProcessorChain "stored_sig"
[junit4] 2> 439729 INFO (coreLoadExecutor-2489-thread-1-processing-n:127.0.0.1:43827_) [n:127.0.0.1:43827_ c:collection1 s:shard2 r:core_node1 x:collection1] o.a.s.u.p.UpdateRequestProcessorChain inserting DistributedUpdateProcessorFactory into updateRequestProcessorChain "stored_sig"
[junit4] 2> 439729 INFO (coreLoadExecutor-2489-thread-1-processing-n:127.0.0.1:43827_) [n:127.0.0.1:43827_ c:collection1 s:shard2 r:core_node1 x:collection1] o.a.s.u.p.UpdateRequestProcessorChain creating updateRequestProcessorChain "distrib-dup-test-chain-explicit"
[junit4] 2> 439729 INFO (coreLoadExecutor-2489-thread-1-processing-n:127.0.0.1:43827_) [n:127.0.0.1:43827_ c:collection1 s:shard2 r:core_node1 x:collection1] o.a.s.u.p.UpdateRequestProcessorChain creating updateRequestProcessorChain "distrib-dup-test-chain-implicit"
[junit4] 2> 439730 INFO (coreLoadExecutor-2489-thread-1-processing-n:127.0.0.1:43827_) [n:127.0.0.1:43827_ c:collection1
[...truncated too long message...]
a(SolrResourceLoader.java:355)
[junit4] 2> at org.apache.solr.schema.IndexSchemaFactory.create(IndexSchemaFactory.java:48)
[junit4] 2> ... 6 more
[junit4] 2> Caused by: org.apache.zookeeper.KeeperException$SessionExpiredException: KeeperErrorCode = Session expired for /configs/conf1/schema.xml
[junit4] 2> at org.apache.zookeeper.KeeperException.create(KeeperException.java:127)
[junit4] 2> at org.apache.zookeeper.KeeperException.create(KeeperException.java:51)
[junit4] 2> at org.apache.zookeeper.ZooKeeper.exists(ZooKeeper.java:1045)
[junit4] 2> at org.apache.solr.common.cloud.SolrZkClient$5.execute(SolrZkClient.java:311)
[junit4] 2> at org.apache.solr.common.cloud.SolrZkClient$5.execute(SolrZkClient.java:308)
[junit4] 2> at org.apache.solr.common.cloud.ZkCmdExecutor.retryOperation(ZkCmdExecutor.java:60)
[junit4] 2> at org.apache.solr.common.cloud.SolrZkClient.exists(SolrZkClient.java:308)
[junit4] 2> at org.apache.solr.cloud.ZkController.pathExists(ZkController.java:839)
[junit4] 2> at org.apache.solr.cloud.ZkSolrResourceLoader.openResource(ZkSolrResourceLoader.java:89)
[junit4] 2> ... 8 more
[junit4] 2> Sep 12, 2016 9:15:03 PM com.carrotsearch.randomizedtesting.ThreadLeakControl checkThreadLeaks
[junit4] 2> SEVERE: 1 thread leaked from SUITE scope at org.apache.solr.handler.TestSolrConfigHandlerCloud:
[junit4] 2> 1) Thread[id=4420, name=Thread-1996, state=TIMED_WAITING, group=TGRP-TestSolrConfigHandlerCloud]
[junit4] 2> at java.lang.Thread.sleep(Native Method)
[junit4] 2> at org.apache.solr.cloud.ZkSolrResourceLoader.openResource(ZkSolrResourceLoader.java:101)
[junit4] 2> at org.apache.solr.core.SolrResourceLoader.openSchema(SolrResourceLoader.java:355)
[junit4] 2> at org.apache.solr.schema.IndexSchemaFactory.create(IndexSchemaFactory.java:48)
[junit4] 2> at org.apache.solr.schema.IndexSchemaFactory.buildIndexSchema(IndexSchemaFactory.java:70)
[junit4] 2> at org.apache.solr.core.ConfigSetService.createIndexSchema(ConfigSetService.java:108)
[junit4] 2> at org.apache.solr.core.ConfigSetService.getConfig(ConfigSetService.java:79)
[junit4] 2> at org.apache.solr.core.CoreContainer.reload(CoreContainer.java:920)
[junit4] 2> at org.apache.solr.core.SolrCore$11.run(SolrCore.java:2623)
[junit4] 2> at org.apache.solr.cloud.ZkController$5.run(ZkController.java:2480)
[junit4] 2> Sep 12, 2016 9:15:03 PM com.carrotsearch.randomizedtesting.ThreadLeakControl tryToInterruptAll
[junit4] 2> INFO: Starting to interrupt leaked threads:
[junit4] 2> 1) Thread[id=4420, name=Thread-1996, state=TIMED_WAITING, group=TGRP-TestSolrConfigHandlerCloud]
[junit4] 2> 489486 ERROR (Thread-1996) [n:127.0.0.1:38618_ ] o.a.s.s.IndexSchemaFactory Error loading schema resource schema.xml
[junit4] 2> java.io.IOException: Could not load resource=schema.xml
[junit4] 2> at org.apache.solr.cloud.ZkSolrResourceLoader.openResource(ZkSolrResourceLoader.java:105)
[junit4] 2> at org.apache.solr.core.SolrResourceLoader.openSchema(SolrResourceLoader.java:355)
[junit4] 2> at org.apache.solr.schema.IndexSchemaFactory.create(IndexSchemaFactory.java:48)
[junit4] 2> at org.apache.solr.schema.IndexSchemaFactory.buildIndexSchema(IndexSchemaFactory.java:70)
[junit4] 2> at org.apache.solr.core.ConfigSetService.createIndexSchema(ConfigSetService.java:108)
[junit4] 2> at org.apache.solr.core.ConfigSetService.getConfig(ConfigSetService.java:79)
[junit4] 2> at org.apache.solr.core.CoreContainer.reload(CoreContainer.java:920)
[junit4] 2> at org.apache.solr.core.SolrCore$11.run(SolrCore.java:2623)
[junit4] 2> at org.apache.solr.cloud.ZkController$5.run(ZkController.java:2480)
[junit4] 2> Caused by: java.lang.InterruptedException: sleep interrupted
[junit4] 2> at java.lang.Thread.sleep(Native Method)
[junit4] 2> at org.apache.solr.cloud.ZkSolrResourceLoader.openResource(ZkSolrResourceLoader.java:101)
[junit4] 2> ... 8 more
[junit4] 2> 489486 WARN (Thread-1996) [n:127.0.0.1:38618_ ] o.a.s.c.SolrCores Tried to remove core collection1 from pendingCoreOps and it wasn't there.
[junit4] 2> 489486 WARN (Thread-1996) [n:127.0.0.1:38618_ ] o.a.s.c.ZkController listener throws error
[junit4] 2> org.apache.solr.common.SolrException: Unable to reload core [collection1]
[junit4] 2> at org.apache.solr.core.CoreContainer.reload(CoreContainer.java:927)
[junit4] 2> at org.apache.solr.core.SolrCore$11.run(SolrCore.java:2623)
[junit4] 2> at org.apache.solr.cloud.ZkController$5.run(ZkController.java:2480)
[junit4] 2> Caused by: org.apache.solr.common.SolrException: Could not load conf for core collection1: Error loading schema resource schema.xml
[junit4] 2> at org.apache.solr.core.ConfigSetService.getConfig(ConfigSetService.java:86)
[junit4] 2> at org.apache.solr.core.CoreContainer.reload(CoreContainer.java:920)
[junit4] 2> ... 2 more
[junit4] 2> Caused by: org.apache.solr.common.SolrException: Error loading schema resource schema.xml
[junit4] 2> at org.apache.solr.schema.IndexSchemaFactory.create(IndexSchemaFactory.java:52)
[junit4] 2> at org.apache.solr.schema.IndexSchemaFactory.buildIndexSchema(IndexSchemaFactory.java:70)
[junit4] 2> at org.apache.solr.core.ConfigSetService.createIndexSchema(ConfigSetService.java:108)
[junit4] 2> at org.apache.solr.core.ConfigSetService.getConfig(ConfigSetService.java:79)
[junit4] 2> ... 3 more
[junit4] 2> Caused by: java.io.IOException: Could not load resource=schema.xml
[junit4] 2> at org.apache.solr.cloud.ZkSolrResourceLoader.openResource(ZkSolrResourceLoader.java:105)
[junit4] 2> at org.apache.solr.core.SolrResourceLoader.openSchema(SolrResourceLoader.java:355)
[junit4] 2> at org.apache.solr.schema.IndexSchemaFactory.create(IndexSchemaFactory.java:48)
[junit4] 2> ... 6 more
[junit4] 2> Caused by: java.lang.InterruptedException: sleep interrupted
[junit4] 2> at java.lang.Thread.sleep(Native Method)
[junit4] 2> at org.apache.solr.cloud.ZkSolrResourceLoader.openResource(ZkSolrResourceLoader.java:101)
[junit4] 2> ... 8 more
[junit4] 2> Sep 12, 2016 9:15:03 PM com.carrotsearch.randomizedtesting.ThreadLeakControl tryToInterruptAll
[junit4] 2> INFO: All leaked threads terminated.
[junit4] 2> NOTE: test params are: codec=Asserting(Lucene54): {}, docValues:{}, sim=DefaultSimilarity, locale=es-CR, timezone=Asia/Oral
[junit4] 2> NOTE: Linux 4.4.0-36-generic i386/Oracle Corporation 1.8.0_102 (32-bit)/cpus=12,threads=1,free=145467456,total=244580352
[junit4] 2> NOTE: All tests run in this JVM: [QueryElevationComponentTest, TestFieldResource, SaslZkACLProviderTest, ChangedSchemaMergeTest, TestCustomDocTransformer, LeaderFailoverAfterPartitionTest, TestSchemaSimilarityResource, ZkNodePropsTest, DistributedSpellCheckComponentTest, TestMiniSolrCloudClusterSSL, TestPhraseSuggestions, AlternateDirectoryTest, VersionInfoTest, SuggestComponentTest, BlockJoinFacetDistribTest, TestRemoveLastDynamicCopyField, TestRandomCollapseQParserPlugin, TestXmlQParser, TestSolrConfigHandler, CloneFieldUpdateProcessorFactoryTest, PrimUtilsTest, HdfsChaosMonkeySafeLeaderTest, ExternalFileFieldSortTest, JsonLoaderTest, EchoParamsTest, TestBlendedInfixSuggestions, HdfsBasicDistributedZk2Test, RequestLoggingTest, RestartWhileUpdatingTest, TestLazyCores, DistributedExpandComponentTest, FileBasedSpellCheckerTest, RAMDirectoryFactoryTest, DeleteInactiveReplicaTest, TestRandomDVFaceting, DistributedFacetPivotSmallAdvancedTest, RequiredFieldsTest, URLClassifyProcessorTest, TestSchemaManager, TestComplexPhraseQParserPlugin, JSONWriterTest, ResponseHeaderTest, QueryResultKeyTest, TestIntervalFaceting, PeerSyncTest, TestMergePolicyConfig, TestReplicationHandler, CleanupOldIndexTest, ExplicitHLLTest, TestIBSimilarityFactory, TestHashQParserPlugin, TestSolr4Spatial, AddBlockUpdateTest, TestRebalanceLeaders, TestSolrConfigHandlerCloud]
[junit4] 2> NOTE: reproduce with: ant test -Dtestcase=TestSolrConfigHandlerCloud -Dtests.seed=64370980C7089CB8 -Dtests.multiplier=3 -Dtests.slow=true -Dtests.locale=es-CR -Dtests.timezone=Asia/Oral -Dtests.asserts=true -Dtests.file.encoding=ISO-8859-1
[junit4] ERROR 0.00s J0 | TestSolrConfigHandlerCloud (suite) <<<
[junit4] > Throwable #1: com.carrotsearch.randomizedtesting.ThreadLeakError: 1 thread leaked from SUITE scope at org.apache.solr.handler.TestSolrConfigHandlerCloud:
[junit4] > 1) Thread[id=4420, name=Thread-1996, state=TIMED_WAITING, group=TGRP-TestSolrConfigHandlerCloud]
[junit4] > at java.lang.Thread.sleep(Native Method)
[junit4] > at org.apache.solr.cloud.ZkSolrResourceLoader.openResource(ZkSolrResourceLoader.java:101)
[junit4] > at org.apache.solr.core.SolrResourceLoader.openSchema(SolrResourceLoader.java:355)
[junit4] > at org.apache.solr.schema.IndexSchemaFactory.create(IndexSchemaFactory.java:48)
[junit4] > at org.apache.solr.schema.IndexSchemaFactory.buildIndexSchema(IndexSchemaFactory.java:70)
[junit4] > at org.apache.solr.core.ConfigSetService.createIndexSchema(ConfigSetService.java:108)
[junit4] > at org.apache.solr.core.ConfigSetService.getConfig(ConfigSetService.java:79)
[junit4] > at org.apache.solr.core.CoreContainer.reload(CoreContainer.java:920)
[junit4] > at org.apache.solr.core.SolrCore$11.run(SolrCore.java:2623)
[junit4] > at org.apache.solr.cloud.ZkController$5.run(ZkController.java:2480)
[junit4] > at __randomizedtesting.SeedInfo.seed([64370980C7089CB8]:0)
[junit4] Completed [172/575 (1!)] on J0 in 53.77s, 1 test, 1 error <<< FAILURES!
[...truncated 50447 lines...]
[JENKINS] Lucene-Solr-5.5-Linux (64bit/jdk1.7.0_80) - Build # 431 -
Still Unstable!
Posted by Policeman Jenkins Server <je...@thetaphi.de>.
Build: http://jenkins.thetaphi.de/job/Lucene-Solr-5.5-Linux/431/
Java: 64bit/jdk1.7.0_80 -XX:+UseCompressedOops -XX:+UseConcMarkSweepGC
1 tests failed.
FAILED: org.apache.solr.handler.TestReplicationHandler.doTestIndexFetchOnMasterRestart
Error Message:
expected:<1> but was:<2>
Stack Trace:
java.lang.AssertionError: expected:<1> but was:<2>
at __randomizedtesting.SeedInfo.seed([9F938B470C7335A:D10EFC50DB1CF106]:0)
at org.junit.Assert.fail(Assert.java:93)
at org.junit.Assert.failNotEquals(Assert.java:647)
at org.junit.Assert.assertEquals(Assert.java:128)
at org.junit.Assert.assertEquals(Assert.java:472)
at org.junit.Assert.assertEquals(Assert.java:456)
at org.apache.solr.handler.TestReplicationHandler.doTestIndexFetchOnMasterRestart(TestReplicationHandler.java:624)
at sun.reflect.NativeMethodAccessorImpl.invoke0(Native Method)
at sun.reflect.NativeMethodAccessorImpl.invoke(NativeMethodAccessorImpl.java:57)
at sun.reflect.DelegatingMethodAccessorImpl.invoke(DelegatingMethodAccessorImpl.java:43)
at java.lang.reflect.Method.invoke(Method.java:606)
at com.carrotsearch.randomizedtesting.RandomizedRunner.invoke(RandomizedRunner.java:1764)
at com.carrotsearch.randomizedtesting.RandomizedRunner$8.evaluate(RandomizedRunner.java:871)
at com.carrotsearch.randomizedtesting.RandomizedRunner$9.evaluate(RandomizedRunner.java:907)
at com.carrotsearch.randomizedtesting.RandomizedRunner$10.evaluate(RandomizedRunner.java:921)
at com.carrotsearch.randomizedtesting.rules.SystemPropertiesRestoreRule$1.evaluate(SystemPropertiesRestoreRule.java:57)
at org.apache.lucene.util.TestRuleSetupTeardownChained$1.evaluate(TestRuleSetupTeardownChained.java:49)
at org.apache.lucene.util.AbstractBeforeAfterRule$1.evaluate(AbstractBeforeAfterRule.java:45)
at org.apache.lucene.util.TestRuleThreadAndTestName$1.evaluate(TestRuleThreadAndTestName.java:48)
at org.apache.lucene.util.TestRuleIgnoreAfterMaxFailures$1.evaluate(TestRuleIgnoreAfterMaxFailures.java:64)
at org.apache.lucene.util.TestRuleMarkFailure$1.evaluate(TestRuleMarkFailure.java:47)
at com.carrotsearch.randomizedtesting.rules.StatementAdapter.evaluate(StatementAdapter.java:36)
at com.carrotsearch.randomizedtesting.ThreadLeakControl$StatementRunner.run(ThreadLeakControl.java:367)
at com.carrotsearch.randomizedtesting.ThreadLeakControl.forkTimeoutingTask(ThreadLeakControl.java:809)
at com.carrotsearch.randomizedtesting.ThreadLeakControl$3.evaluate(ThreadLeakControl.java:460)
at com.carrotsearch.randomizedtesting.RandomizedRunner.runSingleTest(RandomizedRunner.java:880)
at com.carrotsearch.randomizedtesting.RandomizedRunner$5.evaluate(RandomizedRunner.java:781)
at com.carrotsearch.randomizedtesting.RandomizedRunner$6.evaluate(RandomizedRunner.java:816)
at com.carrotsearch.randomizedtesting.RandomizedRunner$7.evaluate(RandomizedRunner.java:827)
at com.carrotsearch.randomizedtesting.rules.StatementAdapter.evaluate(StatementAdapter.java:36)
at com.carrotsearch.randomizedtesting.rules.SystemPropertiesRestoreRule$1.evaluate(SystemPropertiesRestoreRule.java:57)
at org.apache.lucene.util.AbstractBeforeAfterRule$1.evaluate(AbstractBeforeAfterRule.java:45)
at com.carrotsearch.randomizedtesting.rules.StatementAdapter.evaluate(StatementAdapter.java:36)
at org.apache.lucene.util.TestRuleStoreClassName$1.evaluate(TestRuleStoreClassName.java:41)
at com.carrotsearch.randomizedtesting.rules.NoShadowingOrOverridesOnMethodsRule$1.evaluate(NoShadowingOrOverridesOnMethodsRule.java:40)
at com.carrotsearch.randomizedtesting.rules.NoShadowingOrOverridesOnMethodsRule$1.evaluate(NoShadowingOrOverridesOnMethodsRule.java:40)
at com.carrotsearch.randomizedtesting.rules.StatementAdapter.evaluate(StatementAdapter.java:36)
at com.carrotsearch.randomizedtesting.rules.StatementAdapter.evaluate(StatementAdapter.java:36)
at com.carrotsearch.randomizedtesting.rules.StatementAdapter.evaluate(StatementAdapter.java:36)
at org.apache.lucene.util.TestRuleAssertionsRequired$1.evaluate(TestRuleAssertionsRequired.java:53)
at org.apache.lucene.util.TestRuleMarkFailure$1.evaluate(TestRuleMarkFailure.java:47)
at org.apache.lucene.util.TestRuleIgnoreAfterMaxFailures$1.evaluate(TestRuleIgnoreAfterMaxFailures.java:64)
at org.apache.lucene.util.TestRuleIgnoreTestSuites$1.evaluate(TestRuleIgnoreTestSuites.java:54)
at com.carrotsearch.randomizedtesting.rules.StatementAdapter.evaluate(StatementAdapter.java:36)
at com.carrotsearch.randomizedtesting.ThreadLeakControl$StatementRunner.run(ThreadLeakControl.java:367)
at java.lang.Thread.run(Thread.java:745)
Build Log:
[...truncated 11057 lines...]
[junit4] Suite: org.apache.solr.handler.TestReplicationHandler
[junit4] 2> Creating dataDir: /home/jenkins/workspace/Lucene-Solr-5.5-Linux/solr/build/solr-core/test/J0/temp/solr.handler.TestReplicationHandler_9F938B470C7335A-001/init-core-data-001
[junit4] 2> 648275 INFO (TEST-TestReplicationHandler.doTestIndexAndConfigReplication-seed#[9F938B470C7335A]) [ ] o.a.s.SolrTestCaseJ4 ###Starting doTestIndexAndConfigReplication
[junit4] 2> 648276 INFO (TEST-TestReplicationHandler.doTestIndexAndConfigReplication-seed#[9F938B470C7335A]) [ ] o.a.s.SolrTestCaseJ4 Writing core.properties file to /home/jenkins/workspace/Lucene-Solr-5.5-Linux/solr/build/solr-core/test/J0/temp/solr.handler.TestReplicationHandler_9F938B470C7335A-001/solr-instance-001/collection1
[junit4] 2> 648278 INFO (TEST-TestReplicationHandler.doTestIndexAndConfigReplication-seed#[9F938B470C7335A]) [ ] o.e.j.s.Server jetty-9.2.13.v20150730
[junit4] 2> 648279 INFO (TEST-TestReplicationHandler.doTestIndexAndConfigReplication-seed#[9F938B470C7335A]) [ ] o.e.j.s.h.ContextHandler Started o.e.j.s.ServletContextHandler@23398e0d{/solr,null,AVAILABLE}
[junit4] 2> 648280 INFO (TEST-TestReplicationHandler.doTestIndexAndConfigReplication-seed#[9F938B470C7335A]) [ ] o.e.j.s.ServerConnector Started ServerConnector@46ddd270{HTTP/1.1}{127.0.0.1:34279}
[junit4] 2> 648280 INFO (TEST-TestReplicationHandler.doTestIndexAndConfigReplication-seed#[9F938B470C7335A]) [ ] o.e.j.s.Server Started @649889ms
[junit4] 2> 648280 INFO (TEST-TestReplicationHandler.doTestIndexAndConfigReplication-seed#[9F938B470C7335A]) [ ] o.a.s.c.s.e.JettySolrRunner Jetty properties: {hostPort=34279, solr.data.dir=/home/jenkins/workspace/Lucene-Solr-5.5-Linux/solr/build/solr-core/test/J0/temp/solr.handler.TestReplicationHandler_9F938B470C7335A-001/solr-instance-001/collection1/data, hostContext=/solr}
[junit4] 2> 648280 INFO (TEST-TestReplicationHandler.doTestIndexAndConfigReplication-seed#[9F938B470C7335A]) [ ] o.a.s.s.SolrDispatchFilter SolrDispatchFilter.init(): sun.misc.Launcher$AppClassLoader@2876b359
[junit4] 2> 648280 INFO (TEST-TestReplicationHandler.doTestIndexAndConfigReplication-seed#[9F938B470C7335A]) [ ] o.a.s.c.SolrResourceLoader new SolrResourceLoader for directory: '/home/jenkins/workspace/Lucene-Solr-5.5-Linux/solr/build/solr-core/test/J0/temp/solr.handler.TestReplicationHandler_9F938B470C7335A-001/solr-instance-001'
[junit4] 2> 648281 INFO (TEST-TestReplicationHandler.doTestIndexAndConfigReplication-seed#[9F938B470C7335A]) [ ] o.a.s.c.SolrResourceLoader JNDI not configured for solr (NoInitialContextEx)
[junit4] 2> 648281 INFO (TEST-TestReplicationHandler.doTestIndexAndConfigReplication-seed#[9F938B470C7335A]) [ ] o.a.s.c.SolrResourceLoader solr home defaulted to 'solr/' (could not find system property or JNDI)
[junit4] 2> 648281 INFO (TEST-TestReplicationHandler.doTestIndexAndConfigReplication-seed#[9F938B470C7335A]) [ ] o.a.s.c.SolrXmlConfig Loading container configuration from /home/jenkins/workspace/Lucene-Solr-5.5-Linux/solr/build/solr-core/test/J0/temp/solr.handler.TestReplicationHandler_9F938B470C7335A-001/solr-instance-001/solr.xml
[junit4] 2> 648290 INFO (TEST-TestReplicationHandler.doTestIndexAndConfigReplication-seed#[9F938B470C7335A]) [ ] o.a.s.c.CorePropertiesLocator Config-defined core root directory: /home/jenkins/workspace/Lucene-Solr-5.5-Linux/solr/build/solr-core/test/J0/temp/solr.handler.TestReplicationHandler_9F938B470C7335A-001/solr-instance-001/.
[junit4] 2> 648290 INFO (TEST-TestReplicationHandler.doTestIndexAndConfigReplication-seed#[9F938B470C7335A]) [ ] o.a.s.c.CoreContainer New CoreContainer 1025488732
[junit4] 2> 648290 INFO (TEST-TestReplicationHandler.doTestIndexAndConfigReplication-seed#[9F938B470C7335A]) [ ] o.a.s.c.CoreContainer Loading cores into CoreContainer [instanceDir=/home/jenkins/workspace/Lucene-Solr-5.5-Linux/solr/build/solr-core/test/J0/temp/solr.handler.TestReplicationHandler_9F938B470C7335A-001/solr-instance-001]
[junit4] 2> 648290 WARN (TEST-TestReplicationHandler.doTestIndexAndConfigReplication-seed#[9F938B470C7335A]) [ ] o.a.s.c.CoreContainer Couldn't add files from /home/jenkins/workspace/Lucene-Solr-5.5-Linux/solr/build/solr-core/test/J0/temp/solr.handler.TestReplicationHandler_9F938B470C7335A-001/solr-instance-001/lib to classpath: /home/jenkins/workspace/Lucene-Solr-5.5-Linux/solr/build/solr-core/test/J0/temp/solr.handler.TestReplicationHandler_9F938B470C7335A-001/solr-instance-001/lib
[junit4] 2> 648290 INFO (TEST-TestReplicationHandler.doTestIndexAndConfigReplication-seed#[9F938B470C7335A]) [ ] o.a.s.h.c.HttpShardHandlerFactory created with socketTimeout : 90000,urlScheme : ,connTimeout : 15000,maxConnectionsPerHost : 20,maxConnections : 10000,corePoolSize : 0,maximumPoolSize : 2147483647,maxThreadIdleTime : 5,sizeOfQueue : -1,fairnessPolicy : false,useRetries : false,connectionsEvictorSleepDelay : 5000,maxConnectionIdleTime : 40000,
[junit4] 2> 648291 INFO (TEST-TestReplicationHandler.doTestIndexAndConfigReplication-seed#[9F938B470C7335A]) [ ] o.a.s.u.UpdateShardHandler Creating UpdateShardHandler HTTP client with params: socketTimeout=340000&connTimeout=45000&retry=true
[junit4] 2> 648292 INFO (TEST-TestReplicationHandler.doTestIndexAndConfigReplication-seed#[9F938B470C7335A]) [ ] o.a.s.l.LogWatcher SLF4J impl is org.slf4j.impl.Log4jLoggerFactory
[junit4] 2> 648292 INFO (TEST-TestReplicationHandler.doTestIndexAndConfigReplication-seed#[9F938B470C7335A]) [ ] o.a.s.l.LogWatcher Registering Log Listener [Log4j (org.slf4j.impl.Log4jLoggerFactory)]
[junit4] 2> 648292 INFO (TEST-TestReplicationHandler.doTestIndexAndConfigReplication-seed#[9F938B470C7335A]) [ ] o.a.s.c.CoreContainer Security conf doesn't exist. Skipping setup for authorization module.
[junit4] 2> 648292 INFO (TEST-TestReplicationHandler.doTestIndexAndConfigReplication-seed#[9F938B470C7335A]) [ ] o.a.s.c.CoreContainer No authentication plugin used.
[junit4] 2> 648292 INFO (TEST-TestReplicationHandler.doTestIndexAndConfigReplication-seed#[9F938B470C7335A]) [ ] o.a.s.c.CorePropertiesLocator Looking for core definitions underneath /home/jenkins/workspace/Lucene-Solr-5.5-Linux/solr/build/solr-core/test/J0/temp/solr.handler.TestReplicationHandler_9F938B470C7335A-001/solr-instance-001/.
[junit4] 2> 648293 INFO (TEST-TestReplicationHandler.doTestIndexAndConfigReplication-seed#[9F938B470C7335A]) [ ] o.a.s.c.CoreDescriptor Created CoreDescriptor: {name=collection1, loadOnStartup=true, dataDir=data/, schema=schema.xml, transient=false, config=solrconfig.xml, configSetProperties=configsetprops.json}
[junit4] 2> 648293 INFO (TEST-TestReplicationHandler.doTestIndexAndConfigReplication-seed#[9F938B470C7335A]) [ ] o.a.s.c.CorePropertiesLocator Found core collection1 in /home/jenkins/workspace/Lucene-Solr-5.5-Linux/solr/build/solr-core/test/J0/temp/solr.handler.TestReplicationHandler_9F938B470C7335A-001/solr-instance-001/./collection1
[junit4] 2> 648293 INFO (TEST-TestReplicationHandler.doTestIndexAndConfigReplication-seed#[9F938B470C7335A]) [ ] o.a.s.c.CorePropertiesLocator Found 1 core definitions
[junit4] 2> 648293 INFO (coreLoadExecutor-7080-thread-1) [ ] o.a.s.c.SolrResourceLoader new SolrResourceLoader for directory: '/home/jenkins/workspace/Lucene-Solr-5.5-Linux/solr/build/solr-core/test/J0/temp/solr.handler.TestReplicationHandler_9F938B470C7335A-001/solr-instance-001/collection1'
[junit4] 2> 648293 INFO (TEST-TestReplicationHandler.doTestIndexAndConfigReplication-seed#[9F938B470C7335A]) [ ] o.a.s.s.SolrDispatchFilter user.dir=/home/jenkins/workspace/Lucene-Solr-5.5-Linux/solr/build/solr-core/test/J0
[junit4] 2> 648294 INFO (TEST-TestReplicationHandler.doTestIndexAndConfigReplication-seed#[9F938B470C7335A]) [ ] o.a.s.s.SolrDispatchFilter SolrDispatchFilter.init() done
[junit4] 2> 648294 INFO (coreLoadExecutor-7080-thread-1) [ ] o.a.s.c.SolrResourceLoader JNDI not configured for solr (NoInitialContextEx)
[junit4] 2> 648294 INFO (coreLoadExecutor-7080-thread-1) [ ] o.a.s.c.SolrResourceLoader solr home defaulted to 'solr/' (could not find system property or JNDI)
[junit4] 2> 648299 INFO (coreLoadExecutor-7080-thread-1) [ ] o.a.s.c.SolrConfig current version of requestparams : -1
[junit4] 2> 648305 WARN (coreLoadExecutor-7080-thread-1) [ ] o.a.s.c.Config Beginning with Solr 5.5, <mergePolicy> is deprecated, use <mergePolicyFactory> instead.
[junit4] 2> 648307 INFO (coreLoadExecutor-7080-thread-1) [ ] o.a.s.c.SolrConfig Using Lucene MatchVersion: 5.5.4
[junit4] 2> 648321 INFO (coreLoadExecutor-7080-thread-1) [ ] o.a.s.c.SolrConfig Loaded SolrConfig: solrconfig.xml
[junit4] 2> 648323 INFO (coreLoadExecutor-7080-thread-1) [ ] o.a.s.s.IndexSchema [collection1] Schema name=test
[junit4] 2> 648328 INFO (coreLoadExecutor-7080-thread-1) [ ] o.a.s.s.IndexSchema unique key field: id
[junit4] 2> 648329 INFO (coreLoadExecutor-7080-thread-1) [ ] o.a.s.c.ConfigSetProperties Did not find ConfigSet properties, assuming default properties: Can't find resource 'configsetprops.json' in classpath or '/home/jenkins/workspace/Lucene-Solr-5.5-Linux/solr/build/solr-core/test/J0/temp/solr.handler.TestReplicationHandler_9F938B470C7335A-001/solr-instance-001/collection1'
[junit4] 2> 648329 INFO (coreLoadExecutor-7080-thread-1) [ ] o.a.s.c.CoreContainer Creating SolrCore 'collection1' using configuration from instancedir /home/jenkins/workspace/Lucene-Solr-5.5-Linux/solr/build/solr-core/test/J0/temp/solr.handler.TestReplicationHandler_9F938B470C7335A-001/solr-instance-001/./collection1
[junit4] 2> 648329 INFO (coreLoadExecutor-7080-thread-1) [ x:collection1] o.a.s.c.SolrCore org.apache.solr.core.MockDirectoryFactory
[junit4] 2> 648329 INFO (coreLoadExecutor-7080-thread-1) [ x:collection1] o.a.s.c.SolrCore [[collection1] ] Opening new SolrCore at [/home/jenkins/workspace/Lucene-Solr-5.5-Linux/solr/build/solr-core/test/J0/temp/solr.handler.TestReplicationHandler_9F938B470C7335A-001/solr-instance-001/collection1], dataDir=[/home/jenkins/workspace/Lucene-Solr-5.5-Linux/solr/build/solr-core/test/J0/temp/solr.handler.TestReplicationHandler_9F938B470C7335A-001/solr-instance-001/./collection1/data/]
[junit4] 2> 648329 INFO (coreLoadExecutor-7080-thread-1) [ x:collection1] o.a.s.c.SolrCore JMX monitoring not detected for core: collection1
[junit4] 2> 648330 INFO (coreLoadExecutor-7080-thread-1) [ x:collection1] o.a.s.c.CachingDirectoryFactory return new directory for /home/jenkins/workspace/Lucene-Solr-5.5-Linux/solr/build/solr-core/test/J0/temp/solr.handler.TestReplicationHandler_9F938B470C7335A-001/solr-instance-001/./collection1/data
[junit4] 2> 648330 INFO (coreLoadExecutor-7080-thread-1) [ x:collection1] o.a.s.c.SolrCore New index directory detected: old=null new=/home/jenkins/workspace/Lucene-Solr-5.5-Linux/solr/build/solr-core/test/J0/temp/solr.handler.TestReplicationHandler_9F938B470C7335A-001/solr-instance-001/./collection1/data/index/
[junit4] 2> 648330 WARN (coreLoadExecutor-7080-thread-1) [ x:collection1] o.a.s.c.SolrCore [collection1] Solr index directory '/home/jenkins/workspace/Lucene-Solr-5.5-Linux/solr/build/solr-core/test/J0/temp/solr.handler.TestReplicationHandler_9F938B470C7335A-001/solr-instance-001/./collection1/data/index' doesn't exist. Creating new index...
[junit4] 2> 648330 INFO (coreLoadExecutor-7080-thread-1) [ x:collection1] o.a.s.c.CachingDirectoryFactory return new directory for /home/jenkins/workspace/Lucene-Solr-5.5-Linux/solr/build/solr-core/test/J0/temp/solr.handler.TestReplicationHandler_9F938B470C7335A-001/solr-instance-001/./collection1/data/index
[junit4] 2> 648330 INFO (coreLoadExecutor-7080-thread-1) [ x:collection1] o.a.s.u.RandomMergePolicy RandomMergePolicy wrapping class org.apache.lucene.index.TieredMergePolicy: [TieredMergePolicy: maxMergeAtOnce=39, maxMergeAtOnceExplicit=41, maxMergedSegmentMB=41.9052734375, floorSegmentMB=2.0634765625, forceMergeDeletesPctAllowed=29.887808425212626, segmentsPerTier=17.0, maxCFSSegmentSizeMB=8.796093022207999E12, noCFSRatio=1.0
[junit4] 2> 648330 INFO (coreLoadExecutor-7080-thread-1) [ x:collection1] o.a.s.c.SolrDeletionPolicy SolrDeletionPolicy.onCommit: commits: num=1
[junit4] 2> commit{dir=MockDirectoryWrapper(RAMDirectory@7c269d7c lockFactory=org.apache.lucene.store.SingleInstanceLockFactory@4b2d7791),segFN=segments_1,generation=1}
[junit4] 2> 648330 INFO (coreLoadExecutor-7080-thread-1) [ x:collection1] o.a.s.c.SolrDeletionPolicy newest commit generation = 1
[junit4] 2> 648331 INFO (OldIndexDirectoryCleanupThreadForCore-collection1) [ x:collection1] o.a.s.c.SolrCore Looking for old index directories to cleanup for core collection1 in /home/jenkins/workspace/Lucene-Solr-5.5-Linux/solr/build/solr-core/test/J0/temp/solr.handler.TestReplicationHandler_9F938B470C7335A-001/solr-instance-001/./collection1/data/
[junit4] 2> 648332 INFO (coreLoadExecutor-7080-thread-1) [ x:collection1] o.a.s.c.SolrCore no updateRequestProcessorChain defined as default, creating implicit default
[junit4] 2> 648334 INFO (coreLoadExecutor-7080-thread-1) [ x:collection1] o.a.s.h.l.XMLLoader xsltCacheLifetimeSeconds=60
[junit4] 2> 648334 INFO (coreLoadExecutor-7080-thread-1) [ x:collection1] o.a.s.h.l.XMLLoader xsltCacheLifetimeSeconds=60
[junit4] 2> 648335 INFO (coreLoadExecutor-7080-thread-1) [ x:collection1] o.a.s.h.l.XMLLoader xsltCacheLifetimeSeconds=60
[junit4] 2> 648336 INFO (coreLoadExecutor-7080-thread-1) [ x:collection1] o.a.s.h.l.XMLLoader xsltCacheLifetimeSeconds=60
[junit4] 2> 648337 INFO (coreLoadExecutor-7080-thread-1) [ x:collection1] o.a.s.c.PluginBag requestHandler : 'lazy' created with startup=lazy
[junit4] 2> 648337 INFO (coreLoadExecutor-7080-thread-1) [ x:collection1] o.a.s.c.RequestHandlers Registered paths: /schema,lazy,/get,/admin/logging,standard,/admin/mbeans,defaults,/config,/admin/properties,/admin/file,/admin/threads,/admin/plugins,/update,/admin/ping,/update/csv,/admin/luke,/admin/segments,/update/json,/replication,/admin/system,/update/json/docs
[junit4] 2> 648337 INFO (coreLoadExecutor-7080-thread-1) [ x:collection1] o.a.s.c.SolrCore Using default statsCache cache: org.apache.solr.search.stats.LocalStatsCache
[junit4] 2> 648338 INFO (coreLoadExecutor-7080-thread-1) [ x:collection1] o.a.s.u.CommitTracker Hard AutoCommit: disabled
[junit4] 2> 648338 INFO (coreLoadExecutor-7080-thread-1) [ x:collection1] o.a.s.u.CommitTracker Soft AutoCommit: disabled
[junit4] 2> 648338 INFO (coreLoadExecutor-7080-thread-1) [ x:collection1] o.a.s.u.RandomMergePolicy RandomMergePolicy wrapping class org.apache.lucene.index.TieredMergePolicy: [TieredMergePolicy: maxMergeAtOnce=35, maxMergeAtOnceExplicit=31, maxMergedSegmentMB=78.8984375, floorSegmentMB=2.181640625, forceMergeDeletesPctAllowed=12.015590862258929, segmentsPerTier=34.0, maxCFSSegmentSizeMB=8.796093022207999E12, noCFSRatio=1.0
[junit4] 2> 648338 INFO (coreLoadExecutor-7080-thread-1) [ x:collection1] o.a.s.c.SolrDeletionPolicy SolrDeletionPolicy.onInit: commits: num=1
[junit4] 2> commit{dir=MockDirectoryWrapper(RAMDirectory@7c269d7c lockFactory=org.apache.lucene.store.SingleInstanceLockFactory@4b2d7791),segFN=segments_1,generation=1}
[junit4] 2> 648338 INFO (coreLoadExecutor-7080-thread-1) [ x:collection1] o.a.s.c.SolrDeletionPolicy newest commit generation = 1
[junit4] 2> 648339 INFO (coreLoadExecutor-7080-thread-1) [ x:collection1] o.a.s.s.SolrIndexSearcher Opening Searcher@177fd8f[collection1] main
[junit4] 2> 648339 INFO (coreLoadExecutor-7080-thread-1) [ x:collection1] o.a.s.r.ManagedResourceStorage File-based storage initialized to use dir: /home/jenkins/workspace/Lucene-Solr-5.5-Linux/solr/build/solr-core/test/J0/temp/solr.handler.TestReplicationHandler_9F938B470C7335A-001/solr-instance-001/collection1/conf
[junit4] 2> 648339 INFO (coreLoadExecutor-7080-thread-1) [ x:collection1] o.a.s.r.RestManager Initializing RestManager with initArgs: {storageDir=/home/jenkins/workspace/Lucene-Solr-5.5-Linux/solr/build/solr-core/test/J0/temp/solr.handler.TestReplicationHandler_9F938B470C7335A-001/solr-instance-001/collection1/conf}
[junit4] 2> 648339 INFO (coreLoadExecutor-7080-thread-1) [ x:collection1] o.a.s.r.ManagedResourceStorage Reading _rest_managed.json using file:dir=/home/jenkins/workspace/Lucene-Solr-5.5-Linux/solr/build/solr-core/test/J0/temp/solr.handler.TestReplicationHandler_9F938B470C7335A-001/solr-instance-001/collection1/conf
[junit4] 2> 648339 INFO (coreLoadExecutor-7080-thread-1) [ x:collection1] o.a.s.r.RestManager Initializing 0 registered ManagedResources
[junit4] 2> 648339 INFO (coreLoadExecutor-7080-thread-1) [ x:collection1] o.a.s.h.ReplicationHandler Replication enabled for following config files: schema.xml,xslt/dummy.xsl
[junit4] 2> 648339 INFO (coreLoadExecutor-7080-thread-1) [ x:collection1] o.a.s.h.ReplicationHandler Commits will be reserved for 10000
[junit4] 2> 648339 INFO (searcherExecutor-7081-thread-1-processing-x:collection1) [ x:collection1] o.a.s.c.SolrCore [collection1] Registered new searcher Searcher@177fd8f[collection1] main{ExitableDirectoryReader(UninvertingDirectoryReader())}
[junit4] 2> 648339 INFO (coreLoadExecutor-7080-thread-1) [ x:collection1] o.a.s.c.CoreContainer registering core: collection1
[junit4] 2> 648795 INFO (TEST-TestReplicationHandler.doTestIndexAndConfigReplication-seed#[9F938B470C7335A]) [ ] o.a.s.SolrTestCaseJ4 Writing core.properties file to /home/jenkins/workspace/Lucene-Solr-5.5-Linux/solr/build/solr-core/test/J0/temp/solr.handler.TestReplicationHandler_9F938B470C7335A-001/solr-instance-002/collection1
[junit4] 2> 648797 INFO (TEST-TestReplicationHandler.doTestIndexAndConfigReplication-seed#[9F938B470C7335A]) [ ] o.e.j.s.Server jetty-9.2.13.v20150730
[junit4] 2> 648798 INFO (TEST-TestReplicationHandler.doTestIndexAndConfigReplication-seed#[9F938B470C7335A]) [ ] o.e.j.s.h.ContextHandler Started o.e.j.s.ServletContextHandler@79c18690{/solr,null,AVAILABLE}
[junit4] 2> 648798 INFO (TEST-TestReplicationHandler.doTestIndexAndConfigReplication-seed#[9F938B470C7335A]) [ ] o.e.j.s.ServerConnector Started ServerConnector@4104600{HTTP/1.1}{127.0.0.1:32855}
[junit4] 2> 648798 INFO (TEST-TestReplicationHandler.doTestIndexAndConfigReplication-seed#[9F938B470C7335A]) [ ] o.e.j.s.Server Started @650407ms
[junit4] 2> 648798 INFO (TEST-TestReplicationHandler.doTestIndexAndConfigReplication-seed#[9F938B470C7335A]) [ ] o.a.s.c.s.e.JettySolrRunner Jetty properties: {hostContext=/solr, hostPort=32855, solr.data.dir=/home/jenkins/workspace/Lucene-Solr-5.5-Linux/solr/build/solr-core/test/J0/temp/solr.handler.TestReplicationHandler_9F938B470C7335A-001/solr-instance-002/collection1/data}
[junit4] 2> 648799 INFO (TEST-TestReplicationHandler.doTestIndexAndConfigReplication-seed#[9F938B470C7335A]) [ ] o.a.s.s.SolrDispatchFilter SolrDispatchFilter.init(): sun.misc.Launcher$AppClassLoader@2876b359
[junit4] 2> 648799 INFO (TEST-TestReplicationHandler.doTestIndexAndConfigReplication-seed#[9F938B470C7335A]) [ ] o.a.s.c.SolrResourceLoader new SolrResourceLoader for directory: '/home/jenkins/workspace/Lucene-Solr-5.5-Linux/solr/build/solr-core/test/J0/temp/solr.handler.TestReplicationHandler_9F938B470C7335A-001/solr-instance-002'
[junit4] 2> 648799 INFO (TEST-TestReplicationHandler.doTestIndexAndConfigReplication-seed#[9F938B470C7335A]) [ ] o.a.s.c.SolrResourceLoader JNDI not configured for solr (NoInitialContextEx)
[junit4] 2> 648799 INFO (TEST-TestReplicationHandler.doTestIndexAndConfigReplication-seed#[9F938B470C7335A]) [ ] o.a.s.c.SolrResourceLoader solr home defaulted to 'solr/' (could not find system property or JNDI)
[junit4] 2> 648799 INFO (TEST-TestReplicationHandler.doTestIndexAndConfigReplication-seed#[9F938B470C7335A]) [ ] o.a.s.c.SolrXmlConfig Loading container configuration from /home/jenkins/workspace/Lucene-Solr-5.5-Linux/solr/build/solr-core/test/J0/temp/solr.handler.TestReplicationHandler_9F938B470C7335A-001/solr-instance-002/solr.xml
[junit4] 2> 648808 INFO (TEST-TestReplicationHandler.doTestIndexAndConfigReplication-seed#[9F938B470C7335A]) [ ] o.a.s.c.CorePropertiesLocator Config-defined core root directory: /home/jenkins/workspace/Lucene-Solr-5.5-Linux/solr/build/solr-core/test/J0/temp/solr.handler.TestReplicationHandler_9F938B470C7335A-001/solr-instance-002/.
[junit4] 2> 648808 INFO (TEST-TestReplicationHandler.doTestIndexAndConfigReplication-seed#[9F938B470C7335A]) [ ] o.a.s.c.CoreContainer New CoreContainer 1328723553
[junit4] 2> 648808 INFO (TEST-TestReplicationHandler.doTestIndexAndConfigReplication-seed#[9F938B470C7335A]) [ ] o.a.s.c.CoreContainer Loading cores into CoreContainer [instanceDir=/home/jenkins/workspace/Lucene-Solr-5.5-Linux/solr/build/solr-core/test/J0/temp/solr.handler.TestReplicationHandler_9F938B470C7335A-001/solr-instance-002]
[junit4] 2> 648808 WARN (TEST-TestReplicationHandler.doTestIndexAndConfigReplication-seed#[9F938B470C7335A]) [ ] o.a.s.c.CoreContainer Couldn't add files from /home/jenkins/workspace/Lucene-Solr-5.5-Linux/solr/build/solr-core/test/J0/temp/solr.handler.TestReplicationHandler_9F938B470C7335A-001/solr-instance-002/lib to classpath: /home/jenkins/workspace/Lucene-Solr-5.5-Linux/solr/build/solr-core/test/J0/temp/solr.handler.TestReplicationHandler_9F938B470C7335A-001/solr-instance-002/lib
[junit4] 2> 648809 INFO (TEST-TestReplicationHandler.doTestIndexAndConfigReplication-seed#[9F938B470C7335A]) [ ] o.a.s.h.c.HttpShardHandlerFactory created with socketTimeout : 90000,urlScheme : ,connTimeout : 15000,maxConnectionsPerHost : 20,maxConnections : 10000,corePoolSize : 0,maximumPoolSize : 2147483647,maxThreadIdleTime : 5,sizeOfQueue : -1,fairnessPolicy : false,useRetries : false,connectionsEvictorSleepDelay : 5000,maxConnectionIdleTime : 40000,
[junit4] 2> 648810 INFO (TEST-TestReplicationHandler.doTestIndexAndConfigReplication-seed#[9F938B470C7335A]) [ ] o.a.s.u.UpdateShardHandler Creating UpdateShardHandler HTTP client with params: socketTimeout=340000&connTimeout=45000&retry=true
[junit4] 2> 648810 INFO (TEST-TestReplicationHandler.doTestIndexAndConfigReplication-seed#[9F938B470C7335A]) [ ] o.a.s.l.LogWatcher SLF4J impl is org.slf4j.impl.Log4jLoggerFactory
[junit4] 2> 648810 INFO (TEST-TestReplicationHandler.doTestIndexAndConfigReplication-seed#[9F938B470C7335A]) [ ] o.a.s.l.LogWatcher Registering Log Listener [Log4j (org.slf4j.impl.Log4jLoggerFactory)]
[junit4] 2> 648810 INFO (TEST-TestReplicationHandler.doTestIndexAndConfigReplication-seed#[9F938B470C7335A]) [ ] o.a.s.c.CoreContainer Security conf doesn't exist. Skipping setup for authorization module.
[junit4] 2> 648810 INFO (TEST-TestReplicationHandler.doTestIndexAndConfigReplication-seed#[9F938B470C7335A]) [ ] o.a.s.c.CoreContainer No authentication plugin used.
[junit4] 2> 648811 INFO (TEST-TestReplicationHandler.doTestIndexAndConfigReplication-seed#[9F938B470C7335A]) [ ] o.a.s.c.CorePropertiesLocator Looking for core definitions underneath /home/jenkins/workspace/Lucene-Solr-5.5-Linux/solr/build/solr-core/test/J0/temp/solr.handler.TestReplicationHandler_9F938B470C7335A-001/solr-instance-002/.
[junit4] 2> 648812 INFO (TEST-TestReplicationHandler.doTestIndexAndConfigReplication-seed#[9F938B470C7335A]) [ ] o.a.s.c.CoreDescriptor Created CoreDescriptor: {dataDir=data/, configSetProperties=configsetprops.json, transient=false, name=collection1, loadOnStartup=true, schema=schema.xml, config=solrconfig.xml}
[junit4] 2> 648812 INFO (TEST-TestReplicationHandler.doTestIndexAndConfigReplication-seed#[9F938B470C7335A]) [ ] o.a.s.c.CorePropertiesLocator Found core collection1 in /home/jenkins/workspace/Lucene-Solr-5.5-Linux/solr/build/solr-core/test/J0/temp/solr.handler.TestReplicationHandler_9F938B470C7335A-001/solr-instance-002/./collection1
[junit4] 2> 648812 INFO (TEST-TestReplicationHandler.doTestIndexAndConfigReplication-seed#[9F938B470C7335A]) [ ] o.a.s.c.CorePropertiesLocator Found 1 core definitions
[junit4] 2> 648812 INFO (coreLoadExecutor-7090-thread-1) [ ] o.a.s.c.SolrResourceLoader new SolrResourceLoader for directory: '/home/jenkins/workspace/Lucene-Solr-5.5-Linux/solr/build/solr-core/test/J0/temp/solr.handler.TestReplicationHandler_9F938B470C7335A-001/solr-instance-002/collection1'
[junit4] 2> 648812 INFO (TEST-TestReplicationHandler.doTestIndexAndConfigReplication-seed#[9F938B470C7335A]) [ ] o.a.s.s.SolrDispatchFilter user.dir=/home/jenkins/workspace/Lucene-Solr-5.5-Linux/solr/build/solr-core/test/J0
[junit4] 2> 648812 INFO (TEST-TestReplicationHandler.doTestIndexAndConfigReplication-seed#[9F938B470C7335A]) [ ] o.a.s.s.SolrDispatchFilter SolrDispatchFilter.init() done
[junit4] 2> 648812 INFO (coreLoadExecutor-7090-thread-1) [ ] o.a.s.c.SolrResourceLoader JNDI not configured for solr (NoInitialContextEx)
[junit4] 2> 648812 INFO (coreLoadExecutor-7090-thread-1) [ ] o.a.s.c.SolrResourceLoader solr home defaulted to 'solr/' (could not find system property or JNDI)
[junit4] 2> 648817 INFO (coreLoadExecutor-7090-thread-1) [ ] o.a.s.c.SolrConfig current version of requestparams : -1
[junit4] 2> 648823 WARN (coreLoadExecutor-7090-thread-1) [ ] o.a.s.c.Config Beginning with Solr 5.5, <mergePolicy> is deprecated, use <mergePolicyFactory> instead.
[junit4] 2> 648825 INFO (coreLoadExecutor-7090-thread-1) [ ] o.a.s.c.SolrConfig Using Lucene MatchVersion: 5.5.4
[junit4] 2> 648847 INFO (coreLoadExecutor-7090-thread-1) [ ] o.a.s.c.SolrConfig Loaded SolrConfig: solrconfig.xml
[junit4] 2> 648849 INFO (coreLoadExecutor-7090-thread-1) [ ] o.a.s.s.IndexSchema [collection1] Schema name=test
[junit4] 2> 648853 INFO (coreLoadExecutor-7090-thread-1) [ ] o.a.s.s.IndexSchema unique key field: id
[junit4] 2> 648855 INFO (coreLoadExecutor-7090-thread-1) [ ] o.a.s.c.ConfigSetProperties Did not find ConfigSet properties, assuming default properties: Can't find resource 'configsetprops.json' in classpath or '/home/jenkins/workspace/Lucene-Solr-5.5-Linux/solr/build/solr-core/test/J0/temp/solr.handler.TestReplicationHandler_9F938B470C7335A-001/solr-instance-002/collection1'
[junit4] 2> 648855 INFO (coreLoadExecutor-7090-thread-1) [ ] o.a.s.c.CoreContainer Creating SolrCore 'collection1' using configuration from instancedir /home/jenkins/workspace/Lucene-Solr-5.5-Linux/solr/build/solr-core/test/J0/temp/solr.handler.TestReplicationHandler_9F938B470C7335A-001/solr-instance-002/./collection1
[junit4] 2> 648855 INFO (coreLoadExecutor-7090-thread-1) [ x:collection1] o.a.s.c.SolrCore org.apache.solr.core.MockDirectoryFactory
[junit4] 2> 648855 INFO (coreLoadExecutor-7090-thread-1) [ x:collection1] o.a.s.c.SolrCore [[collection1] ] Opening new SolrCore at [/home/jenkins/workspace/Lucene-Solr-5.5-Linux/solr/build/solr-core/test/J0/temp/solr.handler.TestReplicationHandler_9F938B470C7335A-001/solr-instance-002/collection1], dataDir=[/home/jenkins/workspace/Lucene-Solr-5.5-Linux/solr/build/solr-core/test/J0/temp/solr.handler.TestReplicationHandler_9F938B470C7335A-001/solr-instance-002/./collection1/data/]
[junit4] 2> 648855 INFO (coreLoadExecutor-7090-thread-1) [ x:collection1] o.a.s.c.SolrCore JMX monitoring not detected for core: collection1
[junit4] 2> 648855 INFO (coreLoadExecutor-7090-thread-1) [ x:collection1] o.a.s.c.CachingDirectoryFactory return new directory for /home/jenkins/workspace/Lucene-Solr-5.5-Linux/solr/build/solr-core/test/J0/temp/solr.handler.TestReplicationHandler_9F938B470C7335A-001/solr-instance-002/./collection1/data
[junit4] 2> 648855 INFO (coreLoadExecutor-7090-thread-1) [ x:collection1] o.a.s.c.SolrCore New index directory detected: old=null new=/home/jenkins/workspace/Lucene-Solr-5.5-Linux/solr/build/solr-core/test/J0/temp/solr.handler.TestReplicationHandler_9F938B470C7335A-001/solr-instance-002/./collection1/data/index/
[junit4] 2> 648855 WARN (coreLoadExecutor-7090-thread-1) [ x:collection1] o.a.s.c.SolrCore [collection1] Solr index directory '/home/jenkins/workspace/Lucene-Solr-5.5-Linux/solr/build/solr-core/test/J0/temp/solr.handler.TestReplicationHandler_9F938B470C7335A-001/solr-instance-002/./collection1/data/index' doesn't exist. Creating new index...
[junit4] 2> 648856 INFO (coreLoadExecutor-7090-thread-1) [ x:collection1] o.a.s.c.CachingDirectoryFactory return new directory for /home/jenkins/workspace/Lucene-Solr-5.5-Linux/solr/build/solr-core/test/J0/temp/solr.handler.TestReplicationHandler_9F938B470C7335A-001/solr-instance-002/./collection1/data/index
[junit4] 2> 648856 INFO (coreLoadExecutor-7090-thread-1) [ x:collection1] o.a.s.u.RandomMergePolicy RandomMergePolicy wrapping class org.apache.lucene.index.TieredMergePolicy: [TieredMergePolicy: maxMergeAtOnce=39, maxMergeAtOnceExplicit=41, maxMergedSegmentMB=41.9052734375, floorSegmentMB=2.0634765625, forceMergeDeletesPctAllowed=29.887808425212626, segmentsPerTier=17.0, maxCFSSegmentSizeMB=8.796093022207999E12, noCFSRatio=1.0
[junit4] 2> 648856 INFO (coreLoadExecutor-7090-thread-1) [ x:collection1] o.a.s.c.SolrDeletionPolicy SolrDeletionPolicy.onCommit: commits: num=1
[junit4] 2> commit{dir=MockDirectoryWrapper(RAMDirectory@4ecb91a9 lockFactory=org.apache.lucene.store.SingleInstanceLockFactory@16c816a9),segFN=segments_1,generation=1}
[junit4] 2> 648856 INFO (coreLoadExecutor-7090-thread-1) [ x:collection1] o.a.s.c.SolrDeletionPolicy newest commit generation = 1
[junit4] 2> 648856 INFO (OldIndexDirectoryCleanupThreadForCore-collection1) [ x:collection1] o.a.s.c.SolrCore Looking for old index directories to cleanup for core collection1 in /home/jenkins/workspace/Lucene-Solr-5.5-Linux/solr/build/solr-core/test/J0/temp/solr.handler.TestReplicationHandler_9F938B470C7335A-001/solr-instance-002/./collection1/data/
[junit4] 2> 648857 INFO (coreLoadExecutor-7090-thread-1) [ x:collection1] o.a.s.c.SolrCore no updateRequestProcessorChain defined as default, creating implicit default
[junit4] 2> 648859 INFO (coreLoadExecutor-7090-thread-1) [ x:collection1] o.a.s.h.l.XMLLoader xsltCacheLifetimeSeconds=60
[junit4] 2> 648860 INFO (coreLoadExecutor-7090-thread-1) [ x:collection1] o.a.s.h.l.XMLLoader xsltCacheLifetimeSeconds=60
[junit4] 2> 648860 INFO (coreLoadExecutor-7090-thread-1) [ x:collection1] o.a.s.h.l.XMLLoader xsltCacheLifetimeSeconds=60
[junit4] 2> 648861 INFO (coreLoadExecutor-7090-thread-1) [ x:collection1] o.a.s.h.l.XMLLoader xsltCacheLifetimeSeconds=60
[junit4] 2> 648862 INFO (coreLoadExecutor-7090-thread-1) [ x:collection1] o.a.s.c.PluginBag requestHandler : 'lazy' created with startup=lazy
[junit4] 2> 648862 INFO (coreLoadExecutor-7090-thread-1) [ x:collection1] o.a.s.c.RequestHandlers Registered paths: /schema,lazy,/get,/admin/logging,standard,/admin/mbeans,defaults,/config,/admin/properties,/admin/file,/admin/threads,/admin/plugins,/update,/admin/ping,/update/csv,/admin/luke,/admin/segments,/update/json,/replication,/admin/system,/update/json/docs
[junit4] 2> 648863 INFO (coreLoadExecutor-7090-thread-1) [ x:collection1] o.a.s.c.SolrCore Using default statsCache cache: org.apache.solr.search.stats.LocalStatsCache
[junit4] 2> 648863 INFO (coreLoadExecutor-7090-thread-1) [ x:collection1] o.a.s.u.CommitTracker Hard AutoCommit: disabled
[junit4] 2> 648863 INFO (coreLoadExecutor-7090-thread-1) [ x:collection1] o.a.s.u.CommitTracker Soft AutoCommit: disabled
[junit4] 2> 648863 INFO (coreLoadExecutor-7090-thread-1) [ x:collection1] o.a.s.u.RandomMergePolicy RandomMergePolicy wrapping class org.apache.lucene.index.TieredMergePolicy: [TieredMergePolicy: maxMergeAtOnce=35, maxMergeAtOnceExplicit=31, maxMergedSegmentMB=78.8984375, floorSegmentMB=2.181640625, forceMergeDeletesPctAllowed=12.015590862258929, segmentsPerTier=34.0, maxCFSSegmentSizeMB=8.796093022207999E12, noCFSRatio=1.0
[junit4] 2> 648863 INFO (coreLoadExecutor-7090-thread-1) [ x:collection1] o.a.s.c.SolrDeletionPolicy SolrDeletionPolicy.onInit: commits: num=1
[junit4] 2> commit{dir=MockDirectoryWrapper(RAMDirectory@4ecb91a9 lockFactory=org.apache.lucene.store.SingleInstanceLockFactory@16c816a9),segFN=segments_1,generation=1}
[junit4] 2> 648863 INFO (coreLoadExecutor-7090-thread-1) [ x:collection1] o.a.s.c.SolrDeletionPolicy newest commit generation = 1
[junit4] 2> 648863 INFO (coreLoadExecutor-7090-thread-1) [ x:collection1] o.a.s.s.SolrIndexSearcher Opening Searcher@636174e4[collection1] main
[junit4] 2> 648863 INFO (coreLoadExecutor-7090-thread-1) [ x:collection1] o.a.s.r.ManagedResourceStorage File-based storage initialized to use dir: /home/jenkins/workspace/Lucene-Solr-5.5-Linux/solr/build/solr-core/test/J0/temp/solr.handler.TestReplicationHandler_9F938B470C7335A-001/solr-instance-002/collection1/conf
[junit4] 2> 648863 INFO (coreLoadExecutor-7090-thread-1) [ x:collection1] o.a.s.r.RestManager Initializing RestManager with initArgs: {storageDir=/home/jenkins/workspace/Lucene-Solr-5.5-Linux/solr/build/solr-core/test/J0/temp/solr.handler.TestReplicationHandler_9F938B470C7335A-001/solr-instance-002/collection1/conf}
[junit4] 2> 648863 INFO (coreLoadExecutor-7090-thread-1) [ x:collection1] o.a.s.r.ManagedResourceStorage Reading _rest_managed.json using file:dir=/home/jenkins/workspace/Lucene-Solr-5.5-Linux/solr/build/solr-core/test/J0/temp/solr.handler.TestReplicationHandler_9F938B470C7335A-001/solr-instance-002/collection1/conf
[junit4] 2> 648863 INFO (coreLoadExecutor-7090-thread-1) [ x:collection1] o.a.s.r.RestManager Initializing 0 registered ManagedResources
[junit4] 2> 648865 INFO (coreLoadExecutor-7090-thread-1) [ x:collection1] o.a.s.h.ReplicationHandler Poll scheduled at an interval of 1000ms
[junit4] 2> 648865 INFO (searcherExecutor-7091-thread-1-processing-x:collection1) [ x:collection1] o.a.s.c.SolrCore [collection1] Registered new searcher Searcher@636174e4[collection1] main{ExitableDirectoryReader(UninvertingDirectoryReader())}
[junit4] 2> 648865 INFO (coreLoadExecutor-7090-thread-1) [ x:collection1] o.a.s.c.CoreContainer registering core: collection1
[junit4] 2> 649315 INFO (qtp90603281-95626) [ x:collection1] o.a.s.c.S.Request [collection1] webapp=/solr path=/select params={wt=javabin&q=*:*&version=2&sort=id+desc} hits=0 status=0 QTime=0
[junit4] 2> 649319 INFO (qtp90603281-95627) [ x:collection1] o.a.s.u.p.LogUpdateProcessorFactory [collection1] webapp=/solr path=/update params={wt=javabin&version=2}{add=[0]} 0 0
[junit4] 2> 649321 INFO (qtp90603281-95628) [ x:collection1] o.a.s.u.p.LogUpdateProcessorFactory [collection1] webapp=/solr path=/update params={wt=javabin&version=2}{add=[1]} 0 0
[junit4] 2> 649323 INFO (qtp90603281-95626) [ x:collection1] o.a.s.u.p.LogUpdateProcessorFactory [collection1] webapp=/solr path=/update params={wt=javabin&version=2}{add=[2]} 0 0
[junit4] 2> 649325 INFO (qtp90603281-95627) [ x:collection1] o.a.s.u.p.LogUpdateProcessorFactory [collection1] webapp=/solr path=/update params={wt=javabin&version=2}{add=[3]} 0 0
[junit4] 2> 649327 INFO (qtp90603281-95628) [ x:collection1] o.a.s.u.p.LogUpdateProcessorFactory [collection1] webapp=/solr path=/update params={wt=javabin&version=2}{add=[4]} 0 0
[junit4] 2> 649329 INFO (qtp90603281-95626) [ x:collection1] o.a.s.u.p.LogUpdateProcessorFactory [collection1] webapp=/solr path=/update params={wt=javabin&version=2}{add=[5]} 0 0
[junit4] 2> 649331 INFO (qtp90603281-95627) [ x:collection1] o.a.s.u.p.LogUpdateProcessorFactory [collection1] webapp=/solr path=/update params={wt=javabin&version=2}{add=[6]} 0 0
[junit4] 2> 649333 INFO (qtp90603281-95628) [ x:collection1] o.a.s.u.p.LogUpdateProcessorFactory [collection1] webapp=/solr path=/update params={wt=javabin&version=2}{add=[7]} 0 0
[junit4] 2> 649335 INFO (qtp90603281-95626) [ x:collection1] o.a.s.u.p.LogUpdateProcessorFactory [collection1] webapp=/solr path=/update params={wt=javabin&version=2}{add=[8]} 0 0
[junit4] 2> 649337 INFO (qtp90603281-95627) [ x:collection1] o.a.s.u.p.LogUpdateProcessorFactory [collection1] webapp=/solr path=/update params={wt=javabin&version=2}{add=[9]} 0 0
[junit4] 2> 649339 INFO (qtp90603281-95628) [ x:collection1] o.a.s.u.p.LogUpdateProcessorFactory [collection1] webapp=/solr path=/update params={wt=javabin&version=2}{add=[10]} 0 0
[junit4] 2> 649341 INFO (qtp90603281-95626) [ x:collection1] o.a.s.u.p.LogUpdateProcessorFactory [collection1] webapp=/solr path=/update params={wt=javabin&version=2}{add=[11]} 0 0
[junit4] 2> 649344 INFO (qtp90603281-95627) [ x:collection1] o.a.s.u.p.LogUpdateProcessorFactory [collection1] webapp=/solr path=/update params={wt=javabin&version=2}{add=[12]} 0 0
[junit4] 2> 649346 INFO (qtp90603281-95628) [ x:collection1] o.a.s.u.p.LogUpdateProcessorFactory [collection1] webapp=/solr path=/update params={wt=javabin&version=2}{add=[13]} 0 0
[junit4] 2> 649348 INFO (qtp90603281-95626) [ x:collection1] o.a.s.u.p.LogUpdateProcessorFactory [collection1] webapp=/solr path=/update params={wt=javabin&version=2}{add=[14]} 0 0
[junit4] 2> 649351 INFO (qtp90603281-95627) [ x:collection1] o.a.s.u.p.LogUpdateProcessorFactory [collection1] webapp=/solr path=/update params={wt=javabin&version=2}{add=[15]} 0 0
[junit4] 2> 649353 INFO (qtp90603281-95628) [ x:collection1] o.a.s.u.p.LogUpdateProcessorFactory [collection1] webapp=/solr path=/update params={wt=javabin&version=2}{add=[16]} 0 0
[junit4] 2> 649355 INFO (qtp90603281-95626) [ x:collection1] o.a.s.u.p.LogUpdateProcessorFactory [collection1] webapp=/solr path=/update params={wt=javabin&version=2}{add=[17]} 0 0
[junit4] 2> 649357 INFO (qtp90603281-95627) [ x:collection1] o.a.s.u.p.LogUpdateProcessorFactory [collection1] webapp=/solr path=/update params={wt=javabin&version=2}{add=[18]} 0 0
[junit4] 2> 649359 INFO (qtp90603281-95628) [ x:collection1] o.a.s.u.p.LogUpdateProcessorFactory [collection1] webapp=/solr path=/update params={wt=javabin&version=2}{add=[19]} 0 0
[junit4] 2> 649361 INFO (qtp90603281-95626) [ x:collection1] o.a.s.u.p.LogUpdateProcessorFactory [collection1] webapp=/solr path=/update params={wt=javabin&version=2}{add=[20]} 0 0
[junit4] 2> 649363 INFO (qtp90603281-95627) [ x:collection1] o.a.s.u.p.LogUpdateProcessorFactory [collection1] webapp=/solr path=/update params={wt=javabin&version=2}{add=[21]} 0 0
[junit4] 2> 649365 INFO (qtp90603281-95628) [ x:collection1] o.a.s.u.p.LogUpdateProcessorFactory [collection1] webapp=/solr path=/update params={wt=javabin&version=2}{add=[22]} 0 0
[junit4] 2> 649367 INFO (qtp90603281-95626) [ x:collection1] o.a.s.u.p.LogUpdateProcessorFactory [collection1] webapp=/solr path=/update params={wt=javabin&version=2}{add=[23]} 0 0
[junit4] 2> 649369 INFO (qtp90603281-95627) [ x:collection1] o.a.s.u.p.LogUpdateProcessorFactory [collection1] webapp=/solr path=/update params={wt=javabin&version=2}{add=[24]} 0 0
[junit4] 2> 649371 INFO (qtp90603281-95628) [ x:collection1] o.a.s.u.p.LogUpdateProcessorFactory [collection1] webapp=/solr path=/update params={wt=javabin&version=2}{add=[25]} 0 0
[junit4] 2> 649373 INFO (qtp90603281-95626) [ x:collection1] o.a.s.u.p.LogUpdateProcessorFactory [collection1] webapp=/solr path=/update params={wt=javabin&version=2}{add=[26]} 0 0
[junit4] 2> 649375 INFO (qtp90603281-95627) [ x:collection1] o.a.s.u.p.LogUpdateProcessorFactory [collection1] webapp=/solr path=/update params={wt=javabin&version=2}{add=[27]} 0 0
[junit4] 2> 649377 INFO (qtp90603281-95628) [ x:collection1] o.a.s.u.p.LogUpdateProcessorFactory [collection1] webapp=/solr path=/update params={wt=javabin&version=2}{add=[28]} 0 0
[junit4] 2> 649379 INFO (qtp90603281-95626) [ x:collection1] o.a.s.u.p.LogUpdateProcessorFactory [collection1] webapp=/solr path=/update params={wt=javabin&version=2}{add=[29]} 0 0
[junit4] 2> 649381 INFO (qtp90603281-95627) [ x:collection1] o.a.s.u.p.LogUpdateProcessorFactory [collection1] webapp=/solr path=/update params={wt=javabin&version=2}{add=[30]} 0 0
[junit4] 2> 649383 INFO (qtp90603281-95628) [ x:collection1] o.a.s.u.p.LogUpdateProcessorFactory [collection1] webapp=/solr path=/update params={wt=javabin&version=2}{add=[31]} 0 0
[junit4] 2> 649385 INFO (qtp90603281-95626) [ x:collection1] o.a.s.u.p.LogUpdateProcessorFactory [collection1] webapp=/solr path=/update params={wt=javabin&version=2}{add=[32]} 0 0
[junit4] 2> 649387 INFO (qtp90603281-95627) [ x:collection1] o.a.s.u.p.LogUpdateProcessorFactory [collection1] webapp=/solr path=/update params={wt=javabin&version=2}{add=[33]} 0 0
[junit4] 2> 649389 INFO (qtp90603281-95628) [ x:collection1] o.a.s.u.p.LogUpdateProcessorFactory [collection1] webapp=/solr path=/update params={wt=javabin&version=2}{add=[34]} 0 0
[junit4] 2> 649391 INFO (qtp90603281-95626) [ x:collection1] o.a.s.u.p.LogUpdateProcessorFactory [collection1] webapp=/solr path=/update params={wt=javabin&version=2}{add=[35]} 0 0
[junit4] 2> 649393 INFO (qtp90603281-95627) [ x:collection1] o.a.s.u.p.LogUpdateProcessorFactory [collection1] webapp=/solr path=/update params={wt=javabin&version=2}{add=[36]} 0 0
[junit4] 2> 649396 INFO (qtp90603281-95628) [ x:collection1] o.a.s.u.p.LogUpdateProcessorFactory [collection1] webapp=/solr path=/update params={wt=javabin&version=2}{add=[37]} 0 0
[junit4] 2> 649398 INFO (qtp90603281-95626) [ x:collection1] o.a.s.u.p.LogUpdateProcessorFactory [collection1] webapp=/solr path=/update params={wt=javabin&version=2}{add=[38]} 0 0
[junit4] 2> 649400 INFO (qtp90603281-95627) [ x:collection1] o.a.s.u.p.LogUpdateProcessorFactory [collection1] webapp=/solr path=/update params={wt=javabin&version=2}{add=[39]} 0 0
[junit4] 2> 649402 INFO (qtp90603281-95628) [ x:collection1] o.a.s.u.p.LogUpdateProcessorFactory [collection1] webapp=/solr path=/update params={wt=javabin&version=2}{add=[40]} 0 0
[junit4] 2> 649404 INFO (qtp90603281-95626) [ x:collection1] o.a.s.u.p.LogUpdateProcessorFactory [collection1] webapp=/solr path=/update params={wt=javabin&version=2}{add=[41]} 0 0
[junit4] 2> 649407 INFO (qtp90603281-95627) [ x:collection1] o.a.s.u.p.LogUpdateProcessorFactory [collection1] webapp=/solr path=/update params={wt=javabin&version=2}{add=[42]} 0 0
[junit4] 2> 649409 INFO (qtp90603281-95628) [ x:collection1] o.a.s.u.p.LogUpdateProcessorFactory [collection1] webapp=/solr path=/update params={wt=javabin&version=2}{add=[43]} 0 0
[junit4] 2> 649411 INFO (qtp90603281-95626) [ x:collection1] o.a.s.u.p.LogUpdateProcessorFactory [collection1] webapp=/solr path=/update params={wt=javabin&version=2}{add=[44]} 0 0
[junit4] 2> 649413 INFO (qtp90603281-95627) [ x:collection1] o.a.s.u.p.LogUpdateProcessorFactory [collection1] webapp=/solr path=/update params={wt=javabin&version=2}{add=[45]} 0 0
[junit4] 2> 649415 INFO (qtp90603281-95628) [ x:collection1] o.a.s.u.p.LogUpdateProcessorFactory [collection1] webapp=/solr path=/update params={wt=javabin&version=2}{add=[46]} 0 0
[junit4] 2> 649417 INFO (qtp90603281-95626) [ x:collection1] o.a.s.u.p.LogUpdateProcessorFactory [collection1] webapp=/solr path=/update params={wt=javabin&version=2}{add=[47]} 0 0
[junit4] 2> 649419 INFO (qtp90603281-95627) [ x:collection1] o.a.s.u.p.LogUpdateProcessorFactory [collection1] webapp=/solr path=/update params={wt=javabin&version=2}{add=[48]} 0 0
[junit4] 2> 649421 INFO (qtp90603281-95628) [ x:collection1] o.a.s.u.p.LogUpdateProcessorFactory [collection1] webapp=/solr path=/update params={wt=javabin&version=2}{add=[49]} 0 0
[junit4] 2> 649423 INFO (qtp90603281-95626) [ x:collection1] o.a.s.u.p.LogUpdateProcessorFactory [collection1] webapp=/solr path=/update params={wt=javabin&version=2}{add=[50]} 0 0
[junit4] 2> 649425 INFO (qtp90603281-95627) [ x:collection1] o.a.s.u.p.LogUpdateProcessorFactory [collection1] webapp=/solr path=/update params={wt=javabin&version=2}{add=[51]} 0 0
[junit4] 2> 649427 INFO (qtp90603281-95628) [ x:collection1] o.a.s.u.p.LogUpdateProcessorFactory [collection1] webapp=/solr path=/update params={wt=javabin&version=2}{add=[52]} 0 0
[junit4] 2> 649429 INFO (qtp90603281-95626) [ x:collection1] o.a.s.u.p.LogUpdateProcessorFactory [collection1] webapp=/solr path=/update params={wt=javabin&version=2}{add=[53]} 0 0
[junit4] 2> 649431 INFO (qtp90603281-95627) [ x:collection1] o.a.s.u.p.LogUpdateProcessorFactory [collection1] webapp=/solr path=/update params={wt=javabin&version=2}{add=[54]} 0 0
[junit4] 2> 649433 INFO (qtp90603281-95628) [ x:collection1] o.a.s.u.p.LogUpdateProcessorFactory [collection1] webapp=/solr path=/update params={wt=javabin&version=2}{add=[55]} 0 0
[junit4] 2> 649435 INFO (qtp90603281-95626) [ x:collection1] o.a.s.u.p.LogUpdateProcessorFactory [collection1] webapp=/solr path=/update params={wt=javabin&version=2}{add=[56]} 0 0
[junit4] 2> 649437 INFO (qtp90603281-95627) [ x:collection1] o.a.s.u.p.LogUpdateProcessorFactory [collection1] webapp=/solr path=/update params={wt=javabin&version=2}{add=[57]} 0 0
[junit4] 2> 649439 INFO (qtp90603281-95628) [ x:collection1] o.a.s.u.p.LogUpdateProcessorFactory [collection1] webapp=/solr path=/update params={wt=javabin&version=2}{add=[58]} 0 0
[junit4] 2> 649442 INFO (qtp90603281-95626) [ x:collection1] o.a.s.u.p.LogUpdateProcessorFactory [collection1] webapp=/solr path=/update params={wt=javabin&version=2}{add=[59]} 0 0
[junit4] 2> 649444 INFO (qtp90603281-95627) [ x:collection1] o.a.s.u.p.LogUpdateProcessorFactory [collection1] webapp=/solr path=/update params={wt=javabin&version=2}{add=[60]} 0 0
[junit4] 2> 649446 INFO (qtp90603281-95628) [ x:collection1] o.a.s.u.p.LogUpdateProcessorFactory [collection1] webapp=/solr path=/update params={wt=javabin&version=2}{add=[61]} 0 0
[junit4] 2> 649448 INFO (qtp90603281-95626) [ x:collection1] o.a.s.u.p.LogUpdateProcessorFactory [collection1] webapp=/solr path=/update params={wt=javabin&version=2}{add=[62]} 0 0
[junit4] 2> 649450 INFO (qtp90603281-95627) [ x:collection1] o.a.s.u.p.LogUpdateProcessorFactory [collection1] webapp=/solr path=/update params={wt=javabin&version=2}{add=[63]} 0 0
[junit4] 2> 649452 INFO (qtp90603281-95628) [ x:collection1] o.a.s.u.p.LogUpdateProcessorFactory [collection1] webapp=/solr path=/update params={wt=javabin&version=2}{add=[64]} 0 0
[junit4] 2> 649455 INFO (qtp90603281-95626) [ x:collection1] o.a.s.u.p.LogUpdateProcessorFactory [collection1] webapp=/solr path=/update params={wt=javabin&version=2}{add=[65]} 0 0
[junit4] 2> 649457 INFO (qtp90603281-95627) [ x:collection1] o.a.s.u.p.LogUpdateProcessorFactory [collection1] webapp=/solr path=/update params={wt=javabin&version=2}{add=[66]} 0 0
[junit4] 2> 649459 INFO (qtp90603281-95628) [ x:collection1] o.a.s.u.p.LogUpdateProcessorFactory [collection1] webapp=/solr path=/update params={wt=javabin&version=2}{add=[67]} 0 0
[junit4] 2> 649461 INFO (qtp90603281-95626) [ x:collection1] o.a.s.u.p.LogUpdateProcessorFactory [collection1] webapp=/solr path=/update params={wt=javabin&version=2}{add=[68]} 0 0
[junit4] 2> 649462 INFO (qtp90603281-95627) [ x:collection1] o.a.s.u.p.LogUpdateProcessorFactory [collection1] webapp=/solr path=/update params={wt=javabin&version=2}{add=[69]} 0 0
[junit4] 2> 649464 INFO (qtp90603281-95628) [ x:collection1] o.a.s.u.p.LogUpdateProcessorFactory [collection1] webapp=/solr path=/update params={wt=javabin&version=2}{add=[70]} 0 0
[junit4] 2> 649467 INFO (qtp90603281-95626) [ x:collection1] o.a.s.u.p.LogUpdateProcessorFactory [collection1] webapp=/solr path=/update params={wt=javabin&version=2}{add=[71]} 0 0
[junit4] 2> 649469 INFO (qtp90603281-95627) [ x:collection1] o.a.s.u.p.LogUpdateProcessorFactory [collection1] webapp=/solr path=/update params={wt=javabin&version=2}{add=[72]} 0 0
[junit4] 2> 649471 INFO (qtp90603281-95628) [ x:collection1] o.a.s.u.p.LogUpdateProcessorFactory [collection1] webapp=/solr path=/update params={wt=javabin&version=2}{add=[73]} 0 0
[junit4] 2> 649473 INFO (qtp90603281-95626) [ x:collection1] o.a.s.u.p.LogUpdateProcessorFactory [collection1] webapp=/solr path=/update params={wt=javabin&version=2}{add=[74]} 0 0
[junit4] 2> 649475 INFO (qtp90603281-95627) [ x:collection1] o.a.s.u.p.LogUpdateProcessorFactory [collection1] webapp=/solr path=/update params={wt=javabin&version=2}{add=[75]} 0 0
[junit4] 2> 649477 INFO (qtp90603281-95628) [ x:collection1] o.a.s.u.p.LogUpdateProcessorFactory [collection1] webapp=/solr path=/update params={wt=javabin&version=2}{add=[76]} 0 0
[junit4] 2> 649479 INFO (qtp90603281-95626) [ x:collection1] o.a.s.u.p.LogUpdateProcessorFactory [collection1] webapp=/solr path=/update params={wt=javabin&version=2}{add=[77]} 0 0
[junit4] 2> 649481 INFO (qtp90603281-95627) [ x:collection1] o.a.s.u.p.LogUpdateProcessorFactory [collection1] webapp=/solr path=/update params={wt=javabin&version=2}{add=[78]} 0 0
[junit4] 2> 649483 INFO (qtp90603281-95628) [ x:collection1] o.a.s.u.p.LogUpdateProcessorFactory [collection1] webapp=/solr path=/update params={wt=javabin&version=2}{add=[79]} 0 0
[junit4] 2> 649485 INFO (qtp90603281-95626) [ x:collection1] o.a.s.u.p.LogUpdateProcessorFactory [collection1] webapp=/solr path=/update params={wt=javabin&version=2}{add=[80]} 0 0
[junit4] 2> 649487 INFO (qtp90603281-95627) [ x:collection1] o.a.s.u.p.LogUpdateProcessorFactory [collection1] webapp=/solr path=/update params={wt=javabin&version=2}{add=[81]} 0 0
[junit4] 2> 649489 INFO (qtp90603281-95628) [ x:collection1] o.a.s.u.p.LogUpdateProcessorFactory [collection1] webapp=/solr path=/update params={wt=javabin&version=2}{add=[82]} 0 0
[junit4] 2> 649491 INFO (qtp90603281-95626) [ x:collection1] o.a.s.u.p.LogUpdateProcessorFactory [collection1] webapp=/solr path=/update params={wt=javabin&version=2}{add=[83]} 0 0
[junit4] 2> 649493 INFO (qtp90603281-95627) [ x:collection1] o.a.s.u.p.LogUpdateProcessorFactory [collection1] webapp=/solr path=/update params={wt=javabin&version=2}{add=[84]} 0 0
[junit4] 2> 649495 INFO (qtp90603281-95628) [ x:collection1] o.a.s.u.p.LogUpdateProcessorFactory [collection1] webapp=/solr path=/update params={wt=javabin&version=2}{add=[85]} 0 0
[junit4] 2> 649497 INFO (qtp90603281-95626) [ x:collection1] o.a.s.u.p.LogUpdateProcessorFactory [collection1] webapp=/solr path=/update params={wt=javabin&version=2}{add=[86]} 0 0
[junit4] 2> 649499 INFO (qtp90603281-95627) [ x:collection1] o.a.s.u.p.LogUpdateProcessorFactory [collection1] webapp=/solr path=/update params={wt=javabin&version=2}{add=[87]} 0 0
[junit4] 2> 649501 INFO (qtp90603281-95628) [ x:collection1] o.a.s.u.p.LogUpdateProcessorFactory [collection1] webapp=/solr path=/update params={wt=javabin&version=2}{add=[88]} 0 0
[junit4] 2> 649504 INFO (qtp90603281-95626) [ x:collection1] o.a.s.u.p.LogUpdateProcessorFactory [collection1] webapp=/solr path=/update params={wt=javabin&version=2}{add=[89]} 0 0
[junit4] 2> 649506 INFO (qtp90603281-95627) [ x:collection1] o.a.s.u.p.LogUpdateProcessorFactory [collection1] webapp=/solr path=/update params={wt=javabin&version=2}{add=[90]} 0 0
[junit4] 2> 649508 INFO (qtp90603281-95628) [ x:collection1] o.a.s.u.p.LogUpdateProcessorFactory [collection1] webapp=/solr path=/update params={wt=javabin&version=2}{add=[91]} 0 0
[junit4] 2> 649510 INFO (qtp90603281-95626) [ x:collection1] o.a.s.u.p.LogUpdateProcessorFactory [collection1] webapp=/solr path=/update params={wt=javabin&version=2}{add=[92]} 0 0
[junit4] 2> 649512 INFO (qtp90603281-95627) [ x:collection1] o.a.s.u.p.LogUpdateProcessorFactory [collection1] webapp=/solr path=/update params={wt=javabin&version=2}{add=[93]} 0 0
[junit4] 2> 649515 INFO (qtp90603281-95628) [ x:collection1] o.a.s.u.p.LogUpdateProcessorFactory [collection1] webapp=/solr path=/update params={wt=javabin&version=2}{add=[94]} 0 0
[junit4] 2> 649517 INFO (qtp90603281-95626) [ x:collection1] o.a.s.u.p.LogUpdateProcessorFactory [collection1] webapp=/solr path=/update params={wt=javabin&version=2}{add=[95]} 0 0
[junit4] 2> 649519 INFO (qtp90603281-95627) [ x:collection1] o.a.s.u.p.LogUpdateProcessorFactory [collection1] webapp=/solr path=/update params={wt=javabin&version=2}{add=[96]} 0 0
[junit4] 2> 649521 INFO (qtp90603281-95628) [ x:collection1] o.a.s.u.p.LogUpdateProcessorFactory [collection1] webapp=/solr path=/update params={wt=javabin&version=2}{add=[97]} 0 0
[junit4] 2> 649523 INFO (qtp90603281-95626) [ x:collection1] o.a.s.u.p.LogUpdateProcessorFactory [collection1] webapp=/solr path=/update params={wt=javabin&version=2}{add=[98]} 0 0
[junit4] 2> 649525 INFO (qtp90603281-95627) [ x:collection1] o.a.s.u.p.LogUpdateProcessorFactory [collection1] webapp=/solr path=/update params={wt=javabin&version=2}{add=[99]} 0 0
[junit4] 2> 649527 INFO (qtp90603281-95628) [ x:collection1] o.a.s.u.p.LogUpdateProcessorFactory [collection1] webapp=/solr path=/update params={wt=javabin&version=2}{add=[100]} 0 0
[junit4] 2> 649529 INFO (qtp90603281-95626) [ x:collection1] o.a.s.u.p.LogUpdateProcessorFactory [collection1] webapp=/solr path=/update params={wt=javabin&version=2}{add=[101]} 0 0
[junit4] 2> 649531 INFO (qtp90603281-95627) [ x:collection1] o.a.s.u.p.LogUpdateProcessorFactory [collection1] webapp=/solr path=/update params={wt=javabin&version=2}{add=[102]} 0 0
[junit4] 2> 649533 INFO (qtp90603281-95628) [ x:collection1] o.a.s.u.p.LogUpdateProcessorFactory [collection1] webapp=/solr path=/update params={wt=javabin&version=2}{add=[103]} 0 0
[junit4] 2> 649535 INFO (qtp90603281-95626) [ x:collection1] o.a.s.u.p.LogUpdateProcessorFactory [collection1] webapp=/solr path=/update params={wt=javabin&version=2}{add=[104]} 0 0
[junit4] 2> 649537 INFO (qtp90603281-95627) [ x:collection1] o.a.s.u.p.LogUpdateProcessorFactory [collection1] webapp=/solr path=/update params={wt=javabin&version=2}{add=[105]} 0 0
[junit4] 2> 649539 INFO (qtp90603281-95628) [ x:collection1] o.a.s.u.p.LogUpdateProcessorFactory [collection1] webapp=/solr path=/update params={wt=javabin&version=2}{add=[106]} 0 0
[junit4] 2> 649541 INFO (qtp90603281-95626) [ x:collection1] o.a.s.u.p.LogUpdateProcessorFactory [collection1] webapp=/solr path=/update params={wt=javabin&version=2}{add=[107]} 0 0
[junit4] 2> 649543 INFO (qtp90603281-95627) [ x:collection1] o.a.s.u.p.LogUpdateProcessorFactory [collection1] webapp=/solr path=/update params={wt=javabin&version=2}{add=[108]} 0 0
[junit4] 2> 649545 INFO (qtp90603281-95628) [ x:collection1] o.a.s.u.p.LogUpdateProcessorFactory [collection1] webapp=/solr path=/update params={wt=javabin&version=2}{add=[109]} 0 0
[junit4] 2> 649547 INFO (qtp90603281-95626) [ x:collection1] o.a.s.u.p.LogUpdateProcessorFactory [collection1] webapp=/solr path=/update params={wt=javabin&version=2}{add=[110]} 0 0
[junit4] 2> 649549 INFO (qtp90603281-95627) [ x:collection1] o.a.s.u.p.LogUpdateProcessorFactory [collection1] webapp=/solr path=/update params={wt=javabin&version=2}{add=[111]} 0 0
[junit4] 2> 649551 INFO (qtp90603281-95628) [ x:collection1] o.a.s.u.p.LogUpdateProcessorFactory [collection1] webapp=/solr path=/update params={wt=javabin&version=2}{add=[112]} 0 0
[junit4] 2> 649553 INFO (qtp90603281-95626) [ x:collection1] o.a.s.u.p.LogUpdateProcessorFactory [collection1] webapp=/solr path=/update params={wt=javabin&version=2}{add=[113]} 0 0
[junit4] 2> 649555 INFO (qtp90603281-95627) [ x:collection1] o.a.s.u.p.LogUpdateProcessorFactory [collection1] webapp=/solr path=/update params={wt=javabin&version=2}{add=[114]} 0 0
[junit4] 2> 649557 INFO (qtp90603281-95628) [ x:collection1] o.a.s.u.p.LogUpdateProcessorFactory [collection1] webapp=/solr path=/update params={wt=javabin&version=2}{add=[115]} 0 0
[junit4] 2> 649559 INFO (qtp90603281-95626) [ x:collection1] o.a.s.u.p.LogUpdateProcessorFactory [collection1] webapp=/solr path=/update params={wt=javabin&version=2}{add=[116]} 0 0
[junit4] 2> 649561 INFO (qtp90603281-95627) [ x:collection1] o.a.s.u.p.LogUpdateProcessorFactory [collection1] webapp=/solr path=/update params={wt=javabin&version=2}{add=[117]} 0 0
[junit4] 2> 649563 INFO (qtp90603281-95628) [ x:collection1] o.a.s.u.p.LogUpdateProcessorFactory [collection1] webapp=/solr path=/update params={wt=javabin&version=2}{add=[118]} 0 0
[junit4] 2> 649565 INFO (qtp90603281-95626) [ x:collection1] o.a.s.u.p.LogUpdateProcessorFactory [collection1] webapp=/solr path=/update params={wt=javabin&version=2}{add=[119]} 0 0
[junit4] 2> 649567 INFO (qtp90603281-95627) [ x:collection1] o.a.s.u.p.LogUpdateProcessorFactory [collection1] webapp=/solr path=/update params={wt=javabin&version=2}{add=[120]} 0 0
[junit4] 2> 649569 INFO (qtp90603281-95628) [ x:collection1] o.a.s.u.p.LogUpdateProcessorFactory [collection1] webapp=/solr path=/update params={wt=javabin&version=2}{add=[121]} 0 0
[junit4] 2> 649571 INFO (qtp90603281-95626) [ x:collection1] o.a.s.u.p.LogUpdateProcessorFactory [collection1] webapp=/solr path=/update params={wt=javabin&version=2}{add=[122]} 0 0
[junit4] 2> 649573 INFO (qtp90603281-95627) [ x:collection1] o.a.s.u.p.LogUpdateProcessorFactory [collection1] webapp=/solr path=/update params={wt=javabin&version=2}{add=[123]} 0 0
[junit4] 2> 649575 INFO (qtp90603281-95628) [ x:collection1] o.a.s.u.p.LogUpdateProcessorFactory [collection1] webapp=/solr path=/update params={wt=javabin&version=2}{add=[124]} 0 0
[junit4] 2> 649577 INFO (qtp90603281-95626) [ x:collection1] o.a.s.u.p.LogUpdateProcessorFactory [collection1] webapp=/solr path=/update params={wt=javabin&version=2}{add=[125]} 0 0
[junit4] 2> 649579 INFO (qtp90603281-95627) [ x:collection1] o.a.s.u.p.LogUpdateProcessorFactory [collection1] webapp=/solr path=/update params={wt=javabin&version=2}{add=[126]} 0 0
[junit4] 2> 649581 INFO (qtp90603281-95628) [ x:collection1] o.a.s.u.p.LogUpdateProcessorFactory [collection1] webapp=/solr path=/update params={wt=javabin&version=2}{add=[127]} 0 0
[junit4] 2> 649584 INFO (qtp90603281-95626) [ x:collection1] o.a.s.u.p.LogUpdateProcessorFactory [collection1] webapp=/solr path=/update params={wt=javabin&version=2}{add=[128]} 0 0
[junit4] 2> 649586 INFO (qtp90603281-95627) [ x:collection1] o.a.s.u.p.LogUpdateProcessorFactory [collection1] webapp=/solr path=/update params={wt=javabin&version=2}{add=[129]} 0 0
[junit4] 2> 649588 INFO (qtp90603281-95628) [ x:collection1] o.a.s.u.p.LogUpdateProcessorFactory [collection1] webapp=/solr path=/update params={wt=javabin&version=2}{add=[130]} 0 0
[junit4] 2> 649590 INFO (qtp90603281-95626) [ x:collection1] o.a.s.u.p.LogUpdateProcessorFactory [collection1] webapp=/solr path=/update params={wt=javabin&version=2}{add=[131]} 0 0
[junit4] 2> 649592 INFO (qtp90603281-95627) [ x:collection1] o.a.s.u.p.LogUpdateProcessorFactory [collection1] webapp=/solr path=/update params={wt=javabin&version=2}{add=[132]} 0 0
[junit4] 2> 649595 INFO (qtp90603281-95628) [ x:collection1] o.a.s.u.p.LogUpdateProcessorFactory [collection1] webapp=/solr path=/update params={wt=javabin&version=2}{add=[133]} 0 0
[junit4] 2> 649596 INFO (qtp90603281-95626) [ x:collection1] o.a.s.u.p.LogUpdateProcessorFactory [collection1] webapp=/solr path=/update params={wt=javabin&version=2}{add=[134]} 0 0
[junit4] 2> 649599 INFO (qtp90603281-95627) [ x:collection1] o.a.s.u.p.LogUpdateProcessorFactory [collection1] webapp=/solr path=/update params={wt=javabin&version=2}{add=[135]} 0 0
[junit4] 2> 649601 INFO (qtp90603281-95628) [ x:collection1] o.a.s.u.p.LogUpdateProcessorFactory [collection1] webapp=/solr path=/update params={wt=javabin&version=2}{add=[136]} 0 0
[junit4] 2> 649603 INFO (qtp90603281-95626) [ x:collection1] o.a.s.u.p.LogUpdateProcessorFactory [collection1] webapp=/solr path=/update params={wt=javabin&version=2}{add=[137]} 0 0
[junit4] 2> 649605 INFO (qtp90603281-95627) [ x:collection1] o.a.s.u.p.LogUpdateProcessorFactory [collection1] webapp=/solr path=/update params={wt=javabin&version=2}{add=[138]} 0 0
[junit4] 2> 649607 INFO (qtp90603281-95628) [ x:collection1] o.a.s.u.p.LogUpdateProcessorFactory [collection1] webapp=/solr path=/update params={wt=javabin&version=2}{add=[139]} 0 0
[junit4] 2> 649609 INFO (qtp90603281-95626) [ x:collection1] o.a.s.u.p.LogUpdateProcessorFactory [collection1] webapp=/solr path=/update params={wt=javabin&version=2}{add=[140]} 0 0
[junit4] 2> 649611 INFO (qtp90603281-95627) [ x:collection1] o.a.s.u.p.LogUpdateProcessorFactory [collection1] webapp=/solr path=/update params={wt=javabin&version=2}{add=[141]} 0 0
[junit4] 2> 649613 INFO (qtp90603281-95628) [ x:collection1] o.a.s.u.p.LogUpdateProcessorFactory [collection1] webapp=/solr path=/update params={wt=javabin&version=2}{add=[142]} 0 0
[junit4] 2> 649616 INFO (qtp90603281-95626) [ x:collection1] o.a.s.u.p.LogUpdateProcessorFactory [collection1] webapp=/solr path=/update params={wt=javabin&version=2}{add=[143]} 0 0
[junit4] 2> 649618 INFO (qtp90603281-95627) [ x:collection1] o.a.s.u.p.LogUpdateProcessorFactory [collection1] webapp=/solr path=/update params={wt=javabin&version=2}{add=[144]} 0 0
[junit4] 2> 649620 INFO (qtp90603281-95628) [ x:collection1] o.a.s.u.p.LogUpdateProcessorFactory [collection1] webapp=/solr path=/update params={wt=javabin&version=2}{add=[145]} 0 0
[junit4] 2> 649622 INFO (qtp90603281-95626) [ x:collection1] o.a.s.u.p.LogUpdateProcessorFactory [collection1] webapp=/solr path=/update params={wt=javabin&version=2}{add=[146]} 0 0
[junit4] 2> 649624 INFO (qtp90603281-95627) [ x:collection1] o.a.s.u.p.LogUpdateProcessorFactory [collection1] webapp=/solr path=/update params={wt=javabin&version=2}{add=[147]} 0 0
[junit4] 2> 649626 INFO (qtp90603281-95628) [ x:collection1] o.a.s.u.p.LogUpdateProcessorFactory [collection1] webapp=/solr path=/update params={wt=javabin&version=2}{add=[148]} 0 0
[junit4] 2> 649628 INFO (qtp90603281-95626) [ x:collection1] o.a.s.u.p.LogUpdateProcessorFactory [collection1] webapp=/solr path=/update params={wt=javabin&version=2}{add=[149]} 0 0
[junit4] 2> 649630 INFO (qtp90603281-95627) [ x:collection1] o.a.s.u.p.LogUpdateProcessorFactory [collection1] webapp=/solr path=/update params={wt=javabin&version=2}{add=[150]} 0 0
[junit4] 2> 649632 INFO (qtp90603281-95628) [ x:collection1] o.a.s.u.p.LogUpdateProcessorFactory [collection1] webapp=/solr path=/update params={wt=javabin&version=2}{add=[151]} 0 0
[junit4] 2> 649635 INFO (qtp90603281-95626) [ x:collection1] o.a.s.u.p.LogUpdateProcessorFactory [collection1] webapp=/solr path=/update params={wt=javabin&version=2}{add=[152]} 0 0
[junit4] 2> 649637 INFO (qtp90603281-95627) [ x:collection1] o.a.s.u.p.LogUpdateProcessorFactory [collection1] webapp=/solr path=/update params={wt=javabin&version=2}{add=[153]} 0 0
[junit4] 2> 649639 INFO (qtp90603281-95628) [ x:collection1] o.a.s.u.p.LogUpdateProcessorFactory [collection1] webapp=/solr path=/update params={wt=javabin&version=2}{add=[154]} 0 0
[junit4] 2> 649641 INFO (qtp90603281-95626) [ x:collection1] o.a.s.u.p.LogUpdateProcessorFactory [collection1] webapp=/solr path=/update params={wt=javabin&version=2}{add=[155]} 0 0
[junit4] 2> 649643 INFO (qtp90603281-95627) [ x:collection1] o.a.s.u.p.LogUpdateProcessorFactory [collection1] webapp=/solr path=/update params={wt=javabin&version=2}{add=[156]} 0 0
[junit4] 2> 649645 INFO (qtp90603281-95628) [ x:collection1] o.a.s.u.p.LogUpdateProcessorFactory [collection1] webapp=/solr path=/update params={wt=javabin&version=2}{add=[157]} 0 0
[junit4] 2> 649647 INFO (qtp90603281-95626) [ x:collection1] o.a.s.u.p.LogUpdateProcessorFactory [collection1] webapp=/solr path=/update params={wt=javabin&version=2}{add=[158]} 0 0
[junit4] 2> 649649 INFO (qtp90603281-95627) [ x:collection1] o.a.s.u.p.LogUpdateProcessorFactory [collection1] webapp=/solr path=/update params={wt=javabin&version=2}{add=[159]} 0 0
[junit4] 2> 649651 INFO (qtp90603281-95628) [ x:collection1] o.a.s.u.p.LogUpdateProcessorFactory [collection1] webapp=/solr path=/update params={wt=javabin&version=2}{add=[160]} 0 0
[junit4] 2> 649653 INFO (qtp90603281-95626) [ x:collection1] o.a.s.u.p.LogUpdateProcessorFactory [collection1] webapp=/solr path=/update params={wt=javabin&version=2}{add=[161]} 0 0
[junit4] 2> 649655 INFO (qtp90603281-95627) [ x:collection1] o.a.s.u.p.LogUpdateProcessorFactory [collection1] webapp=/solr path=/update params={wt=javabin&version=2}{add=[162]} 0 0
[junit4] 2> 649657 INFO (qtp90603281-95628) [ x:collection1] o.a.s.u.p.LogUpdateProcessorFactory [collection1] webapp=/solr path=/update params={wt=javabin&version=2}{add=[163]} 0 0
[junit4] 2> 649659 INFO (qtp90603281-95626) [ x:collection1] o.a.s.u.p.LogUpdateProcessorFactory [collection1] webapp=/solr path=/update params={wt=javabin&version=2}{add=[164]} 0 0
[junit4] 2> 649661 INFO (qtp90603281-95627) [ x:collection1] o.a.s.u.p.LogUpdateProcessorFactory [collection1] webapp=/solr path=/update params={wt=javabin&version=2}{add=[165]} 0 0
[junit4] 2> 649663 INFO (qtp90603281-95628) [ x:collection1] o.a.s.u.p.LogUpdateProcessorFactory [collection1] webapp=/solr path=/update params={wt=javabin&version=2}{add=[166]} 0 0
[junit4] 2> 649665 INFO (qtp90603281-95626) [ x:collection1] o.a.s.u.p.LogUpdateProcessorFactory [collection1] webapp=/solr path=/update params={wt=javabin&version=2}{add=[167]} 0 0
[junit4] 2> 649668 INFO (qtp90603281-95627) [ x:collection1] o.a.s.u.p.LogUpdateProcessorFactory [collection1] webapp=/solr path=/update params={wt=javabin&version=2}{add=[168]} 0 0
[junit4] 2> 649670 INFO (qtp90603281-95628) [ x:collection1] o.a.s.u.p.LogUpdateProcessorFactory [collection1] webapp=/solr path=/update params={wt=javabin&version=2}{add=[169]} 0 0
[junit4] 2> 649672 INFO (qtp90603281-95626) [ x:collection1] o.a.s.u.p.LogUpdateProcessorFactory [collection1] webapp=/solr path=/update params={wt=javabin&version=2}{add=[170]} 0 0
[junit4] 2> 649674 INFO (qtp90603281-95627) [ x:collection1] o.a.s.u.p.LogUpdateProcessorFactory [collection1] webapp=/solr path=/update params={wt=javabin&version=2}{add=[171]} 0 0
[junit4] 2> 649676 INFO (qtp90603281-95628) [ x:collection1] o.a.s.u.p.LogUpdateProcessorFactory [collection1] webapp=/solr path=/update params={wt=javabin&version=2}{add=[172]} 0 0
[junit4] 2> 649678 INFO (qtp90603281-95626) [ x:collection1] o.a.s.u.p.LogUpdateProcessorFactory [collection1] webapp=/solr path=/update params={wt=javabin&version=2}{add=[173]} 0 0
[junit4] 2> 649680 INFO (qtp90603281-95627) [ x:collection1] o.a.s.u.p.LogUpdateProcessorFactory [collection1] webapp=/solr path=/update params={wt=javabin&version=2}{add=[174]} 0 0
[junit4] 2> 649683 INFO (qtp90603281-95628) [ x:collection1] o.a.s.u.p.LogUpdateProcessorFactory [collection1] webapp=/solr path=/update params={wt=javabin&version=2}{add=[175]} 0 0
[junit4] 2> 649685 INFO (qtp90603281-95626) [ x:collection1] o.a.s.u.p.LogUpdateProcessorFactory [collection1] webapp=/solr path=/update params={wt=javabin&version=2}{add=[176]} 0 0
[junit4] 2> 649687 INFO (qtp90603281-95627) [ x:collection1] o.a.s.u.p.LogUpdateProcessorFactory [collection1] webapp=/solr path=/update params={wt=javabin&version=2}{add=[177]} 0 0
[junit4] 2> 649689 INFO (qtp90603281-95628) [ x:collection1] o.a.s.u.p.LogUpdateProcessorFactory [collection1] webapp=/solr path=/update params={wt=javabin&version=2}{add=[178]} 0 0
[junit4] 2> 649691 INFO (qtp90603281-95626) [ x:collection1] o.a.s.u.p.LogUpdateProcessorFactory [collection1] webapp=/solr path=/update params={wt=javabin&version=2}{add=[179]} 0 0
[junit4] 2> 649693 INFO (qtp90603281-95627) [ x:collection1] o.a.s.u.p.LogUpdateProcessorFactory [collection1] webapp=/solr path=/update params={wt=javabin&version=2}{add=[180]} 0 0
[junit4] 2> 649695 INFO (qtp90603281-95628) [ x:collection1] o.a.s.u.p.LogUpdateProcessorFactory [collection1] webapp=/solr path=/update params={wt=javabin&version=2}{add=[181]} 0 0
[junit4] 2> 649698 INFO (qtp90603281-95626) [ x:collection1] o.a.s.u.p.LogUpdateProcessorFactory [collection1] webapp=/solr path=/update params={wt=javabin&version=2}{add=[182]} 0 0
[junit4] 2> 649700 INFO (qtp90603281-95627) [ x:collection1] o.a.s.u.p.LogUpdateProcessorFactory [collection1] webapp=/solr path=/update params={wt=javabin&version=2}{add=[183]} 0 0
[junit4] 2> 649702 INFO (qtp90603281-95628) [ x:collection1] o.a.s.u.p.LogUpdateProcessorFactory [collection1] webapp=/solr path=/update params={wt=javabin&version=2}{add=[184]} 0 0
[junit4] 2> 649704 INFO (qtp90603281-95626) [ x:collection1] o.a.s.u.p.LogUpdateProcessorFactory [collection1] webapp=/solr path=/update params={wt=javabin&version=2}{add=[185]} 0 0
[junit4] 2> 649707 INFO (qtp90603281-95627) [ x:collection1] o.a.s.u.p.LogUpdateProcessorFactory [collection1] webapp=/solr path=/update params={wt=javabin&version=2}{add=[186]} 0 0
[junit4] 2> 649709 INFO (qtp90603281-95628) [ x:collection1] o.a.s.u.p.LogUpdateProcessorFactory [collection1] webapp=/solr path=/update params={wt=javabin&version=2}{add=[187]} 0 0
[junit4] 2> 649711 INFO (qtp90603281-95626) [ x:collection1] o.a.s.u.p.LogUpdateProcessorFactory [collection1] webapp=/solr path=/update params={wt=javabin&version=2}{add=[188]} 0 0
[junit4] 2> 649713 INFO (qtp90603281-95627) [ x:collection1] o.a.s.u.p.LogUpdateProcessorFactory [collection1] webapp=/solr path=/update params={wt=javabin&version=2}{add=[189]} 0 0
[junit4] 2> 649716 INFO (qtp90603281-95628) [ x:collection1] o.a.s.u.p.LogUpdateProcessorFactory [collection1] webapp=/solr path=/update params={wt=javabin&version=2}{add=[190]} 0 0
[junit4] 2> 649717 INFO (qtp90603281-95626) [ x:collection1] o.a.s.c.S.Request [collection1] webapp=/solr path=/replication params={wt=javabin&version=2&qt=/replication&command=indexversion} status=0 QTime=0
[junit4] 2> 649718 INFO (qtp90603281-95627) [ x:collection1] o.a.s.u.p.LogUpdateProcessorFactory [collection1] webapp=/solr path=/update params={wt=javabin&version=2}{add=[191]} 0 0
[junit4] 2> 649720 INFO (qtp90603281-95628) [ x:collection1] o.a.s.u.p.LogUpdateProcessorFactory [collection1] webapp=/solr path=/update params={wt=javabin&version=2}{add=[192]} 0 0
[junit4] 2> 649722 INFO (qtp90603281-95626) [ x:collection1] o.a.s.u.p.LogUpdateProcessorFactory [collection1] webapp=/solr path=/update params={wt=javabin&version=2}{add=[193]} 0 0
[junit4] 2> 649724 INFO (qtp90603281-95627) [ x:collection1] o.a.s.u.p.LogUpdateProcessorFactory [collection1] webapp=/solr path=/update params={wt=javabin&version=2}{add=[194]} 0 0
[junit4] 2> 649727 INFO (qtp90603281-95628) [ x:collection1] o.a.s.u.p.LogUpdateProcessorFactory [collection1] webapp=/solr path=/update params={wt=javabin&version=2}{add=[195]} 0 0
[junit4] 2> 649729 INFO (qtp90603281-95626) [ x:collection1] o.a.s.u.p.LogUpdateProcessorFactory [collection1] webapp=/solr path=/update params={wt=javabin&version=2}{add=[196]} 0 0
[junit4] 2> 649731 INFO (qtp90603281-95627) [ x:collection1] o.a.s.u.p.LogUpdateProcessorFactory [collection1] webapp=/solr path=/update params={wt=javabin&version=2}{add=[197]} 0 0
[junit4] 2> 649733 INFO (qtp90603281-95628) [ x:collection1] o.a.s.u.p.LogUpdateProcessorFactory [collection1] webapp=/solr path=/update params={wt=javabin&version=2}{add=[198]} 0 0
[junit4] 2> 649735 INFO (qtp90603281-95626) [ x:collection1] o.a.s.u.p.LogUpdateProcessorFactory [collection1] webapp=/solr path=/update params={wt=javabin&version=2}{add=[199]} 0 0
[junit4] 2> 649737 INFO (qtp90603281-95627) [ x:collection1] o.a.s.u.p.LogUpdateProcessorFactory [collection1] webapp=/solr path=/update params={wt=javabin&version=2}{add=[200]} 0 0
[junit4] 2> 649739 INFO (qtp90603281-95628) [ x:collection1] o.a.s.u.p.LogUpdateProcessorFactory [collection1] webapp=/solr path=/update params={wt=javabin&version=2}{add=[201]} 0 0
[junit4] 2> 649741 INFO (qtp90603281-95626) [ x:collection1] o.a.s.u.p.LogUpdateProcessorFactory [collection1] webapp=/solr path=/update params={wt=javabin&version=2}{add=[202]} 0 0
[junit4] 2> 649743 INFO (qtp90603281-95627) [ x:collection1] o.a.s.u.p.LogUpdateProcessorFactory [collection1] webapp=/solr path=/update params={wt=javabin&version=2}{add=[203]} 0 0
[junit4] 2> 649745 INFO (qtp90603281-95628) [ x:collection1] o.a.s.u.p.LogUpdateProcessorFactory [collection1] webapp=/solr path=/update params={wt=javabin&version=2}{add=[204]} 0 0
[junit4] 2> 649747 INFO (qtp90603281-95626) [ x:collection1] o.a.s.u.p.LogUpdateProcessorFactory [collection1] webapp=/solr path=/update params={wt=javabin&version=2}{add=[205]} 0 0
[junit4] 2> 649749 INFO (qtp90603281-95627) [ x:collection1] o.a.s.u.p.LogUpdateProcessorFactory [collection1] webapp=/solr path=/update params={wt=javabin&version=2}{add=[206]} 0 0
[junit4] 2> 649751 INFO (qtp90603281-95628) [ x:collection1] o.a.s.u.p.LogUpdateProcessorFactory [collection1] webapp=/solr path=/update params={wt=javabin&version=2}{add=[207]} 0 0
[junit4] 2> 649753 INFO (qtp90603281-95626) [ x:collection1] o.a.s.u.p.LogUpdateProcessorFactory [collection1] webapp=/solr path=/update params={wt=javabin&version=2}{add=[208]} 0 0
[junit4] 2> 649755 INFO (qtp90603281-95627) [ x:collection1] o.a.s.u.p.LogUpdateProcessorFactory [collection1] webapp=/solr path=/update params={wt=javabin&version=2}{add=[209]} 0 0
[junit4] 2> 649757 INFO (qtp90603281-95628) [ x:collection1] o.a.s.u.p.LogUpdateProcessorFactory [collection1] webapp=/solr path=/update params={wt=javabin&version=2}{add=[210]} 0 0
[junit4] 2> 649759 INFO (qtp90603281-95626) [ x:collection1] o.a.s.u.p.LogUpdateProcessorFactory [collection1] webapp=/solr path=/update params={wt=javabin&version=2}{add=[211]} 0 0
[junit4] 2> 649761 INFO (qtp90603281-95627) [ x:collection1] o.a.s.u.p.LogUpdateProcessorFactory [collection1] webapp=/solr path=/update params={wt=javabin&version=2}{add=[212]} 0 0
[junit4] 2> 649763 INFO (qtp90603281-95628) [ x:collection1] o.a.s.u.p.LogUpdateProcessorFactory [collection1] webapp=/solr path=/update params={wt=javabin&version=2}{add=[213]} 0 0
[junit4] 2> 649765 INFO (qtp90603281-95626) [ x:collection1] o.a.s.u.p.LogUpdateProcessorFactory [collection1] webapp=/solr path=/update params={wt=javabin&version=2}{add=[214]} 0 0
[junit4] 2> 649767 INFO (qtp90603281-95627) [ x:collection1] o.a.s.u.p.LogUpdateProcessorFactory [collection1] webapp=/solr path=/update params={wt=javabin&version=2}{add=[215]} 0 0
[junit4] 2> 649769 INFO (qtp90603281-95628) [ x:collection1] o.a.s.u.p.LogUpdateProcessorFactory [collection1] webapp=/solr path=/update params={wt=javabin&version=2}{add=[216]} 0 0
[junit4] 2> 649771 INFO (qtp90603281-95626) [ x:collection1] o.a.s.u.p.LogUpdateProcessorFactory [collection1] webapp=/solr path=/update params={wt=javabin&version=2}{add=[217]} 0 0
[junit4] 2> 649773 INFO (qtp90603281-95627) [ x:collection1] o.a.s.u.p.LogUpdateProcessorFactory [collection1] webapp=/solr path=/update params={wt=javabin&version=2}{add=[218]} 0 0
[junit4] 2> 649775 INFO (qtp90603281-95628) [ x:collection1] o.a.s.u.p.LogUpdateProcessorFactory [collection1] webapp=/solr path=/update params={wt=javabin&version=2}{add=[219]} 0 0
[junit4] 2> 649777 INFO (qtp90603281-95626) [ x:collection1] o.a.s.u.p.LogUpdateProcessorFactory [collection1] webapp=/solr path=/update params={wt=javabin&version=2}{add=[220]} 0 0
[junit4] 2> 649779 INFO (qtp90603281-95627) [ x:collection1] o.a.s.u.p.LogUpdateProcessorFactory [collection1] webapp=/solr path=/update params={wt=javabin&version=2}{add=[221]} 0 0
[junit4] 2> 649781 INFO (qtp90603281-95628) [ x:collection1] o.a.s.u.p.LogUpdateProcessorFactory [collection1] webapp=/solr path=/update params={wt=javabin&version=2}{add=[222]} 0 0
[junit4] 2> 649783 INFO (qtp90603281-95626) [ x:collection1] o.a.s.u.p.LogUpdateProcessorFactory [collection1] webapp=/solr path=/update params={wt=javabin&version=2}{add=[223]} 0 0
[junit4] 2> 649785 INFO (qtp90603281-95627) [ x:collection1] o.a.s.u.p.LogUpdateProcessorFactory [collection1] webapp=/solr path=/update params={wt=javabin&version=2}{add=[224]} 0 0
[junit4] 2> 649787 INFO (qtp90603281-95628) [ x:collection1] o.a.s.u.p.LogUpdateProcessorFactory [collection1] webapp=/solr path=/update params={wt=javabin&version=2}{add=[225]} 0 0
[junit4] 2> 649789 INFO (qtp90603281-95626) [ x:collection1] o.a.s.u.p.LogUpdateProcessorFactory [collection1] webapp=/solr path=/update params={wt=javabin&version=2}{add=[226]} 0 0
[junit4] 2> 649791 INFO (qtp90603281-95627) [ x:collection1] o.a.s.u.p.LogUpdateProcessorFactory [collection1] webapp=/solr path=/update params={wt=javabin&version=2}{add=[227]} 0 0
[junit4] 2> 649793 INFO (qtp90603281-95628) [ x:collection1] o.a.s.u.p.LogUpdateProcessorFactory [collection1] webapp=/solr path=/update params={wt=javabin&version=2}{add=[228]} 0 0
[junit4] 2> 649795 INFO (qtp90603281-95626) [ x:collection1] o.a.s.u.p.LogUpdateProcessorFactory [collection1] webapp=/solr path=/update params={wt=javabin&version=2}{add=[229]} 0 0
[junit4] 2> 649797 INFO (qtp90603281-95627) [ x:collection1] o.a.s.u.p.LogUpdateProcessorFactory [collection1] webapp=/solr path=/update params={wt=javabin&version=2}{add=[230]} 0 0
[junit4] 2> 649799 INFO (qtp90603281-95628) [ x:collection1] o.a.s.u.p.LogUpdateProcessorFactory [collection1] webapp=/solr path=/update params={wt=javabin&version=2}{add=[231]} 0 0
[junit4] 2> 649801 INFO (qtp90603281-95626) [ x:collection1] o.a.s.u.p.LogUpdateProcessorFactory [collection1] webapp=/solr path=/update params={wt=javabin&version=2}{add=[232]} 0 0
[junit4] 2> 649803 INFO (qtp90603281-95627) [ x:collection1] o.a.s.u.p.LogUpdateProcessorFactory [collection1] webapp=/solr path=/update params={wt=javabin&version=2}{add=[233]} 0 0
[junit4] 2> 649805 INFO (qtp90603281-95628) [ x:collection1] o.a.s.u.p.LogUpdateProcessorFactory [collection1] webapp=/solr path=/update params={wt=javabin&version=2}{add=[234]} 0 0
[junit4] 2> 649807 INFO (qtp90603281-95626) [ x:collection1] o.a.s.u.p.LogUpdateProcessorFactory [collection1] webapp=/solr path=/update params={wt=javabin&version=2}{add=[235]} 0 0
[junit4] 2> 649809 INFO (qtp90603281-95627) [ x:collection1] o.a.s.u.p.LogUpdateProcessorFactory [collection1] webapp=/solr path=/update params={wt=javabin&version=2}{add=[236]} 0 0
[junit4] 2> 649811 INFO (qtp90603281-95628) [ x:collection1] o.a.s.u.p.LogUpdateProcessorFactory [collection1] webapp=/solr path=/update params={wt=javabin&version=2}{add=[237]} 0 0
[junit4] 2> 649813 INFO (qtp90603281-95626) [ x:collection1] o.a.s.u.p.LogUpdateProcessorFactory [collection1] webapp=/solr path=/update params={wt=javabin&version=2}{add=[238]} 0 0
[junit4] 2> 649816 INFO (qtp90603281-95627) [ x:collection1] o.a.s.u.p.LogUpdateProcessorFactory [collection1] webapp=/solr path=/update params={wt=javabin&version=2}{add=[239]} 0 0
[junit4] 2> 649818 INFO (qtp90603281-95628) [ x:collection1] o.a.s.u.p.LogUpdateProcessorFactory [collection1] webapp=/solr path=/update params={wt=javabin&version=2}{add=[240]} 0 0
[junit4] 2> 649820 INFO (qtp90603281-95626) [ x:collection1] o.a.s.u.p.LogUpdateProcessorFactory [collection1] webapp=/solr path=/update params={wt=javabin&version=2}{add=[241]} 0 0
[junit4] 2> 649822 INFO (qtp90603281-95627) [ x:collection1] o.a.s.u.p.LogUpdateProcessorFactory [collection1] webapp=/solr path=/update params={wt=javabin&version=2}{add=[242]} 0 0
[junit4] 2> 649824 INFO (qtp90603281-95628) [ x:collection1] o.a.s.u.p.LogUpdateProcessorFactory [collection1] webapp=/solr path=/update params={wt=javabin&version=2}{add=[243]} 0 0
[junit4] 2> 649826 INFO (qtp90603281-95626) [ x:collection1] o.a.s.u.p.LogUpdateProcessorFactory [collection1] webapp=/solr path=/update params={wt=javabin&version=2}{add=[244]} 0 0
[junit4] 2> 649828 INFO (qtp90603281-95627) [ x:collection1] o.a.s.u.p.LogUpdateProcessorFactory [collection1] webapp=/solr path=/update params={wt=javabin&version=2}{add=[245]} 0 0
[junit4] 2> 649830 INFO (qtp90603281-95628) [ x:collection1] o.a.s.u.p.LogUpdateProcessorFactory [collection1] webapp=/solr path=/update params={wt=javabin&version=2}{add=[246]} 0 0
[junit4] 2> 649832 INFO (qtp90603281-95626) [ x:collection1] o.a.s.u.p.LogUpdateProcessorFactory [collection1] webapp=/solr path=/update params={wt=javabin&version=2}{add=[247]} 0 0
[junit4] 2> 649834 INFO (qtp90603281-95627) [ x:collection1] o.a.s.u.p.LogUpdateProcessorFactory [collection1] webapp=/solr path=/update params={wt=javabin&version=2}{add=[248]} 0 0
[junit4] 2> 649836 INFO (qtp90603281-95628) [ x:collection1] o.a.s.u.p.LogUpdateProcessorFactory [collection1] webapp=/solr path=/update params={wt=javabin&version=2}{add=[249]} 0 0
[junit4] 2> 649839 INFO (qtp90603281-95626) [ x:collection1] o.a.s.u.p.LogUpdateProcessorFactory [collection1] webapp=/solr path=/update params={wt=javabin&version=2}{add=[250]} 0 0
[junit4] 2> 649841 INFO (qtp90603281-95627) [ x:collection1] o.a.s.u.p.LogUpdateProcessorFactory [collection1] webapp=/solr path=/update params={wt=javabin&version=2}{add=[251]} 0 0
[junit4] 2> 649843 INFO (qtp90603281-95628) [ x:collection1] o.a.s.u.p.LogUpdateProcessorFactory [collection1] webapp=/solr path=/update params={wt=javabin&version=2}{add=[252]} 0 0
[junit4] 2> 649845 INFO (qtp90603281-95626) [ x:collection1] o.a.s.u.p.LogUpdateProcessorFactory [collection1] webapp=/solr path=/update params={wt=javabin&version=2}{add=[253]} 0 0
[junit4] 2> 649847 INFO (qtp90603281-95627) [ x:collection1] o.a.s.u.p.LogUpdateProcessorFactory [collection1] webapp=/solr path=/update params={wt=javabin&version=2}{add=[254]} 0 0
[junit4] 2> 649849 INFO (qtp90603281-95628) [ x:collection1] o.a.s.u.p.LogUpdateProcessorFactory [collection1] webapp=/solr path=/update params={wt=javabin&version=2}{add=[255]} 0 0
[junit4] 2> 649851 INFO (qtp90603281-95626) [ x:collection1] o.a.s.u.p.LogUpdateProcessorFactory [collection1] webapp=/solr path=/update params={wt=javabin&version=2}{add=[256]} 0 0
[junit4] 2> 649853 INFO (qtp90603281-95627) [ x:collection1] o.a.s.u.p.LogUpdateProcessorFactory [collection1] webapp=/solr path=/update params={wt=javabin&version=2}{add=[257]} 0 0
[junit4] 2> 649855 INFO (qtp90603281-95628) [ x:collection1] o.a.s.u.p.LogUpdateProcessorFactory [collection1] webapp=/solr path=/update params={wt=javabin&version=2}{add=[258]} 0 0
[junit4] 2> 649857 INFO (qtp90603281-95626) [ x:collection1] o.a.s.u.p.LogUpdateProcessorFactory [collection1] webapp=/solr path=/update params={wt=javabin&version=2}{add=[259]} 0 0
[junit4] 2> 649859 INFO (qtp90603281-95627) [ x:collection1] o.a.s.u.p.LogUpdateProcessorFactory [collection1] webapp=/solr path=/update params={wt=javabin&version=2}{add=[260]} 0 0
[junit4] 2> 649861 INFO (qtp90603281-95628) [ x:collection1] o.a.s.u.p.L
[...truncated too long message...]
4] 2> 723535 INFO (qtp906504718-96874) [ x:collection1] o.a.s.c.S.Request [collection1] webapp=/solr path=/replication params={wt=javabin&version=2&qt=/replication&command=details&_trace=getDetails} status=0 QTime=2
[junit4] 2> 723536 INFO (TEST-TestReplicationHandler.doTestIndexFetchWithMasterUrl-seed#[9F938B470C7335A]) [ ] o.a.s.SolrTestCaseJ4 ###Ending doTestIndexFetchWithMasterUrl
[junit4] 2> 723536 INFO (TEST-TestReplicationHandler.doTestIndexFetchWithMasterUrl-seed#[9F938B470C7335A]) [ ] o.e.j.s.ServerConnector Stopped ServerConnector@2c767e8d{HTTP/1.1}{127.0.0.1:0}
[junit4] 2> 723536 INFO (TEST-TestReplicationHandler.doTestIndexFetchWithMasterUrl-seed#[9F938B470C7335A]) [ ] o.a.s.c.CoreContainer Shutting down CoreContainer instance=635343986
[junit4] 2> 723536 INFO (coreCloseExecutor-7772-thread-1) [ x:collection1] o.a.s.c.SolrCore [collection1] CLOSING SolrCore org.apache.solr.core.SolrCore@48f6dc
[junit4] 2> 723537 INFO (coreCloseExecutor-7772-thread-1) [ x:collection1] o.a.s.u.DirectUpdateHandler2 closing DirectUpdateHandler2{commits=2,autocommits=0,soft autocommits=0,optimizes=0,rollbacks=0,expungeDeletes=0,docsPending=0,adds=0,deletesById=0,deletesByQuery=0,errors=0,cumulative_adds=496,cumulative_deletesById=0,cumulative_deletesByQuery=1,cumulative_errors=0}
[junit4] 2> 723537 INFO (coreCloseExecutor-7772-thread-1) [ x:collection1] o.a.s.u.SolrCoreState Closing SolrCoreState
[junit4] 2> 723537 INFO (coreCloseExecutor-7772-thread-1) [ x:collection1] o.a.s.u.DefaultSolrCoreState SolrCoreState ref count has reached 0 - closing IndexWriter
[junit4] 2> 723537 INFO (coreCloseExecutor-7772-thread-1) [ x:collection1] o.a.s.u.DefaultSolrCoreState closing IndexWriter with IndexWriterCloser
[junit4] 2> 723537 INFO (coreCloseExecutor-7772-thread-1) [ x:collection1] o.a.s.c.SolrCore [collection1] Closing main searcher on request.
[junit4] 2> 723537 INFO (coreCloseExecutor-7772-thread-1) [ x:collection1] o.a.s.c.CachingDirectoryFactory Closing MockDirectoryFactory - 2 directories currently being tracked
[junit4] 2> 723537 INFO (coreCloseExecutor-7772-thread-1) [ x:collection1] o.a.s.c.CachingDirectoryFactory looking to close /home/jenkins/workspace/Lucene-Solr-5.5-Linux/solr/build/solr-core/test/J0/temp/solr.handler.TestReplicationHandler_9F938B470C7335A-001/solr-instance-031/./collection1/data [CachedDir<<refCount=0;path=/home/jenkins/workspace/Lucene-Solr-5.5-Linux/solr/build/solr-core/test/J0/temp/solr.handler.TestReplicationHandler_9F938B470C7335A-001/solr-instance-031/./collection1/data;done=false>>]
[junit4] 2> 723537 INFO (coreCloseExecutor-7772-thread-1) [ x:collection1] o.a.s.c.CachingDirectoryFactory Closing directory: /home/jenkins/workspace/Lucene-Solr-5.5-Linux/solr/build/solr-core/test/J0/temp/solr.handler.TestReplicationHandler_9F938B470C7335A-001/solr-instance-031/./collection1/data
[junit4] 2> 723537 INFO (coreCloseExecutor-7772-thread-1) [ x:collection1] o.a.s.c.CachingDirectoryFactory looking to close /home/jenkins/workspace/Lucene-Solr-5.5-Linux/solr/build/solr-core/test/J0/temp/solr.handler.TestReplicationHandler_9F938B470C7335A-001/solr-instance-031/./collection1/data/index.20160913030032401 [CachedDir<<refCount=0;path=/home/jenkins/workspace/Lucene-Solr-5.5-Linux/solr/build/solr-core/test/J0/temp/solr.handler.TestReplicationHandler_9F938B470C7335A-001/solr-instance-031/./collection1/data/index.20160913030032401;done=false>>]
[junit4] 2> 723537 INFO (coreCloseExecutor-7772-thread-1) [ x:collection1] o.a.s.c.CachingDirectoryFactory Closing directory: /home/jenkins/workspace/Lucene-Solr-5.5-Linux/solr/build/solr-core/test/J0/temp/solr.handler.TestReplicationHandler_9F938B470C7335A-001/solr-instance-031/./collection1/data/index.20160913030032401
[junit4] 2> 723538 INFO (TEST-TestReplicationHandler.doTestIndexFetchWithMasterUrl-seed#[9F938B470C7335A]) [ ] o.e.j.s.h.ContextHandler Stopped o.e.j.s.ServletContextHandler@1be4cfec{/solr,null,UNAVAILABLE}
[junit4] 2> 723539 INFO (TEST-TestReplicationHandler.doTestIndexFetchWithMasterUrl-seed#[9F938B470C7335A]) [ ] o.e.j.s.ServerConnector Stopped ServerConnector@3b0f8296{HTTP/1.1}{127.0.0.1:0}
[junit4] 2> 723539 INFO (TEST-TestReplicationHandler.doTestIndexFetchWithMasterUrl-seed#[9F938B470C7335A]) [ ] o.a.s.c.CoreContainer Shutting down CoreContainer instance=557563904
[junit4] 2> 723539 INFO (coreCloseExecutor-7774-thread-1) [ x:collection1] o.a.s.c.SolrCore [collection1] CLOSING SolrCore org.apache.solr.core.SolrCore@5fc6e55c
[junit4] 2> 723539 INFO (coreCloseExecutor-7774-thread-1) [ x:collection1] o.a.s.u.DirectUpdateHandler2 closing DirectUpdateHandler2{commits=2,autocommits=0,soft autocommits=0,optimizes=0,rollbacks=0,expungeDeletes=0,docsPending=0,adds=0,deletesById=0,deletesByQuery=0,errors=0,cumulative_adds=3,cumulative_deletesById=0,cumulative_deletesByQuery=1,cumulative_errors=0}
[junit4] 2> 723539 INFO (coreCloseExecutor-7774-thread-1) [ x:collection1] o.a.s.u.SolrCoreState Closing SolrCoreState
[junit4] 2> 723539 INFO (coreCloseExecutor-7774-thread-1) [ x:collection1] o.a.s.u.DefaultSolrCoreState SolrCoreState ref count has reached 0 - closing IndexWriter
[junit4] 2> 723539 INFO (coreCloseExecutor-7774-thread-1) [ x:collection1] o.a.s.u.DefaultSolrCoreState closing IndexWriter with IndexWriterCloser
[junit4] 2> 723539 INFO (coreCloseExecutor-7774-thread-1) [ x:collection1] o.a.s.c.SolrCore [collection1] Closing main searcher on request.
[junit4] 2> 723539 INFO (coreCloseExecutor-7774-thread-1) [ x:collection1] o.a.s.c.CachingDirectoryFactory Closing MockDirectoryFactory - 2 directories currently being tracked
[junit4] 2> 723539 INFO (coreCloseExecutor-7774-thread-1) [ x:collection1] o.a.s.c.CachingDirectoryFactory looking to close /home/jenkins/workspace/Lucene-Solr-5.5-Linux/solr/build/solr-core/test/J0/temp/solr.handler.TestReplicationHandler_9F938B470C7335A-001/solr-instance-032/./collection1/data/index.20160913030023195 [CachedDir<<refCount=0;path=/home/jenkins/workspace/Lucene-Solr-5.5-Linux/solr/build/solr-core/test/J0/temp/solr.handler.TestReplicationHandler_9F938B470C7335A-001/solr-instance-032/./collection1/data/index.20160913030023195;done=false>>]
[junit4] 2> 723539 INFO (coreCloseExecutor-7774-thread-1) [ x:collection1] o.a.s.c.CachingDirectoryFactory Closing directory: /home/jenkins/workspace/Lucene-Solr-5.5-Linux/solr/build/solr-core/test/J0/temp/solr.handler.TestReplicationHandler_9F938B470C7335A-001/solr-instance-032/./collection1/data/index.20160913030023195
[junit4] 2> 723539 INFO (coreCloseExecutor-7774-thread-1) [ x:collection1] o.a.s.c.CachingDirectoryFactory looking to close /home/jenkins/workspace/Lucene-Solr-5.5-Linux/solr/build/solr-core/test/J0/temp/solr.handler.TestReplicationHandler_9F938B470C7335A-001/solr-instance-032/./collection1/data [CachedDir<<refCount=0;path=/home/jenkins/workspace/Lucene-Solr-5.5-Linux/solr/build/solr-core/test/J0/temp/solr.handler.TestReplicationHandler_9F938B470C7335A-001/solr-instance-032/./collection1/data;done=false>>]
[junit4] 2> 723540 INFO (coreCloseExecutor-7774-thread-1) [ x:collection1] o.a.s.c.CachingDirectoryFactory Closing directory: /home/jenkins/workspace/Lucene-Solr-5.5-Linux/solr/build/solr-core/test/J0/temp/solr.handler.TestReplicationHandler_9F938B470C7335A-001/solr-instance-032/./collection1/data
[junit4] 2> 723540 INFO (TEST-TestReplicationHandler.doTestIndexFetchWithMasterUrl-seed#[9F938B470C7335A]) [ ] o.e.j.s.h.ContextHandler Stopped o.e.j.s.ServletContextHandler@45506acf{/solr,null,UNAVAILABLE}
[junit4] 2> 723541 INFO (SUITE-TestReplicationHandler-seed#[9F938B470C7335A]-worker) [ ] o.a.s.SolrTestCaseJ4 ###deleteCore
[junit4] 2> NOTE: leaving temporary files on disk at: /home/jenkins/workspace/Lucene-Solr-5.5-Linux/solr/build/solr-core/test/J0/temp/solr.handler.TestReplicationHandler_9F938B470C7335A-001
[junit4] 2> NOTE: test params are: codec=Asserting(Lucene54): {newname=FSTOrd50, id=FSTOrd50, name=FSTOrd50}, docValues:{}, sim=RandomSimilarity(queryNorm=false,coord=yes): {}, locale=ar-SA, timezone=Africa/Ceuta
[junit4] 2> NOTE: Linux 4.4.0-36-generic amd64/Oracle Corporation 1.7.0_80 (64-bit)/cpus=12,threads=1,free=139639344,total=507641856
[junit4] 2> NOTE: All tests run in this JVM: [SOLR749Test, IndexSchemaTest, HdfsBasicDistributedZk2Test, TestDocBasedVersionConstraints, TestRealTimeGet, QueryElevationComponentTest, RAMDirectoryFactoryTest, TestImplicitCoreProperties, TestPivotHelperCode, TestSolrConfigHandlerCloud, TestLMDirichletSimilarityFactory, TestManagedSchemaDynamicFieldResource, TestFoldingMultitermQuery, DistribDocExpirationUpdateProcessorTest, SyncSliceTest, TestDFISimilarityFactory, TestIntervalFaceting, TestHighFrequencyDictionaryFactory, PingRequestHandlerTest, PolyFieldTest, PreAnalyzedFieldTest, CollectionsAPISolrJTest, MigrateRouteKeyTest, CopyFieldTest, SolrXmlInZkTest, AsyncCallRequestStatusResponseTest, DistributedExpandComponentTest, QueryEqualityTest, DefaultValueUpdateProcessorTest, OverseerStatusTest, TestSimpleQParserPlugin, TestXmlQParser, PathHierarchyTokenizerFactoryTest, TestAnalyzedSuggestions, TestMiniSolrCloudCluster, StandardRequestHandlerTest, BasicAuthIntegrationTest, TestRandomFaceting, TestReplicationHandlerBackup, TestMissingGroups, ResponseHeaderTest, ZkStateReaderTest, TestCustomDocTransformer, RequiredFieldsTest, TestCrossCoreJoin, DeleteShardTest, DistributedQueryElevationComponentTest, AddBlockUpdateTest, TestPhraseSuggestions, EnumFieldTest, XsltUpdateRequestHandlerTest, DateFieldTest, TestConfigSetsAPI, TestLuceneMatchVersion, TestStressLiveNodes, TestManagedResourceStorage, TestReplicationHandler]
[junit4] Completed [153/575 (1!)] on J0 in 75.28s, 15 tests, 1 failure <<< FAILURES!
[...truncated 57971 lines...]