You are viewing a plain text version of this content. The canonical link for it is here.
Posted to java-dev@axis.apache.org by Davanum Srinivas <da...@gmail.com> on 2006/01/11 17:12:53 UTC

[Axis2] Build break again!!

Eran,

latest svn gives me this:

amazonQS:

BUILD FAILED
File...... C:\APACHE\axis2\modules\samples\maven.xml
Element... ant:copy
Line...... 141
Column.... -1
Warning: Could not find file
C:\APACHE\axis2\modules\samples\xdocs\readme.txt to copy.
Total time   : 25 seconds
Finished at  : Wednesday, January 11, 2006 11:10:56 AM EST

thanks,
dims

--
Davanum Srinivas : http://wso2.com/blogs/

Re: [Axis2] Build break again!!

Posted by Davanum Srinivas <da...@gmail.com>.
Sorry for the panic :)


On 1/11/06, Eran Chinthaka <ch...@opensource.lk> wrote:
> It was fixed in the release. I forgot to commit it, but its in the
> release. Thanks.
>
>
>
> Davanum Srinivas wrote:
>
> >Eran,
> >
> >latest svn gives me this:
> >
> >amazonQS:
> >
> >BUILD FAILED
> >File...... C:\APACHE\axis2\modules\samples\maven.xml
> >Element... ant:copy
> >Line...... 141
> >Column.... -1
> >Warning: Could not find file
> >C:\APACHE\axis2\modules\samples\xdocs\readme.txt to copy.
> >Total time   : 25 seconds
> >Finished at  : Wednesday, January 11, 2006 11:10:56 AM EST
> >
> >thanks,
> >dims
> >
> >--
> >Davanum Srinivas : http://wso2.com/blogs/
> >
> >
> >
>


--
Davanum Srinivas : http://wso2.com/blogs/

Re: [Axis2] Build break again!!

Posted by Eran Chinthaka <ch...@opensource.lk>.
It was fixed in the release. I forgot to commit it, but its in the
release. Thanks.



Davanum Srinivas wrote:

>Eran,
>
>latest svn gives me this:
>
>amazonQS:
>
>BUILD FAILED
>File...... C:\APACHE\axis2\modules\samples\maven.xml
>Element... ant:copy
>Line...... 141
>Column.... -1
>Warning: Could not find file
>C:\APACHE\axis2\modules\samples\xdocs\readme.txt to copy.
>Total time   : 25 seconds
>Finished at  : Wednesday, January 11, 2006 11:10:56 AM EST
>
>thanks,
>dims
>
>--
>Davanum Srinivas : http://wso2.com/blogs/
>
>  
>