You are viewing a plain text version of this content. The canonical link for it is here.
Posted to dev@turbine.apache.org by fulcrum-testcontainer development <tu...@jakarta.apache.org> on 2005/01/19 13:04:06 UTC

[GUMP@brutus]: Project fulcrum-testcontainer (in module jakarta-turbine-fulcrum) failed

To whom it may engage...
        
This is an automated request, but not an unsolicited one. For 
more information please visit http://gump.apache.org/nagged.html, 
and/or contact the folk at general@gump.apache.org.

Project fulcrum-testcontainer has an issue affecting its community integration.
This issue affects 28 projects.
The current state of this project is 'Failed', with reason 'Build Failed'.
For reference only, the following projects are affected by this:
    - fulcrum-bsf :  Services Framework
    - fulcrum-cache :  Services Framework
    - fulcrum-configuration-impl :  Services Framework
    - fulcrum-crypto :  Services Framework
    - fulcrum-dvsl :  Services Framework
    - fulcrum-factory :  Services Framework
    - fulcrum-hsqldb :  Services Framework
    - fulcrum-intake :  Services Framework
    - fulcrum-localization :  Services Framework
    - fulcrum-mimetype :  Services Framework
    - fulcrum-naming :  Services Framework
    - fulcrum-osworkflow :  Services Framework
    - fulcrum-parser :  Services Framework
    - fulcrum-pool :  Services Framework
    - fulcrum-quartz :  Services Framework
    - fulcrum-security-adapter-turbine :  Services Framework
    - fulcrum-security-api :  Services Framework
    - fulcrum-security-memory :  Services Framework
    - fulcrum-security-nt :  Services Framework
    - fulcrum-template :  Services Framework
    - fulcrum-testcontainer :  Services Framework
    - fulcrum-upload :  Services Framework
    - fulcrum-xmlrpc :  Services Framework
    - fulcrum-xslt :  Services Framework
    - jakarta-jetspeed :  Enterprise Information Portal
    - jakarta-turbine-2 :  A servlet based framework.
    - jakarta-turbine-3 :  A servlet based framework.
    - scarab :  Issue Tracking Built for the Ages


Full details are available at:
    http://brutus.apache.org/gump/public/jakarta-turbine-fulcrum/fulcrum-testcontainer/index.html

That said, some information snippets are provided here.

The following annotations (debug/informational/warning/error messages) were provided:
 -DEBUG- Sole output [fulcrum-testcontainer-1.0.4.jar] identifier set to project name
 -DEBUG- (Gump generated) Maven Properties in: /usr/local/gump/public/workspace/jakarta-turbine-fulcrum/testcontainer/build.properties
 -INFO- Failed with reason build failed
 -DEBUG- Maven POM in: /usr/local/gump/public/workspace/jakarta-turbine-fulcrum/testcontainer/project.xml
 -DEBUG- Maven project properties in: /usr/local/gump/public/workspace/jakarta-turbine-fulcrum/testcontainer/project.properties
 -INFO- Failed to extract fallback artifacts from Gump Repository



The following work was performed:
http://brutus.apache.org/gump/public/jakarta-turbine-fulcrum/fulcrum-testcontainer/gump_work/build_jakarta-turbine-fulcrum_fulcrum-testcontainer.html
Work Name: build_jakarta-turbine-fulcrum_fulcrum-testcontainer (Type: Build)
Work ended in a state of : Failed
Elapsed: 10 secs
Command Line: maven --offline jar 
[Working Directory: /usr/local/gump/public/workspace/jakarta-turbine-fulcrum/testcontainer]
CLASSPATH: /opt/jdk1.4/lib/tools.jar:/usr/local/gump/public/workspace/jakarta-turbine-fulcrum/testcontainer/target/classes:/usr/local/gump/public/workspace/ant/dist/lib/ant-jmf.jar:/usr/local/gump/public/workspace/ant/dist/lib/ant-swing.jar:/usr/local/gump/public/workspace/ant/dist/lib/ant-apache-resolver.jar:/usr/local/gump/public/workspace/ant/dist/lib/ant-trax.jar:/usr/local/gump/public/workspace/ant/dist/lib/ant-junit.jar:/usr/local/gump/public/workspace/ant/dist/lib/ant-launcher.jar:/usr/local/gump/public/workspace/ant/dist/lib/ant-nodeps.jar:/usr/local/gump/public/workspace/ant/dist/lib/ant.jar:/usr/local/gump/public/workspace/avalon-trunk/runtime/framework/api/target/deliverables/jars/avalon-framework-api-19012005.jar:/usr/local/gump/public/workspace/avalon-tools/tools/magic/target/deliverables/jars/avalon-tools-magic-19012005.jar:/usr/local/gump/public/workspace/dist/junit/junit.jar:/usr/local/gump/public/workspace/xml-commons/java/build/resolver.jar:/usr/local/gump/public/workspace/ant/bootstrap/lib/ant-launcher.jar:/usr/local/gump/public/workspace/ant/bootstrap/lib/ant.jar:/usr/local/gump/public/workspace/avalon-trunk/runtime/framework/impl/target/deliverables/jars/avalon-framework-impl-19012005.jar:/usr/local/gump/public/workspace/logging-log4j/log4j-19012005.jar:/usr/local/gump/public/workspace/excalibur/deprecated/component/target/excalibur-component-19012005.jar:/usr/local/gump/public/workspace/jakarta-servletapi/dist/lib/servlet.jar:/usr/local/gump/public/workspace/checkstyle/target/dist/checkstyle-19012005/checkstyle-19012005.jar:/usr/local/gump/packages/antlr-2.7.3/antlr.jar:/usr/local/gump/public/workspace/jakarta-regexp/build/jakarta-regexp-19012005.jar:/usr/local/gump/public/workspace/jakarta-bcel/bin/bcel.jar:/usr/local/gump/public/workspace/jakarta-commons/beanutils/dist/commons-beanutils-core.jar:/usr/local/gump/public/workspace/jakarta-commons/cli/target/commons-cli-19012005.jar:/usr/local/gump/public/workspace/jakarta-commons/collections/build/commons-collections-19012005.jar:/usr/local/gump/public/workspace/jakarta-commons/logging/dist/commons-logging.jar:/usr/local/gump/public/workspace/jakarta-commons/logging/dist/commons-logging-api.jar:/usr/local/gump/public/workspace/jdom/build/jdom.jar:/usr/local/gump/public/workspace/jakarta-velocity/bin/velocity-19012005.jar:/usr/local/gump/public/workspace/jakarta-velocity/bin/velocity-dep-19012005.jar:/usr/local/gump/public/workspace/avalon-trunk/runtime/logkit/target/deliverables/jars/avalon-logkit-19012005.jar:/usr/local/gump/public/workspace/excalibur/containerkit/instrument/api/target/excalibur-instrument-api-19012005.jar:/usr/local/gump/public/workspace/excalibur/containerkit/logger/target/excalibur-logger-19012005.jar:/usr/local/gump/public/workspace/excalibur/components/pool/api/target/excalibur-pool-api-19012005.jar:/usr/local/gump/public/workspace/excalibur/components/pool/impl/target/excalibur-pool-impl-19012005.jar:/usr/local/gump/public/workspace/excalibur/components/pool/instrumented/target/excalibur-pool-instrumented-19012005.jar:/usr/local/gump/public/workspace/jakarta-commons/lang/dist/commons-lang-19012005.jar:/usr/local/gump/public/workspace/jakarta-commons/io/dist/jakarta-commons-io-19012005.jar:/usr/local/gump/public/workspace/jakarta-turbine-fulcrum/yaafi/target/fulcrum-yaafi-1.0.3.jar
---------------------------------------------
 __  __
|  \/  |__ _Apache__ ___
| |\/| / _` \ V / -_) ' \  ~ intelligent projects ~
|_|  |_\__,_|\_/\___|_||_|  v. 1.0

Plugin 'maven-deploy-plugin' in project 'Fulcrum Test Container' is not available
build:start:

java:prepare-filesystem:
    [mkdir] Created dir: /home/gump/workspaces2/public/workspace/jakarta-turbine-fulcrum/testcontainer/target/classes

java:compile:
    [echo] Compiling to /home/gump/workspaces2/public/workspace/jakarta-turbine-fulcrum/testcontainer/target/classes
    [javac] Compiling 4 source files to /home/gump/workspaces2/public/workspace/jakarta-turbine-fulcrum/testcontainer/target/classes
Note: /home/gump/workspaces2/public/workspace/jakarta-turbine-fulcrum/testcontainer/src/java/org/apache/fulcrum/testcontainer/ECMContainer.java uses or overrides a deprecated API.
Note: Recompile with -deprecation for details.

java:jar-resources:

test:prepare-filesystem:
    [mkdir] Created dir: /home/gump/workspaces2/public/workspace/jakarta-turbine-fulcrum/testcontainer/target/test-classes
    [mkdir] Created dir: /home/gump/workspaces2/public/workspace/jakarta-turbine-fulcrum/testcontainer/target/test-reports

test:test-resources:
Copying 4 files to /home/gump/workspaces2/public/workspace/jakarta-turbine-fulcrum/testcontainer/target/test-classes

test:compile:
    [javac] Compiling 5 source files to /home/gump/workspaces2/public/workspace/jakarta-turbine-fulcrum/testcontainer/target/test-classes

test:test:
    [junit] Running org.apache.fulcrum.testcontainer.EcmContainerTest
    [junit] Tests run: 5, Failures: 0, Errors: 4, Time elapsed: 0.798 sec
    [junit] [ERROR] TEST org.apache.fulcrum.testcontainer.EcmContainerTest FAILED
    [junit] Running org.apache.fulcrum.testcontainer.YaafiContainerTest
    [junit] Tests run: 4, Failures: 0, Errors: 0, Time elapsed: 0.978 sec

BUILD FAILED
File...... /home/gump/.maven/cache/maven-test-plugin-1.6.2/plugin.jelly
Element... fail
Line...... 181
Column.... 54
There were test failures.
Total time: 9 seconds
Finished at: Wed Jan 19 04:04:05 PST 2005

---------------------------------------------

To subscribe to this information via syndicated feeds:
- RSS: http://brutus.apache.org/gump/public/jakarta-turbine-fulcrum/fulcrum-testcontainer/rss.xml
- Atom: http://brutus.apache.org/gump/public/jakarta-turbine-fulcrum/fulcrum-testcontainer/atom.xml

============================== Gump Tracking Only ===
Produced by Gump version 2.2.
Gump Run 29000019012005, brutus:brutus-public:29000019012005
Gump E-mail Identifier (unique within run) #42.

--
Apache Gump
http://gump.apache.org/ [Instance: brutus]

---------------------------------------------------------------------
To unsubscribe, e-mail: turbine-dev-unsubscribe@jakarta.apache.org
For additional commands, e-mail: turbine-dev-help@jakarta.apache.org