You are viewing a plain text version of this content. The canonical link for it is here.
Posted to commits@beam.apache.org by Apache Jenkins Server <je...@builds.apache.org> on 2018/05/31 18:13:44 UTC

Build failed in Jenkins: beam_PerformanceTests_JDBC #664

See <https://builds.apache.org/job/beam_PerformanceTests_JDBC/664/display/redirect?page=changes>

Changes:

[apilloud] Run test on shadowJar on a flag

[apilloud] [SQL] Build mega jar for JDBC

[apilloud] [SQL] JDBC Class Loader IT

[coheigea] Avoid fully qualified class names, when there is an existing (static)

------------------------------------------
[...truncated 243.57 KB...]
    May 31, 2018 6:13:22 PM org.apache.beam.runners.dataflow.DataflowPipelineTranslator$Translator addStep
    INFO: Adding PAssert$2/GetPane/Map as step s94
    May 31, 2018 6:13:22 PM org.apache.beam.runners.dataflow.DataflowPipelineTranslator$Translator addStep
    INFO: Adding PAssert$2/RunChecks as step s95
    May 31, 2018 6:13:22 PM org.apache.beam.runners.dataflow.DataflowPipelineTranslator$Translator addStep
    INFO: Adding PAssert$2/VerifyAssertions/ParDo(DefaultConclude) as step s96
    May 31, 2018 6:13:22 PM org.apache.beam.runners.dataflow.DataflowPipelineTranslator$Translator addStep
    INFO: Adding Combine.globally(Top(Natural))/WithKeys/AddKeys/Map as step s97
    May 31, 2018 6:13:22 PM org.apache.beam.runners.dataflow.DataflowPipelineTranslator$Translator addStep
    INFO: Adding Combine.globally(Top(Natural))/Combine.perKey(Top(Natural))/GroupByKey as step s98
    May 31, 2018 6:13:22 PM org.apache.beam.runners.dataflow.DataflowPipelineTranslator$Translator addStep
    INFO: Adding Combine.globally(Top(Natural))/Combine.perKey(Top(Natural))/Combine.GroupedValues as step s99
    May 31, 2018 6:13:22 PM org.apache.beam.runners.dataflow.DataflowPipelineTranslator$Translator addStep
    INFO: Adding Combine.globally(Top(Natural))/Values/Values/Map as step s100
    May 31, 2018 6:13:22 PM org.apache.beam.runners.dataflow.DataflowPipelineTranslator$Translator addStep
    INFO: Adding Combine.globally(Top(Natural))/View.AsIterable/ParDo(ToIsmRecordForGlobalWindow) as step s101
    May 31, 2018 6:13:22 PM org.apache.beam.runners.dataflow.DataflowPipelineTranslator$Translator addStep
    INFO: Adding Combine.globally(Top(Natural))/View.AsIterable/CreateDataflowView as step s102
    May 31, 2018 6:13:22 PM org.apache.beam.runners.dataflow.DataflowPipelineTranslator$Translator addStep
    INFO: Adding Combine.globally(Top(Natural))/CreateVoid/Read(CreateSource) as step s103
    May 31, 2018 6:13:22 PM org.apache.beam.runners.dataflow.DataflowPipelineTranslator$Translator addStep
    INFO: Adding Combine.globally(Top(Natural))/ProduceDefault as step s104
    May 31, 2018 6:13:22 PM org.apache.beam.runners.dataflow.DataflowPipelineTranslator$Translator addStep
    INFO: Adding Combine.globally(Top(Natural))/Flatten.PCollections as step s105
    May 31, 2018 6:13:22 PM org.apache.beam.runners.dataflow.DataflowPipelineTranslator$Translator addStep
    INFO: Adding PAssert$3/GroupGlobally/Window.Into()/Window.Assign as step s106
    May 31, 2018 6:13:22 PM org.apache.beam.runners.dataflow.DataflowPipelineTranslator$Translator addStep
    INFO: Adding PAssert$3/GroupGlobally/GatherAllOutputs/Reify.Window/ParDo(Anonymous) as step s107
    May 31, 2018 6:13:22 PM org.apache.beam.runners.dataflow.DataflowPipelineTranslator$Translator addStep
    INFO: Adding PAssert$3/GroupGlobally/GatherAllOutputs/WithKeys/AddKeys/Map as step s108
    May 31, 2018 6:13:22 PM org.apache.beam.runners.dataflow.DataflowPipelineTranslator$Translator addStep
    INFO: Adding PAssert$3/GroupGlobally/GatherAllOutputs/Window.Into()/Window.Assign as step s109
    May 31, 2018 6:13:22 PM org.apache.beam.runners.dataflow.DataflowPipelineTranslator$Translator addStep
    INFO: Adding PAssert$3/GroupGlobally/GatherAllOutputs/GroupByKey as step s110
    May 31, 2018 6:13:22 PM org.apache.beam.runners.dataflow.DataflowPipelineTranslator$Translator addStep
    INFO: Adding PAssert$3/GroupGlobally/GatherAllOutputs/Values/Values/Map as step s111
    May 31, 2018 6:13:22 PM org.apache.beam.runners.dataflow.DataflowPipelineTranslator$Translator addStep
    INFO: Adding PAssert$3/GroupGlobally/RewindowActuals/Window.Assign as step s112
    May 31, 2018 6:13:22 PM org.apache.beam.runners.dataflow.DataflowPipelineTranslator$Translator addStep
    INFO: Adding PAssert$3/GroupGlobally/KeyForDummy/AddKeys/Map as step s113
    May 31, 2018 6:13:22 PM org.apache.beam.runners.dataflow.DataflowPipelineTranslator$Translator addStep
    INFO: Adding PAssert$3/GroupGlobally/RemoveActualsTriggering/Flatten.PCollections as step s114
    May 31, 2018 6:13:22 PM org.apache.beam.runners.dataflow.DataflowPipelineTranslator$Translator addStep
    INFO: Adding PAssert$3/GroupGlobally/Create.Values/Read(CreateSource) as step s115
    May 31, 2018 6:13:22 PM org.apache.beam.runners.dataflow.DataflowPipelineTranslator$Translator addStep
    INFO: Adding PAssert$3/GroupGlobally/WindowIntoDummy/Window.Assign as step s116
    May 31, 2018 6:13:22 PM org.apache.beam.runners.dataflow.DataflowPipelineTranslator$Translator addStep
    INFO: Adding PAssert$3/GroupGlobally/RemoveDummyTriggering/Flatten.PCollections as step s117
    May 31, 2018 6:13:22 PM org.apache.beam.runners.dataflow.DataflowPipelineTranslator$Translator addStep
    INFO: Adding PAssert$3/GroupGlobally/FlattenDummyAndContents as step s118
    May 31, 2018 6:13:22 PM org.apache.beam.runners.dataflow.DataflowPipelineTranslator$Translator addStep
    INFO: Adding PAssert$3/GroupGlobally/NeverTrigger/Flatten.PCollections as step s119
    May 31, 2018 6:13:22 PM org.apache.beam.runners.dataflow.DataflowPipelineTranslator$Translator addStep
    INFO: Adding PAssert$3/GroupGlobally/GroupDummyAndContents as step s120
    May 31, 2018 6:13:22 PM org.apache.beam.runners.dataflow.DataflowPipelineTranslator$Translator addStep
    INFO: Adding PAssert$3/GroupGlobally/Values/Values/Map as step s121
    May 31, 2018 6:13:22 PM org.apache.beam.runners.dataflow.DataflowPipelineTranslator$Translator addStep
    INFO: Adding PAssert$3/GroupGlobally/ParDo(Concat) as step s122
    May 31, 2018 6:13:22 PM org.apache.beam.runners.dataflow.DataflowPipelineTranslator$Translator addStep
    INFO: Adding PAssert$3/GetPane/Map as step s123
    May 31, 2018 6:13:22 PM org.apache.beam.runners.dataflow.DataflowPipelineTranslator$Translator addStep
    INFO: Adding PAssert$3/RunChecks as step s124
    May 31, 2018 6:13:22 PM org.apache.beam.runners.dataflow.DataflowPipelineTranslator$Translator addStep
    INFO: Adding PAssert$3/VerifyAssertions/ParDo(DefaultConclude) as step s125
    May 31, 2018 6:13:22 PM org.apache.beam.runners.dataflow.DataflowRunner run
    INFO: Staging pipeline description to gs://temp-storage-for-perf-tests/jdbcioit0testwritethenread-jenkins-0531181319-88de477e/output/results/staging/
    May 31, 2018 6:13:23 PM org.apache.beam.runners.dataflow.util.PackageUtil tryStagePackage
    INFO: Uploading <304473 bytes, hash sMG0BdzQTTP7O6jVrLfdDQ> to gs://temp-storage-for-perf-tests/jdbcioit0testwritethenread-jenkins-0531181319-88de477e/output/results/staging/pipeline-sMG0BdzQTTP7O6jVrLfdDQ.pb

org.apache.beam.sdk.io.jdbc.JdbcIOIT > testWriteThenRead STANDARD_OUT
    Dataflow SDK version: 2.5.0-SNAPSHOT

org.apache.beam.sdk.io.jdbc.JdbcIOIT > testWriteThenRead STANDARD_ERROR
    May 31, 2018 6:13:24 PM org.apache.beam.runners.dataflow.DataflowRunner run
    INFO: To access the Dataflow monitoring console, please navigate to https://console.cloud.google.com/dataflow/jobsDetail/locations/us-central1/jobs/2018-05-31_11_13_23-4188499526520433701?project=apache-beam-testing

org.apache.beam.sdk.io.jdbc.JdbcIOIT > testWriteThenRead STANDARD_OUT
    Submitted job: 2018-05-31_11_13_23-4188499526520433701

org.apache.beam.sdk.io.jdbc.JdbcIOIT > testWriteThenRead STANDARD_ERROR
    May 31, 2018 6:13:24 PM org.apache.beam.runners.dataflow.DataflowRunner run
    INFO: To cancel the job using the 'gcloud' tool, run:
    > gcloud dataflow jobs --project=apache-beam-testing cancel --region=us-central1 2018-05-31_11_13_23-4188499526520433701
    May 31, 2018 6:13:24 PM org.apache.beam.runners.dataflow.TestDataflowRunner run
    INFO: Running Dataflow job 2018-05-31_11_13_23-4188499526520433701 with 4 expected assertions.
    May 31, 2018 6:13:41 PM org.apache.beam.runners.dataflow.util.MonitoringUtil$LoggingHandler process
    INFO: 2018-05-31T18:13:23.360Z: Autoscaling is enabled for job 2018-05-31_11_13_23-4188499526520433701. The number of workers will be between 1 and 1000.
    May 31, 2018 6:13:41 PM org.apache.beam.runners.dataflow.util.MonitoringUtil$LoggingHandler process
    INFO: 2018-05-31T18:13:23.382Z: Autoscaling was automatically enabled for job 2018-05-31_11_13_23-4188499526520433701.
    May 31, 2018 6:13:41 PM org.apache.beam.runners.dataflow.util.MonitoringUtil$LoggingHandler process
    INFO: 2018-05-31T18:13:26.119Z: Checking required Cloud APIs are enabled.
    May 31, 2018 6:13:41 PM org.apache.beam.runners.dataflow.util.MonitoringUtil$LoggingHandler process
    INFO: 2018-05-31T18:13:26.308Z: Checking permissions granted to controller Service Account.
    May 31, 2018 6:13:41 PM org.apache.beam.runners.dataflow.util.MonitoringUtil$LoggingHandler process
    INFO: 2018-05-31T18:13:29.547Z: Worker configuration: n1-standard-1 in us-central1-b.
    May 31, 2018 6:13:41 PM org.apache.beam.runners.dataflow.util.MonitoringUtil$LoggingHandler process
    SEVERE: 2018-05-31T18:13:29.930Z: Workflow failed. Causes: Project apache-beam-testing has insufficient quota(s) to execute this workflow with 1 instances in region us-central1. Quota summary (required/available): 1/4294 instances, 1/0 CPUs, 250/220 disk GB, 0/1998 SSD disk GB, 1/78 instance groups, 1/28 managed instance groups, 1/53 instance templates, 1/246 in-use IP addresses.

    Please see https://cloud.google.com/compute/docs/resource-quotas about requesting more quota.
    May 31, 2018 6:13:41 PM org.apache.beam.runners.dataflow.util.MonitoringUtil$LoggingHandler process
    INFO: 2018-05-31T18:13:30.023Z: Cleaning up.
    May 31, 2018 6:13:41 PM org.apache.beam.runners.dataflow.TestDataflowRunner$ErrorMonitorMessagesHandler process
    INFO: Dataflow job 2018-05-31_11_13_23-4188499526520433701 threw exception. Failure message was: Workflow failed. Causes: Project apache-beam-testing has insufficient quota(s) to execute this workflow with 1 instances in region us-central1. Quota summary (required/available): 1/4294 instances, 1/0 CPUs, 250/220 disk GB, 0/1998 SSD disk GB, 1/78 instance groups, 1/28 managed instance groups, 1/53 instance templates, 1/246 in-use IP addresses.

    Please see https://cloud.google.com/compute/docs/resource-quotas about requesting more quota.
    May 31, 2018 6:13:41 PM org.apache.beam.runners.dataflow.DataflowPipelineJob waitUntilFinish
    INFO: Job 2018-05-31_11_13_23-4188499526520433701 failed with status FAILED.
    May 31, 2018 6:13:41 PM org.apache.beam.runners.dataflow.TestDataflowRunner checkForPAssertSuccess
    INFO: Dataflow job 2018-05-31_11_13_23-4188499526520433701 terminated in failure state FAILED without reporting a failed assertion
    May 31, 2018 6:13:41 PM org.apache.beam.runners.dataflow.TestDataflowRunner run
    WARNING: Dataflow job 2018-05-31_11_13_23-4188499526520433701 did not output a success or failure metric.

org.apache.beam.sdk.io.jdbc.JdbcIOIT > testWriteThenRead FAILED
    java.lang.RuntimeException: Workflow failed. Causes: Project apache-beam-testing has insufficient quota(s) to execute this workflow with 1 instances in region us-central1. Quota summary (required/available): 1/4294 instances, 1/0 CPUs, 250/220 disk GB, 0/1998 SSD disk GB, 1/78 instance groups, 1/28 managed instance groups, 1/53 instance templates, 1/246 in-use IP addresses.

    Please see https://cloud.google.com/compute/docs/resource-quotas about requesting more quota.
        at org.apache.beam.runners.dataflow.TestDataflowRunner.run(TestDataflowRunner.java:134)
        at org.apache.beam.runners.dataflow.TestDataflowRunner.run(TestDataflowRunner.java:90)
        at org.apache.beam.runners.dataflow.TestDataflowRunner.run(TestDataflowRunner.java:55)
        at org.apache.beam.sdk.Pipeline.run(Pipeline.java:311)
        at org.apache.beam.sdk.testing.TestPipeline.run(TestPipeline.java:348)
        at org.apache.beam.sdk.testing.TestPipeline.run(TestPipeline.java:329)
        at org.apache.beam.sdk.io.jdbc.JdbcIOIT.runRead(JdbcIOIT.java:165)
        at org.apache.beam.sdk.io.jdbc.JdbcIOIT.testWriteThenRead(JdbcIOIT.java:99)

Gradle Test Executor 1 finished executing tests.

> Task :beam-sdks-java-io-jdbc:integrationTest FAILED

1 test completed, 1 failed
Finished generating test XML results (0.024 secs) into: <https://builds.apache.org/job/beam_PerformanceTests_JDBC/ws/src/sdks/java/io/jdbc/build/test-results/integrationTest>
Generating HTML test report...
Finished generating test html results (0.036 secs) into: <https://builds.apache.org/job/beam_PerformanceTests_JDBC/ws/src/sdks/java/io/jdbc/build/reports/tests/integrationTest>
:beam-sdks-java-io-jdbc:integrationTest (Thread[Task worker for ':' Thread 14,5,main]) completed. Took 6 mins 30.983 secs.

Deprecated Gradle features were used in this build, making it incompatible with Gradle 5.0.
See https://docs.gradle.org/4.7/userguide/command_line_interface.html#sec:command_line_warnings

BUILD FAILED in 6m 42s
62 actionable tasks: 1 executed, 61 up-to-date

Publishing build scan...
https://gradle.com/s/saj2mxo7o3st6


STDERR: 
FAILURE: Build failed with an exception.

* What went wrong:
Execution failed for task ':beam-sdks-java-io-jdbc:integrationTest'.
> There were failing tests. See the report at: file://<https://builds.apache.org/job/beam_PerformanceTests_JDBC/ws/src/sdks/java/io/jdbc/build/reports/tests/integrationTest/index.html>

* Try:
Run with --debug option to get more log output. Run with --scan to get full insights.

* Exception is:
org.gradle.api.tasks.TaskExecutionException: Execution failed for task ':beam-sdks-java-io-jdbc:integrationTest'.
	at org.gradle.api.internal.tasks.execution.ExecuteActionsTaskExecuter.executeActions(ExecuteActionsTaskExecuter.java:103)
	at org.gradle.api.internal.tasks.execution.ExecuteActionsTaskExecuter.execute(ExecuteActionsTaskExecuter.java:73)
	at org.gradle.api.internal.tasks.execution.OutputDirectoryCreatingTaskExecuter.execute(OutputDirectoryCreatingTaskExecuter.java:51)
	at org.gradle.api.internal.tasks.execution.SkipCachedTaskExecuter.execute(SkipCachedTaskExecuter.java:105)
	at org.gradle.api.internal.tasks.execution.SkipUpToDateTaskExecuter.execute(SkipUpToDateTaskExecuter.java:59)
	at org.gradle.api.internal.tasks.execution.ResolveTaskOutputCachingStateExecuter.execute(ResolveTaskOutputCachingStateExecuter.java:54)
	at org.gradle.api.internal.tasks.execution.ResolveBuildCacheKeyExecuter.execute(ResolveBuildCacheKeyExecuter.java:66)
	at org.gradle.api.internal.tasks.execution.ValidatingTaskExecuter.execute(ValidatingTaskExecuter.java:59)
	at org.gradle.api.internal.tasks.execution.SkipEmptySourceFilesTaskExecuter.execute(SkipEmptySourceFilesTaskExecuter.java:101)
	at org.gradle.api.internal.tasks.execution.FinalizeInputFilePropertiesTaskExecuter.execute(FinalizeInputFilePropertiesTaskExecuter.java:44)
	at org.gradle.api.internal.tasks.execution.CleanupStaleOutputsExecuter.execute(CleanupStaleOutputsExecuter.java:91)
	at org.gradle.api.internal.tasks.execution.ResolveTaskArtifactStateTaskExecuter.execute(ResolveTaskArtifactStateTaskExecuter.java:62)
	at org.gradle.api.internal.tasks.execution.SkipTaskWithNoActionsExecuter.execute(SkipTaskWithNoActionsExecuter.java:59)
	at org.gradle.api.internal.tasks.execution.SkipOnlyIfTaskExecuter.execute(SkipOnlyIfTaskExecuter.java:54)
	at org.gradle.api.internal.tasks.execution.ExecuteAtMostOnceTaskExecuter.execute(ExecuteAtMostOnceTaskExecuter.java:43)
	at org.gradle.api.internal.tasks.execution.CatchExceptionTaskExecuter.execute(CatchExceptionTaskExecuter.java:34)
	at org.gradle.execution.taskgraph.DefaultTaskGraphExecuter$EventFiringTaskWorker$1.run(DefaultTaskGraphExecuter.java:256)
	at org.gradle.internal.operations.DefaultBuildOperationExecutor$RunnableBuildOperationWorker.execute(DefaultBuildOperationExecutor.java:317)
	at org.gradle.internal.operations.DefaultBuildOperationExecutor$RunnableBuildOperationWorker.execute(DefaultBuildOperationExecutor.java:309)
	at org.gradle.internal.operations.DefaultBuildOperationExecutor.execute(DefaultBuildOperationExecutor.java:185)
	at org.gradle.internal.operations.DefaultBuildOperationExecutor.run(DefaultBuildOperationExecutor.java:97)
	at org.gradle.internal.operations.DelegatingBuildOperationExecutor.run(DelegatingBuildOperationExecutor.java:31)
	at org.gradle.execution.taskgraph.DefaultTaskGraphExecuter$EventFiringTaskWorker.execute(DefaultTaskGraphExecuter.java:249)
	at org.gradle.execution.taskgraph.DefaultTaskGraphExecuter$EventFiringTaskWorker.execute(DefaultTaskGraphExecuter.java:238)
	at org.gradle.execution.taskgraph.DefaultTaskPlanExecutor$TaskExecutorWorker$1.execute(DefaultTaskPlanExecutor.java:104)
	at org.gradle.execution.taskgraph.DefaultTaskPlanExecutor$TaskExecutorWorker$1.execute(DefaultTaskPlanExecutor.java:98)
	at org.gradle.execution.taskgraph.DefaultTaskExecutionPlan.execute(DefaultTaskExecutionPlan.java:663)
	at org.gradle.execution.taskgraph.DefaultTaskExecutionPlan.executeWithTask(DefaultTaskExecutionPlan.java:596)
	at org.gradle.execution.taskgraph.DefaultTaskPlanExecutor$TaskExecutorWorker.run(DefaultTaskPlanExecutor.java:98)
	at org.gradle.internal.concurrent.ExecutorPolicy$CatchAndRecordFailures.onExecute(ExecutorPolicy.java:63)
	at org.gradle.internal.concurrent.ManagedExecutorImpl$1.run(ManagedExecutorImpl.java:46)
	at org.gradle.internal.concurrent.ThreadFactoryImpl$ManagedThreadRunnable.run(ThreadFactoryImpl.java:55)
Caused by: org.gradle.api.GradleException: There were failing tests. See the report at: file://<https://builds.apache.org/job/beam_PerformanceTests_JDBC/ws/src/sdks/java/io/jdbc/build/reports/tests/integrationTest/index.html>
	at org.gradle.api.tasks.testing.AbstractTestTask.handleTestFailures(AbstractTestTask.java:612)
	at org.gradle.api.tasks.testing.AbstractTestTask.executeTests(AbstractTestTask.java:484)
	at org.gradle.api.tasks.testing.Test.executeTests(Test.java:583)
	at org.gradle.internal.reflect.JavaMethod.invoke(JavaMethod.java:73)
	at org.gradle.api.internal.project.taskfactory.StandardTaskAction.doExecute(StandardTaskAction.java:46)
	at org.gradle.api.internal.project.taskfactory.StandardTaskAction.execute(StandardTaskAction.java:39)
	at org.gradle.api.internal.project.taskfactory.StandardTaskAction.execute(StandardTaskAction.java:26)
	at org.gradle.api.internal.AbstractTask$TaskActionWrapper.execute(AbstractTask.java:794)
	at org.gradle.api.internal.AbstractTask$TaskActionWrapper.execute(AbstractTask.java:761)
	at org.gradle.api.internal.tasks.execution.ExecuteActionsTaskExecuter$1.run(ExecuteActionsTaskExecuter.java:124)
	at org.gradle.internal.operations.DefaultBuildOperationExecutor$RunnableBuildOperationWorker.execute(DefaultBuildOperationExecutor.java:317)
	at org.gradle.internal.operations.DefaultBuildOperationExecutor$RunnableBuildOperationWorker.execute(DefaultBuildOperationExecutor.java:309)
	at org.gradle.internal.operations.DefaultBuildOperationExecutor.execute(DefaultBuildOperationExecutor.java:185)
	at org.gradle.internal.operations.DefaultBuildOperationExecutor.run(DefaultBuildOperationExecutor.java:97)
	at org.gradle.internal.operations.DelegatingBuildOperationExecutor.run(DelegatingBuildOperationExecutor.java:31)
	at org.gradle.api.internal.tasks.execution.ExecuteActionsTaskExecuter.executeAction(ExecuteActionsTaskExecuter.java:113)
	at org.gradle.api.internal.tasks.execution.ExecuteActionsTaskExecuter.executeActions(ExecuteActionsTaskExecuter.java:95)
	... 31 more


* Get more help at https://help.gradle.org

2018-05-31 18:13:43,590 fc91c03b MainThread beam_integration_benchmark(1/1) ERROR    Error during benchmark beam_integration_benchmark
Traceback (most recent call last):
  File "<https://builds.apache.org/job/beam_PerformanceTests_JDBC/ws/PerfKitBenchmarker/perfkitbenchmarker/pkb.py",> line 667, in RunBenchmark
    DoRunPhase(spec, collector, detailed_timer)
  File "<https://builds.apache.org/job/beam_PerformanceTests_JDBC/ws/PerfKitBenchmarker/perfkitbenchmarker/pkb.py",> line 547, in DoRunPhase
    samples = spec.BenchmarkRun(spec)
  File "<https://builds.apache.org/job/beam_PerformanceTests_JDBC/ws/PerfKitBenchmarker/perfkitbenchmarker/linux_benchmarks/beam_integration_benchmark.py",> line 159, in Run
    job_type=job_type)
  File "<https://builds.apache.org/job/beam_PerformanceTests_JDBC/ws/PerfKitBenchmarker/perfkitbenchmarker/providers/gcp/gcp_dpb_dataflow.py",> line 90, in SubmitJob
    assert retcode == 0, "Integration Test Failed."
AssertionError: Integration Test Failed.
2018-05-31 18:13:43,591 fc91c03b MainThread beam_integration_benchmark(1/1) INFO     Cleaning up benchmark beam_integration_benchmark
2018-05-31 18:13:43,591 fc91c03b MainThread beam_integration_benchmark(1/1) INFO     Running: kubectl --kubeconfig=<https://builds.apache.org/job/beam_PerformanceTests_JDBC/ws/config-jdbcioit-664> delete -f <https://builds.apache.org/job/beam_PerformanceTests_JDBC/ws/src/.test-infra/kubernetes/postgres/postgres-service-for-local-dev.yml> --ignore-not-found
2018-05-31 18:13:43,958 fc91c03b MainThread beam_integration_benchmark(1/1) ERROR    Exception running benchmark
Traceback (most recent call last):
  File "<https://builds.apache.org/job/beam_PerformanceTests_JDBC/ws/PerfKitBenchmarker/perfkitbenchmarker/pkb.py",> line 801, in RunBenchmarkTask
    RunBenchmark(spec, collector)
  File "<https://builds.apache.org/job/beam_PerformanceTests_JDBC/ws/PerfKitBenchmarker/perfkitbenchmarker/pkb.py",> line 667, in RunBenchmark
    DoRunPhase(spec, collector, detailed_timer)
  File "<https://builds.apache.org/job/beam_PerformanceTests_JDBC/ws/PerfKitBenchmarker/perfkitbenchmarker/pkb.py",> line 547, in DoRunPhase
    samples = spec.BenchmarkRun(spec)
  File "<https://builds.apache.org/job/beam_PerformanceTests_JDBC/ws/PerfKitBenchmarker/perfkitbenchmarker/linux_benchmarks/beam_integration_benchmark.py",> line 159, in Run
    job_type=job_type)
  File "<https://builds.apache.org/job/beam_PerformanceTests_JDBC/ws/PerfKitBenchmarker/perfkitbenchmarker/providers/gcp/gcp_dpb_dataflow.py",> line 90, in SubmitJob
    assert retcode == 0, "Integration Test Failed."
AssertionError: Integration Test Failed.
2018-05-31 18:13:43,959 fc91c03b MainThread beam_integration_benchmark(1/1) ERROR    Benchmark 1/1 beam_integration_benchmark (UID: beam_integration_benchmark0) failed. Execution will continue.
2018-05-31 18:13:43,977 fc91c03b MainThread INFO     Benchmark run statuses:
---------------------------------------------------------------------------------
Name                        UID                          Status  Failed Substatus
---------------------------------------------------------------------------------
beam_integration_benchmark  beam_integration_benchmark0  FAILED                  
---------------------------------------------------------------------------------
Success rate: 0.00% (0/1)
2018-05-31 18:13:43,978 fc91c03b MainThread INFO     Complete logs can be found at: <https://builds.apache.org/job/beam_PerformanceTests_JDBC/ws/runs/fc91c03b/pkb.log>
2018-05-31 18:13:43,978 fc91c03b MainThread INFO     Completion statuses can be found at: <https://builds.apache.org/job/beam_PerformanceTests_JDBC/ws/runs/fc91c03b/completion_statuses.json>
Build step 'Execute shell' marked build as failure

Jenkins build is back to normal : beam_PerformanceTests_JDBC #665

Posted by Apache Jenkins Server <je...@builds.apache.org>.
See <https://builds.apache.org/job/beam_PerformanceTests_JDBC/665/display/redirect?page=changes>