You are viewing a plain text version of this content. The canonical link for it is here.
Posted to dev@kafka.apache.org by Apache Jenkins Server <je...@builds.apache.org> on 2017/08/16 13:11:06 UTC
Build failed in Jenkins: kafka-trunk-jdk7 #2643
See <https://builds.apache.org/job/kafka-trunk-jdk7/2643/display/redirect?page=changes>
Changes:
[ismael] KAFKA-5737; KafkaAdminClient thread should be daemon
------------------------------------------
[...truncated 913.21 KB...]
kafka.server.ServerStartupTest > testBrokerCreatesZKChroot STARTED
kafka.server.ServerStartupTest > testBrokerCreatesZKChroot PASSED
kafka.server.ServerStartupTest > testConflictBrokerStartupWithSamePort STARTED
kafka.server.ServerStartupTest > testConflictBrokerStartupWithSamePort PASSED
kafka.server.ServerStartupTest > testConflictBrokerRegistration STARTED
kafka.server.ServerStartupTest > testConflictBrokerRegistration PASSED
kafka.server.ServerStartupTest > testBrokerSelfAware STARTED
kafka.server.ServerStartupTest > testBrokerSelfAware PASSED
kafka.server.SessionExpireListenerTest > testSessionExpireListenerMetrics STARTED
kafka.server.SessionExpireListenerTest > testSessionExpireListenerMetrics PASSED
kafka.server.ProduceRequestTest > testSimpleProduceRequest STARTED
kafka.server.ProduceRequestTest > testSimpleProduceRequest PASSED
kafka.server.ProduceRequestTest > testCorruptLz4ProduceRequest STARTED
kafka.server.ProduceRequestTest > testCorruptLz4ProduceRequest PASSED
kafka.server.ReplicaFetcherThreadFatalErrorTest > testFatalErrorInProcessFetchRequest STARTED
kafka.server.ReplicaFetcherThreadFatalErrorTest > testFatalErrorInProcessFetchRequest PASSED
kafka.server.ReplicaFetcherThreadFatalErrorTest > testFatalErrorInAddPartitions STARTED
kafka.server.ReplicaFetcherThreadFatalErrorTest > testFatalErrorInAddPartitions PASSED
kafka.server.DeleteTopicsRequestTest > testValidDeleteTopicRequests STARTED
kafka.server.DeleteTopicsRequestTest > testValidDeleteTopicRequests PASSED
kafka.server.DeleteTopicsRequestTest > testErrorDeleteTopicRequests STARTED
kafka.server.DeleteTopicsRequestTest > testErrorDeleteTopicRequests PASSED
kafka.server.DeleteTopicsRequestTest > testNotController STARTED
kafka.server.DeleteTopicsRequestTest > testNotController PASSED
kafka.server.SimpleFetchTest > testReadFromLog STARTED
kafka.server.SimpleFetchTest > testReadFromLog PASSED
kafka.common.ZkNodeChangeNotificationListenerTest > testProcessNotification STARTED
kafka.common.ZkNodeChangeNotificationListenerTest > testProcessNotification PASSED
kafka.common.ConfigTest > testInvalidGroupIds STARTED
kafka.common.ConfigTest > testInvalidGroupIds PASSED
kafka.common.ConfigTest > testInvalidClientIds STARTED
kafka.common.ConfigTest > testInvalidClientIds PASSED
kafka.common.InterBrokerSendThreadTest > shouldCreateClientRequestAndSendWhenNodeIsReady STARTED
kafka.common.InterBrokerSendThreadTest > shouldCreateClientRequestAndSendWhenNodeIsReady PASSED
kafka.common.InterBrokerSendThreadTest > shouldCallCompletionHandlerWithDisconnectedResponseWhenNodeNotReady STARTED
kafka.common.InterBrokerSendThreadTest > shouldCallCompletionHandlerWithDisconnectedResponseWhenNodeNotReady PASSED
kafka.common.InterBrokerSendThreadTest > shouldNotSendAnythingWhenNoRequests STARTED
kafka.common.InterBrokerSendThreadTest > shouldNotSendAnythingWhenNoRequests PASSED
unit.kafka.admin.ResetConsumerGroupOffsetTest > testResetOffsetsShiftByHigherThanLatest STARTED
unit.kafka.admin.ResetConsumerGroupOffsetTest > testResetOffsetsShiftByHigherThanLatest PASSED
unit.kafka.admin.ResetConsumerGroupOffsetTest > testResetOffsetsShiftMinus STARTED
unit.kafka.admin.ResetConsumerGroupOffsetTest > testResetOffsetsShiftMinus PASSED
unit.kafka.admin.ResetConsumerGroupOffsetTest > testResetOffsetsToCurrentOffset STARTED
unit.kafka.admin.ResetConsumerGroupOffsetTest > testResetOffsetsToCurrentOffset PASSED
unit.kafka.admin.ResetConsumerGroupOffsetTest > testResetOffsetsToEarliestOnOneTopicAndPartition STARTED
unit.kafka.admin.ResetConsumerGroupOffsetTest > testResetOffsetsToEarliestOnOneTopicAndPartition PASSED
unit.kafka.admin.ResetConsumerGroupOffsetTest > testResetOffsetsByDurationToEarliest STARTED
unit.kafka.admin.ResetConsumerGroupOffsetTest > testResetOffsetsByDurationToEarliest PASSED
unit.kafka.admin.ResetConsumerGroupOffsetTest > testResetOffsetsToEarliestOnOneTopic STARTED
unit.kafka.admin.ResetConsumerGroupOffsetTest > testResetOffsetsToEarliestOnOneTopic PASSED
unit.kafka.admin.ResetConsumerGroupOffsetTest > testResetOffsetsNotExistingGroup STARTED
unit.kafka.admin.ResetConsumerGroupOffsetTest > testResetOffsetsNotExistingGroup PASSED
unit.kafka.admin.ResetConsumerGroupOffsetTest > testResetOffsetsToZonedDateTime STARTED
unit.kafka.admin.ResetConsumerGroupOffsetTest > testResetOffsetsToZonedDateTime PASSED
unit.kafka.admin.ResetConsumerGroupOffsetTest > testResetOffsetsToEarliest STARTED
unit.kafka.admin.ResetConsumerGroupOffsetTest > testResetOffsetsToEarliest PASSED
unit.kafka.admin.ResetConsumerGroupOffsetTest > testResetOffsetsExportImportPlan STARTED
unit.kafka.admin.ResetConsumerGroupOffsetTest > testResetOffsetsExportImportPlan PASSED
unit.kafka.admin.ResetConsumerGroupOffsetTest > testResetOffsetsToSpecificOffset STARTED
unit.kafka.admin.ResetConsumerGroupOffsetTest > testResetOffsetsToSpecificOffset PASSED
unit.kafka.admin.ResetConsumerGroupOffsetTest > testResetOffsetsShiftPlus STARTED
unit.kafka.admin.ResetConsumerGroupOffsetTest > testResetOffsetsShiftPlus PASSED
unit.kafka.admin.ResetConsumerGroupOffsetTest > testResetOffsetsToLatest STARTED
unit.kafka.admin.ResetConsumerGroupOffsetTest > testResetOffsetsToLatest PASSED
unit.kafka.admin.ResetConsumerGroupOffsetTest > testResetOffsetsNewConsumerExistingTopic STARTED
unit.kafka.admin.ResetConsumerGroupOffsetTest > testResetOffsetsNewConsumerExistingTopic PASSED
unit.kafka.admin.ResetConsumerGroupOffsetTest > testResetOffsetsShiftByLowerThanEarliest STARTED
unit.kafka.admin.ResetConsumerGroupOffsetTest > testResetOffsetsShiftByLowerThanEarliest PASSED
unit.kafka.admin.ResetConsumerGroupOffsetTest > testResetOffsetsByDuration STARTED
unit.kafka.admin.ResetConsumerGroupOffsetTest > testResetOffsetsByDuration PASSED
unit.kafka.admin.ResetConsumerGroupOffsetTest > testResetOffsetsToLocalDateTime STARTED
unit.kafka.admin.ResetConsumerGroupOffsetTest > testResetOffsetsToLocalDateTime PASSED
unit.kafka.admin.ResetConsumerGroupOffsetTest > testResetOffsetsToEarliestOnTopicsAndPartitions STARTED
unit.kafka.admin.ResetConsumerGroupOffsetTest > testResetOffsetsToEarliestOnTopicsAndPartitions PASSED
unit.kafka.admin.ResetConsumerGroupOffsetTest > testResetOffsetsToEarliestOnTopics STARTED
unit.kafka.admin.ResetConsumerGroupOffsetTest > testResetOffsetsToEarliestOnTopics PASSED
unit.kafka.server.KafkaApisTest > shouldRespondWithUnsupportedForMessageFormatOnHandleWriteTxnMarkersWhenMagicLowerThanRequired STARTED
unit.kafka.server.KafkaApisTest > shouldRespondWithUnsupportedForMessageFormatOnHandleWriteTxnMarkersWhenMagicLowerThanRequired PASSED
unit.kafka.server.KafkaApisTest > shouldThrowUnsupportedVersionExceptionOnHandleTxnOffsetCommitRequestWhenInterBrokerProtocolNotSupported STARTED
unit.kafka.server.KafkaApisTest > shouldThrowUnsupportedVersionExceptionOnHandleTxnOffsetCommitRequestWhenInterBrokerProtocolNotSupported PASSED
unit.kafka.server.KafkaApisTest > shouldThrowUnsupportedVersionExceptionOnHandleAddPartitionsToTxnRequestWhenInterBrokerProtocolNotSupported STARTED
unit.kafka.server.KafkaApisTest > shouldThrowUnsupportedVersionExceptionOnHandleAddPartitionsToTxnRequestWhenInterBrokerProtocolNotSupported PASSED
unit.kafka.server.KafkaApisTest > testReadUncommittedConsumerListOffsetLatest STARTED
unit.kafka.server.KafkaApisTest > testReadUncommittedConsumerListOffsetLatest PASSED
unit.kafka.server.KafkaApisTest > shouldAppendToLogOnWriteTxnMarkersWhenCorrectMagicVersion STARTED
unit.kafka.server.KafkaApisTest > shouldAppendToLogOnWriteTxnMarkersWhenCorrectMagicVersion PASSED
unit.kafka.server.KafkaApisTest > shouldThrowUnsupportedVersionExceptionOnHandleWriteTxnMarkersRequestWhenInterBrokerProtocolNotSupported STARTED
unit.kafka.server.KafkaApisTest > shouldThrowUnsupportedVersionExceptionOnHandleWriteTxnMarkersRequestWhenInterBrokerProtocolNotSupported PASSED
unit.kafka.server.KafkaApisTest > shouldRespondWithUnknownTopicWhenPartitionIsNotHosted STARTED
unit.kafka.server.KafkaApisTest > shouldRespondWithUnknownTopicWhenPartitionIsNotHosted PASSED
unit.kafka.server.KafkaApisTest > testReadCommittedConsumerListOffsetEarliestOffsetEqualsLastStableOffset STARTED
unit.kafka.server.KafkaApisTest > testReadCommittedConsumerListOffsetEarliestOffsetEqualsLastStableOffset PASSED
unit.kafka.server.KafkaApisTest > testReadCommittedConsumerListOffsetLatest STARTED
unit.kafka.server.KafkaApisTest > testReadCommittedConsumerListOffsetLatest PASSED
unit.kafka.server.KafkaApisTest > testReadCommittedConsumerListOffsetLimitedAtLastStableOffset STARTED
unit.kafka.server.KafkaApisTest > testReadCommittedConsumerListOffsetLimitedAtLastStableOffset PASSED
unit.kafka.server.KafkaApisTest > testReadUncommittedConsumerListOffsetEarliestOffsetEqualsHighWatermark STARTED
unit.kafka.server.KafkaApisTest > testReadUncommittedConsumerListOffsetEarliestOffsetEqualsHighWatermark PASSED
unit.kafka.server.KafkaApisTest > testReadUncommittedConsumerListOffsetLimitedAtHighWatermark STARTED
unit.kafka.server.KafkaApisTest > testReadUncommittedConsumerListOffsetLimitedAtHighWatermark PASSED
unit.kafka.server.KafkaApisTest > shouldThrowUnsupportedVersionExceptionOnHandleAddOffsetToTxnRequestWhenInterBrokerProtocolNotSupported STARTED
unit.kafka.server.KafkaApisTest > shouldThrowUnsupportedVersionExceptionOnHandleAddOffsetToTxnRequestWhenInterBrokerProtocolNotSupported PASSED
unit.kafka.server.KafkaApisTest > shouldRespondWithUnsupportedMessageFormatForBadPartitionAndNoErrorsForGoodPartition STARTED
unit.kafka.server.KafkaApisTest > shouldRespondWithUnsupportedMessageFormatForBadPartitionAndNoErrorsForGoodPartition PASSED
unit.kafka.server.KafkaApisTest > shouldThrowUnsupportedVersionExceptionOnHandleEndTxnRequestWhenInterBrokerProtocolNotSupported STARTED
unit.kafka.server.KafkaApisTest > shouldThrowUnsupportedVersionExceptionOnHandleEndTxnRequestWhenInterBrokerProtocolNotSupported PASSED
unit.kafka.server.KafkaApisTest > shouldRespondWithUnknownTopicOrPartitionForBadPartitionAndNoErrorsForGoodPartition STARTED
unit.kafka.server.KafkaApisTest > shouldRespondWithUnknownTopicOrPartitionForBadPartitionAndNoErrorsForGoodPartition PASSED
1546 tests completed, 1 failed, 4 skipped
:kafka-trunk-jdk7:core:test FAILED
:test_core_2_11 FAILED
FAILURE: Build failed with an exception.
* What went wrong:
Execution failed for task ':kafka-trunk-jdk7:core:test'.
> There were failing tests. See the report at: file://<https://builds.apache.org/job/kafka-trunk-jdk7/ws/core/build/reports/tests/test/index.html>
* Try:
Run with --stacktrace option to get the stack trace. Run with --info or --debug option to get more log output.
* Get more help at https://help.gradle.org
BUILD FAILED in 47m 30s
16 actionable tasks: 13 executed, 3 up-to-date
Build step 'Execute shell' marked build as failure
[FINDBUGS] Collecting findbugs analysis files...
Setting GRADLE_3_4_RC_2_HOME=/home/jenkins/jenkins-slave/tools/hudson.plugins.gradle.GradleInstallation/Gradle_3.4-rc-2
[FINDBUGS] Searching for all files in <https://builds.apache.org/job/kafka-trunk-jdk7/ws/> that match the pattern **/build/reports/findbugs/*.xml
[FINDBUGS] Parsing 1 file in <https://builds.apache.org/job/kafka-trunk-jdk7/ws/>
[FINDBUGS] Successfully parsed file <https://builds.apache.org/job/kafka-trunk-jdk7/ws/core/build/reports/findbugs/main.xml> with 0 unique warnings and 0 duplicates.
Setting GRADLE_3_4_RC_2_HOME=/home/jenkins/jenkins-slave/tools/hudson.plugins.gradle.GradleInstallation/Gradle_3.4-rc-2
Setting GRADLE_3_4_RC_2_HOME=/home/jenkins/jenkins-slave/tools/hudson.plugins.gradle.GradleInstallation/Gradle_3.4-rc-2
<Git Blamer> Using GitBlamer to create author and commit information for all warnings.
<Git Blamer> GIT_COMMIT=bf34a5b74035a90a7461ac8c8a209da450c0346b, workspace=<https://builds.apache.org/job/kafka-trunk-jdk7/ws/>
[FINDBUGS] Computing warning deltas based on reference build #2642
Recording test results
Setting GRADLE_3_4_RC_2_HOME=/home/jenkins/jenkins-slave/tools/hudson.plugins.gradle.GradleInstallation/Gradle_3.4-rc-2
Setting GRADLE_3_4_RC_2_HOME=/home/jenkins/jenkins-slave/tools/hudson.plugins.gradle.GradleInstallation/Gradle_3.4-rc-2
Not sending mail to unregistered user ismael@juma.me.uk
Jenkins build is back to normal : kafka-trunk-jdk7 #2645
Posted by Apache Jenkins Server <je...@builds.apache.org>.
See <https://builds.apache.org/job/kafka-trunk-jdk7/2645/display/redirect?page=changes>
Build failed in Jenkins: kafka-trunk-jdk7 #2644
Posted by Apache Jenkins Server <je...@builds.apache.org>.
See <https://builds.apache.org/job/kafka-trunk-jdk7/2644/display/redirect>
------------------------------------------
[...truncated 915.58 KB...]
kafka.controller.ControllerFailoverTest > testHandleIllegalStateException STARTED
kafka.controller.ControllerFailoverTest > testHandleIllegalStateException PASSED
kafka.javaapi.consumer.ZookeeperConsumerConnectorTest > testBasic STARTED
kafka.javaapi.consumer.ZookeeperConsumerConnectorTest > testBasic PASSED
kafka.javaapi.message.ByteBufferMessageSetTest > testSizeInBytesWithCompression STARTED
kafka.javaapi.message.ByteBufferMessageSetTest > testSizeInBytesWithCompression PASSED
kafka.javaapi.message.ByteBufferMessageSetTest > testIteratorIsConsistentWithCompression STARTED
kafka.javaapi.message.ByteBufferMessageSetTest > testIteratorIsConsistentWithCompression PASSED
kafka.javaapi.message.ByteBufferMessageSetTest > testIteratorIsConsistent STARTED
kafka.javaapi.message.ByteBufferMessageSetTest > testIteratorIsConsistent PASSED
kafka.javaapi.message.ByteBufferMessageSetTest > testEqualsWithCompression STARTED
kafka.javaapi.message.ByteBufferMessageSetTest > testEqualsWithCompression PASSED
kafka.javaapi.message.ByteBufferMessageSetTest > testWrittenEqualsRead STARTED
kafka.javaapi.message.ByteBufferMessageSetTest > testWrittenEqualsRead PASSED
kafka.javaapi.message.ByteBufferMessageSetTest > testEquals STARTED
kafka.javaapi.message.ByteBufferMessageSetTest > testEquals PASSED
kafka.javaapi.message.ByteBufferMessageSetTest > testSizeInBytes STARTED
kafka.javaapi.message.ByteBufferMessageSetTest > testSizeInBytes PASSED
kafka.network.SocketServerTest > testGracefulClose STARTED
kafka.network.SocketServerTest > testGracefulClose PASSED
kafka.network.SocketServerTest > testConnectionIdReuse STARTED
kafka.network.SocketServerTest > testConnectionIdReuse PASSED
kafka.network.SocketServerTest > testClientDisconnectionUpdatesRequestMetrics STARTED
kafka.network.SocketServerTest > testClientDisconnectionUpdatesRequestMetrics PASSED
kafka.network.SocketServerTest > testProcessorMetricsTags STARTED
kafka.network.SocketServerTest > testProcessorMetricsTags PASSED
kafka.network.SocketServerTest > testMaxConnectionsPerIp STARTED
kafka.network.SocketServerTest > testMaxConnectionsPerIp PASSED
kafka.network.SocketServerTest > testConnectionId STARTED
kafka.network.SocketServerTest > testConnectionId PASSED
kafka.network.SocketServerTest > testBrokerSendAfterChannelClosedUpdatesRequestMetrics STARTED
kafka.network.SocketServerTest > testBrokerSendAfterChannelClosedUpdatesRequestMetrics PASSED
kafka.network.SocketServerTest > simpleRequest STARTED
kafka.network.SocketServerTest > simpleRequest PASSED
kafka.network.SocketServerTest > testIdleConnection STARTED
kafka.network.SocketServerTest > testIdleConnection FAILED
java.lang.AssertionError: Channel removed without processing staging receives
at org.junit.Assert.fail(Assert.java:88)
at org.junit.Assert.assertTrue(Assert.java:41)
at kafka.network.SocketServerTest.testIdleConnection(SocketServerTest.scala:242)
kafka.network.SocketServerTest > testMetricCollectionAfterShutdown STARTED
kafka.network.SocketServerTest > testMetricCollectionAfterShutdown PASSED
kafka.network.SocketServerTest > testSessionPrincipal STARTED
kafka.network.SocketServerTest > testSessionPrincipal PASSED
kafka.network.SocketServerTest > testMaxConnectionsPerIpOverrides STARTED
kafka.network.SocketServerTest > testMaxConnectionsPerIpOverrides PASSED
kafka.network.SocketServerTest > testSocketsCloseOnShutdown STARTED
kafka.network.SocketServerTest > testSocketsCloseOnShutdown PASSED
kafka.network.SocketServerTest > testSslSocketServer STARTED
kafka.network.SocketServerTest > testSslSocketServer PASSED
kafka.network.SocketServerTest > tooBigRequestIsRejected STARTED
kafka.network.SocketServerTest > tooBigRequestIsRejected PASSED
kafka.integration.PrimitiveApiTest > testMultiProduce STARTED
kafka.integration.PrimitiveApiTest > testMultiProduce PASSED
kafka.integration.PrimitiveApiTest > testDefaultEncoderProducerAndFetch STARTED
kafka.integration.PrimitiveApiTest > testDefaultEncoderProducerAndFetch PASSED
kafka.integration.PrimitiveApiTest > testFetchRequestCanProperlySerialize STARTED
kafka.integration.PrimitiveApiTest > testFetchRequestCanProperlySerialize PASSED
kafka.integration.PrimitiveApiTest > testPipelinedProduceRequests STARTED
kafka.integration.PrimitiveApiTest > testPipelinedProduceRequests PASSED
kafka.integration.PrimitiveApiTest > testProduceAndMultiFetch STARTED
kafka.integration.PrimitiveApiTest > testProduceAndMultiFetch PASSED
kafka.integration.PrimitiveApiTest > testDefaultEncoderProducerAndFetchWithCompression STARTED
kafka.integration.PrimitiveApiTest > testDefaultEncoderProducerAndFetchWithCompression PASSED
kafka.integration.PrimitiveApiTest > testConsumerEmptyTopic STARTED
kafka.integration.PrimitiveApiTest > testConsumerEmptyTopic PASSED
kafka.integration.PrimitiveApiTest > testEmptyFetchRequest STARTED
kafka.integration.PrimitiveApiTest > testEmptyFetchRequest PASSED
kafka.integration.MetricsDuringTopicCreationDeletionTest > testMetricsDuringTopicCreateDelete STARTED
kafka.integration.MetricsDuringTopicCreationDeletionTest > testMetricsDuringTopicCreateDelete PASSED
kafka.integration.UncleanLeaderElectionTest > testUncleanLeaderElectionEnabled STARTED
kafka.integration.UncleanLeaderElectionTest > testUncleanLeaderElectionEnabled PASSED
kafka.integration.UncleanLeaderElectionTest > testCleanLeaderElectionDisabledByTopicOverride STARTED
kafka.integration.UncleanLeaderElectionTest > testCleanLeaderElectionDisabledByTopicOverride SKIPPED
kafka.integration.UncleanLeaderElectionTest > testUncleanLeaderElectionDisabled STARTED
kafka.integration.UncleanLeaderElectionTest > testUncleanLeaderElectionDisabled SKIPPED
kafka.integration.UncleanLeaderElectionTest > testUncleanLeaderElectionInvalidTopicOverride STARTED
kafka.integration.UncleanLeaderElectionTest > testUncleanLeaderElectionInvalidTopicOverride PASSED
kafka.integration.UncleanLeaderElectionTest > testUncleanLeaderElectionEnabledByTopicOverride STARTED
kafka.integration.UncleanLeaderElectionTest > testUncleanLeaderElectionEnabledByTopicOverride PASSED
kafka.integration.MinIsrConfigTest > testDefaultKafkaConfig STARTED
kafka.integration.MinIsrConfigTest > testDefaultKafkaConfig PASSED
kafka.integration.TopicMetadataTest > testIsrAfterBrokerShutDownAndJoinsBack STARTED
kafka.integration.TopicMetadataTest > testIsrAfterBrokerShutDownAndJoinsBack PASSED
kafka.integration.TopicMetadataTest > testAutoCreateTopicWithCollision STARTED
kafka.integration.TopicMetadataTest > testAutoCreateTopicWithCollision PASSED
kafka.integration.TopicMetadataTest > testAliveBrokerListWithNoTopics STARTED
kafka.integration.TopicMetadataTest > testAliveBrokerListWithNoTopics PASSED
kafka.integration.TopicMetadataTest > testAutoCreateTopic STARTED
kafka.integration.TopicMetadataTest > testAutoCreateTopic PASSED
kafka.integration.TopicMetadataTest > testGetAllTopicMetadata STARTED
kafka.integration.TopicMetadataTest > testGetAllTopicMetadata PASSED
kafka.integration.TopicMetadataTest > testAliveBrokersListWithNoTopicsAfterNewBrokerStartup STARTED
kafka.integration.TopicMetadataTest > testAliveBrokersListWithNoTopicsAfterNewBrokerStartup PASSED
kafka.integration.TopicMetadataTest > testBasicTopicMetadata STARTED
kafka.integration.TopicMetadataTest > testBasicTopicMetadata PASSED
kafka.integration.TopicMetadataTest > testAutoCreateTopicWithInvalidReplication STARTED
kafka.integration.TopicMetadataTest > testAutoCreateTopicWithInvalidReplication PASSED
kafka.integration.TopicMetadataTest > testAliveBrokersListWithNoTopicsAfterABrokerShutdown STARTED
kafka.integration.TopicMetadataTest > testAliveBrokersListWithNoTopicsAfterABrokerShutdown PASSED
kafka.integration.AutoOffsetResetTest > testResetToLatestWhenOffsetTooLow STARTED
kafka.integration.AutoOffsetResetTest > testResetToLatestWhenOffsetTooLow PASSED
kafka.integration.AutoOffsetResetTest > testResetToEarliestWhenOffsetTooLow STARTED
kafka.integration.AutoOffsetResetTest > testResetToEarliestWhenOffsetTooLow PASSED
kafka.integration.AutoOffsetResetTest > testResetToEarliestWhenOffsetTooHigh STARTED
kafka.integration.AutoOffsetResetTest > testResetToEarliestWhenOffsetTooHigh PASSED
kafka.integration.AutoOffsetResetTest > testResetToLatestWhenOffsetTooHigh STARTED
kafka.integration.AutoOffsetResetTest > testResetToLatestWhenOffsetTooHigh PASSED
kafka.integration.FetcherTest > testFetcher STARTED
kafka.integration.FetcherTest > testFetcher PASSED
1546 tests completed, 2 failed, 4 skipped
:kafka-trunk-jdk7:core:test FAILED
:test_core_2_11 FAILED
FAILURE: Build failed with an exception.
* What went wrong:
Execution failed for task ':kafka-trunk-jdk7:core:test'.
> There were failing tests. See the report at: file://<https://builds.apache.org/job/kafka-trunk-jdk7/ws/core/build/reports/tests/test/index.html>
* Try:
Run with --stacktrace option to get the stack trace. Run with --info or --debug option to get more log output.
* Get more help at https://help.gradle.org
BUILD FAILED in 48m 17s
16 actionable tasks: 13 executed, 3 up-to-date
Build step 'Execute shell' marked build as failure
[FINDBUGS] Collecting findbugs analysis files...
Setting GRADLE_3_4_RC_2_HOME=/home/jenkins/jenkins-slave/tools/hudson.plugins.gradle.GradleInstallation/Gradle_3.4-rc-2
[FINDBUGS] Searching for all files in <https://builds.apache.org/job/kafka-trunk-jdk7/ws/> that match the pattern **/build/reports/findbugs/*.xml
[FINDBUGS] Parsing 1 file in <https://builds.apache.org/job/kafka-trunk-jdk7/ws/>
[FINDBUGS] Successfully parsed file <https://builds.apache.org/job/kafka-trunk-jdk7/ws/core/build/reports/findbugs/main.xml> with 0 unique warnings and 0 duplicates.
Setting GRADLE_3_4_RC_2_HOME=/home/jenkins/jenkins-slave/tools/hudson.plugins.gradle.GradleInstallation/Gradle_3.4-rc-2
Setting GRADLE_3_4_RC_2_HOME=/home/jenkins/jenkins-slave/tools/hudson.plugins.gradle.GradleInstallation/Gradle_3.4-rc-2
<Git Blamer> Using GitBlamer to create author and commit information for all warnings.
<Git Blamer> GIT_COMMIT=bf34a5b74035a90a7461ac8c8a209da450c0346b, workspace=<https://builds.apache.org/job/kafka-trunk-jdk7/ws/>
[FINDBUGS] Computing warning deltas based on reference build #2642
Recording test results
Setting GRADLE_3_4_RC_2_HOME=/home/jenkins/jenkins-slave/tools/hudson.plugins.gradle.GradleInstallation/Gradle_3.4-rc-2
Setting GRADLE_3_4_RC_2_HOME=/home/jenkins/jenkins-slave/tools/hudson.plugins.gradle.GradleInstallation/Gradle_3.4-rc-2
Not sending mail to unregistered user ismael@juma.me.uk