You are viewing a plain text version of this content. The canonical link for it is here.
Posted to builds@solr.apache.org by Apache Jenkins Server <je...@builds.apache.org> on 2023/11/22 22:14:58 UTC

[JENKINS] Solr » Solr-Check-main - Build # 8427 - Still Failing!

Build: https://ci-builds.apache.org/job/Solr/job/Solr-Check-main/8427/

All tests passed

Build Log:
[...truncated 1288 lines...]
BUILD FAILED in 37m
641 actionable tasks: 641 executed

Publishing build scan...
https://ge.apache.org/s/gnyjqsfvgrmf2

Build step 'Invoke Gradle script' changed build result to FAILURE
Build step 'Invoke Gradle script' marked build as failure
Archiving artifacts
Recording test results
[Checks API] No suitable checks publisher found.
Email was triggered for: Failure - Any
Sending email for trigger: Failure - Any

[JENKINS] Solr » Solr-Check-main - Build # 8434 - Still Failing!

Posted by Apache Jenkins Server <je...@builds.apache.org>.
Build: https://ci-builds.apache.org/job/Solr/job/Solr-Check-main/8434/

All tests passed

Build Log:
[...truncated 1289 lines...]
BUILD FAILED in 42m 26s
641 actionable tasks: 641 executed

Publishing build scan...
https://ge.apache.org/s/v3ypp65ydu45k

Build step 'Invoke Gradle script' changed build result to FAILURE
Build step 'Invoke Gradle script' marked build as failure
Archiving artifacts
Recording test results
[Checks API] No suitable checks publisher found.
Email was triggered for: Failure - Any
Sending email for trigger: Failure - Any

[JENKINS] Solr » Solr-Check-main - Build # 8433 - Still Failing!

Posted by Apache Jenkins Server <je...@builds.apache.org>.
Build: https://ci-builds.apache.org/job/Solr/job/Solr-Check-main/8433/

All tests passed

Build Log:
[...truncated 1309 lines...]
#   ERROR: IOException occurred when talking to server at: https://localhost:35731/solr/test/select
#
#   org.apache.solr.client.solrj.SolrServerException: IOException occurred when talking to server at: https://localhost:35731/solr/test/select
#   	at org.apache.solr.client.solrj.impl.Http2SolrClient.request(Http2SolrClient.java:550)
#   	at org.apache.solr.client.solrj.SolrClient.request(SolrClient.java:1193)
#   	at org.apache.solr.cli.ApiTool.callGet(ApiTool.java:97)
#   	at org.apache.solr.cli.ApiTool.runImpl(ApiTool.java:69)
#   	at org.apache.solr.cli.ToolBase.runTool(ToolBase.java:52)
#   	at org.apache.solr.cli.SolrCLI.main(SolrCLI.java:161)
#   Caused by: java.nio.channels.ClosedChannelException
#   	at org.eclipse.jetty.http2.HTTP2Session$StreamsState.onShutdown(HTTP2Session.java:1865)
#   	at org.eclipse.jetty.http2.HTTP2Session.onShutdown(HTTP2Session.java:1036)
#   	at org.eclipse.jetty.http2.HTTP2Connection$HTTP2Producer.produce(HTTP2Connection.java:385)
#   	at org.eclipse.jetty.util.thread.strategy.AdaptiveExecutionStrategy.produceTask(AdaptiveExecutionStrategy.java:455)
#   	at org.eclipse.jetty.util.thread.strategy.AdaptiveExecutionStrategy.tryProduce(AdaptiveExecutionStrategy.java:248)
#   	at org.eclipse.jetty.util.thread.strategy.AdaptiveExecutionStrategy.produce(AdaptiveExecutionStrategy.java:193)
#   	at org.eclipse.jetty.http2.HTTP2Connection.produce(HTTP2Connection.java:208)
#   	at org.eclipse.jetty.http2.client.HTTP2ClientConnectionFactory$HTTP2ClientConnection.succeeded(HTTP2ClientConnectionFactory.java:174)
#   	at org.eclipse.jetty.util.Callback$Nested.succeeded(Callback.java:392)
#   	at org.eclipse.jetty.util.CountingCallback.succeeded(CountingCallback.java:63)
#   	at org.eclipse.jetty.util.Callback$Nested.succeeded(Callback.java:392)
#   	at org.eclipse.jetty.http2.HTTP2Session$ControlEntry.succeeded(HTTP2Session.java:1377)
#   	at java.base/java.util.ArrayList.forEach(ArrayList.java:1541)
#   	at org.eclipse.jetty.http2.HTTP2Flusher.finish(HTTP2Flusher.java:323)
#   	at org.eclipse.jetty.http2.HTTP2Flusher.succeeded(HTTP2Flusher.java:315)
#   	at org.eclipse.jetty.io.WriteFlusher.write(WriteFlusher.java:291)
#   	at org.eclipse.jetty.io.WriteFlusher.write(WriteFlusher.java:254)
#   	at org.eclipse.jetty.io.AbstractEndPoint.write(AbstractEndPoint.java:386)
#   	at org.eclipse.jetty.http2.HTTP2Flusher.process(HTTP2Flusher.java:292)
#   	at org.eclipse.jetty.util.IteratingCallback.processing(IteratingCallback.java:243)
#   	at org.eclipse.jetty.util.IteratingCallback.iterate(IteratingCallback.java:224)
#   	at org.eclipse.jetty.http2.HTTP2Session.frame(HTTP2Session.java:821)
#   	at org.eclipse.jetty.http2.HTTP2Session.frames(HTTP2Session.java:793)
#   	at org.eclipse.jetty.http2.client.HTTP2ClientConnectionFactory$HTTP2ClientConnection.onOpen(HTTP2ClientConnectionFactory.java:161)
#   	at org.eclipse.jetty.io.AbstractEndPoint.upgrade(AbstractEndPoint.java:451)
#   	at org.eclipse.jetty.io.NegotiatingClientConnection.replaceConnection(NegotiatingClientConnection.java:117)
#   	at org.eclipse.jetty.io.NegotiatingClientConnection.onFillable(NegotiatingClientConnection.java:87)
#   	at org.eclipse.jetty.io.AbstractConnection$ReadCallback.succeeded(AbstractConnection.java:314)
#   	at org.eclipse.jetty.io.FillInterest.fillable(FillInterest.java:100)
#   	at org.eclipse.jetty.io.ssl.SslConnection$DecryptedEndPoint.onFillable(SslConnection.java:558)
#   	at org.eclipse.jetty.io.ssl.SslConnection.onFillable(SslConnection.java:379)
#   	at org.eclipse.jetty.io.ssl.SslConnection$2.succeeded(SslConnection.java:146)
#   	at org.eclipse.jetty.io.FillInterest.fillable(FillInterest.java:100)
#   	at org.eclipse.jetty.io.SelectableChannelEndPoint$1.run(SelectableChannelEndPoint.java:53)
#   	at org.apache.solr.common.util.ExecutorUtil$MDCAwareThreadPoolExecutor.lambda$execute$0(ExecutorUtil.java:294)
#   	at java.base/java.util.concurrent.ThreadPoolExecutor.runWorker(ThreadPoolExecutor.java:1128)
#   	at java.base/java.util.concurrent.ThreadPoolExecutor$Worker.run(ThreadPoolExecutor.java:628)
#   	at java.base/java.lang.Thread.run(Thread.java:829)
# --
#
# Please find the SOLR_HOME snapshot for failed test #5 at: /home/jenkins/jenkins-slave/workspace/Solr/Solr-Check-main/solr/packaging/build/test-output/failure-snapshots/75-5
# Last output:
# INFO  - 2023-11-23 15:35:18.661; org.apache.solr.util.configuration.SSLConfigurations; Setting javax.net.ssl.keyStorePassword
# INFO  - 2023-11-23 15:35:18.665; org.apache.solr.util.configuration.SSLConfigurations; Setting javax.net.ssl.trustStorePassword
# WARNING: URLs provided to this tool needn't include Solr's context-root (e.g. "/solr"). Such URLs are deprecated and support for them will be removed in a future release. Correcting from [https://localhost:35732/solr] to [https://localhost:35732].
# WARN  - 2023-11-23 15:35:19.496; org.apache.solr.common.cloud.SolrZkClient; Using default ZkCredentialsInjector. ZkCredentialsInjector is not secure, it creates an empty list of credentials which leads to 'OPEN_ACL_UNSAFE' ACLs to Zookeeper nodes
# WARN  - 2023-11-23 15:35:19.549; org.apache.solr.common.cloud.SolrZkClient; Using default ZkACLProvider. DefaultZkACLProvider is not secure, it creates 'OPEN_ACL_UNSAFE' ACLs to Zookeeper nodes
ok 76 start solr with mTLS wanted in 49431ms
ok 77 SOLR-11740 check 'solr stop' connection in 14813ms
ok 78 stop command for single port in 17566ms
ok 79 status detects locally running solr in 8943ms
ok 80 status shell script ignores passed in -solrUrl cli parameter from user in 7187ms
ok 81 status help flag outputs message highlighting not to use solrUrl. in 1007ms
ok 82 listing out files in 2945ms
ok 83 copying files around in 6280ms
ok 84 upconfig in 2639ms
ok 85 zkcli.sh gets 'solrhome' from 'solr.home' system property in 1235ms
ok 86 zkcli.sh gets 'solrhome' from 'solrhome' command line option in 1232ms
ok 87 Cleanup in 2012ms

> Task :solr:packaging:integrationTests FAILED

FAILURE: Build completed with 2 failures.

1: Task failed with an exception.
-----------
* What went wrong:
Execution failed for task ':solr:core:compileTestJava'.
> Compilation failed; see the compiler error output for details.

* Try:
> Run with --info option to get more log output.
==============================================================================

2: Task failed with an exception.
-----------
* Where:
Build file '/home/jenkins/jenkins-slave/workspace/Solr/Solr-Check-main/solr/packaging/build.gradle' line: 301

* What went wrong:
Execution failed for task ':solr:packaging:integrationTests'.
> Process 'command '/home/jenkins/jenkins-slave/workspace/Solr/Solr-Check-main/.gradle/node/packaging/node_modules/bats/bin/bats'' finished with non-zero exit value 1

* Try:
> Run with --stacktrace option to get the stack trace.
> Run with --info or --debug option to get more log output.
> Get more help at https://help.gradle.org.
==============================================================================

Deprecated Gradle features were used in this build, making it incompatible with Gradle 9.0.

You can use '--warning-mode all' to show the individual deprecation warnings and determine if they come from your own scripts or plugins.

For more on this, please refer to https://docs.gradle.org/8.4/userguide/command_line_interface.html#sec:command_line_warnings in the Gradle documentation.

BUILD FAILED in 38m 29s
641 actionable tasks: 641 executed

Publishing build scan...
https://ge.apache.org/s/ekpvinhrtt7s6

Build step 'Invoke Gradle script' changed build result to FAILURE
Build step 'Invoke Gradle script' marked build as failure
Archiving artifacts
Recording test results
[Checks API] No suitable checks publisher found.
Email was triggered for: Failure - Any
Sending email for trigger: Failure - Any

[JENKINS] Solr » Solr-Check-main - Build # 8432 - Still Failing!

Posted by Apache Jenkins Server <je...@builds.apache.org>.
Build: https://ci-builds.apache.org/job/Solr/job/Solr-Check-main/8432/

All tests passed

Build Log:
[...truncated 1288 lines...]
BUILD FAILED in 38m 4s
641 actionable tasks: 641 executed

Publishing build scan...
https://ge.apache.org/s/t72zm4tpfjrzi

Build step 'Invoke Gradle script' changed build result to FAILURE
Build step 'Invoke Gradle script' marked build as failure
Archiving artifacts
Recording test results
[Checks API] No suitable checks publisher found.
Email was triggered for: Failure - Any
Sending email for trigger: Failure - Any

[JENKINS] Solr » Solr-Check-main - Build # 8431 - Still Failing!

Posted by Apache Jenkins Server <je...@builds.apache.org>.
Build: https://ci-builds.apache.org/job/Solr/job/Solr-Check-main/8431/

All tests passed

Build Log:
[...truncated 1309 lines...]
#   ERROR: IOException occurred when talking to server at: https://localhost:40339/solr/test/select
#
#   org.apache.solr.client.solrj.SolrServerException: IOException occurred when talking to server at: https://localhost:40339/solr/test/select
#   	at org.apache.solr.client.solrj.impl.Http2SolrClient.request(Http2SolrClient.java:550)
#   	at org.apache.solr.client.solrj.SolrClient.request(SolrClient.java:1193)
#   	at org.apache.solr.cli.ApiTool.callGet(ApiTool.java:97)
#   	at org.apache.solr.cli.ApiTool.runImpl(ApiTool.java:69)
#   	at org.apache.solr.cli.ToolBase.runTool(ToolBase.java:52)
#   	at org.apache.solr.cli.SolrCLI.main(SolrCLI.java:161)
#   Caused by: java.nio.channels.ClosedChannelException
#   	at org.eclipse.jetty.http2.HTTP2Session$StreamsState.onShutdown(HTTP2Session.java:1865)
#   	at org.eclipse.jetty.http2.HTTP2Session.onShutdown(HTTP2Session.java:1036)
#   	at org.eclipse.jetty.http2.HTTP2Connection$HTTP2Producer.produce(HTTP2Connection.java:385)
#   	at org.eclipse.jetty.util.thread.strategy.AdaptiveExecutionStrategy.produceTask(AdaptiveExecutionStrategy.java:455)
#   	at org.eclipse.jetty.util.thread.strategy.AdaptiveExecutionStrategy.tryProduce(AdaptiveExecutionStrategy.java:248)
#   	at org.eclipse.jetty.util.thread.strategy.AdaptiveExecutionStrategy.produce(AdaptiveExecutionStrategy.java:193)
#   	at org.eclipse.jetty.http2.HTTP2Connection.produce(HTTP2Connection.java:208)
#   	at org.eclipse.jetty.http2.client.HTTP2ClientConnectionFactory$HTTP2ClientConnection.succeeded(HTTP2ClientConnectionFactory.java:174)
#   	at org.eclipse.jetty.util.Callback$Nested.succeeded(Callback.java:392)
#   	at org.eclipse.jetty.util.CountingCallback.succeeded(CountingCallback.java:63)
#   	at org.eclipse.jetty.util.Callback$Nested.succeeded(Callback.java:392)
#   	at org.eclipse.jetty.http2.HTTP2Session$ControlEntry.succeeded(HTTP2Session.java:1377)
#   	at java.base/java.util.ArrayList.forEach(ArrayList.java:1541)
#   	at org.eclipse.jetty.http2.HTTP2Flusher.finish(HTTP2Flusher.java:323)
#   	at org.eclipse.jetty.http2.HTTP2Flusher.succeeded(HTTP2Flusher.java:315)
#   	at org.eclipse.jetty.io.WriteFlusher.write(WriteFlusher.java:291)
#   	at org.eclipse.jetty.io.WriteFlusher.write(WriteFlusher.java:254)
#   	at org.eclipse.jetty.io.AbstractEndPoint.write(AbstractEndPoint.java:386)
#   	at org.eclipse.jetty.http2.HTTP2Flusher.process(HTTP2Flusher.java:292)
#   	at org.eclipse.jetty.util.IteratingCallback.processing(IteratingCallback.java:243)
#   	at org.eclipse.jetty.util.IteratingCallback.iterate(IteratingCallback.java:224)
#   	at org.eclipse.jetty.http2.HTTP2Session.frame(HTTP2Session.java:821)
#   	at org.eclipse.jetty.http2.HTTP2Session.frames(HTTP2Session.java:793)
#   	at org.eclipse.jetty.http2.client.HTTP2ClientConnectionFactory$HTTP2ClientConnection.onOpen(HTTP2ClientConnectionFactory.java:161)
#   	at org.eclipse.jetty.io.AbstractEndPoint.upgrade(AbstractEndPoint.java:451)
#   	at org.eclipse.jetty.io.NegotiatingClientConnection.replaceConnection(NegotiatingClientConnection.java:117)
#   	at org.eclipse.jetty.io.NegotiatingClientConnection.onFillable(NegotiatingClientConnection.java:87)
#   	at org.eclipse.jetty.io.AbstractConnection$ReadCallback.succeeded(AbstractConnection.java:314)
#   	at org.eclipse.jetty.io.FillInterest.fillable(FillInterest.java:100)
#   	at org.eclipse.jetty.io.ssl.SslConnection$DecryptedEndPoint.onFillable(SslConnection.java:558)
#   	at org.eclipse.jetty.io.ssl.SslConnection.onFillable(SslConnection.java:379)
#   	at org.eclipse.jetty.io.ssl.SslConnection$2.succeeded(SslConnection.java:146)
#   	at org.eclipse.jetty.io.FillInterest.fillable(FillInterest.java:100)
#   	at org.eclipse.jetty.io.SelectableChannelEndPoint$1.run(SelectableChannelEndPoint.java:53)
#   	at org.apache.solr.common.util.ExecutorUtil$MDCAwareThreadPoolExecutor.lambda$execute$0(ExecutorUtil.java:294)
#   	at java.base/java.util.concurrent.ThreadPoolExecutor.runWorker(ThreadPoolExecutor.java:1128)
#   	at java.base/java.util.concurrent.ThreadPoolExecutor$Worker.run(ThreadPoolExecutor.java:628)
#   	at java.base/java.lang.Thread.run(Thread.java:829)
# --
#
# Please find the SOLR_HOME snapshot for failed test #5 at: /home/jenkins/jenkins-slave/workspace/Solr/Solr-Check-main/solr/packaging/build/test-output/failure-snapshots/75-5
# Last output:
# INFO  - 2023-11-23 10:18:48.647; org.apache.solr.util.configuration.SSLConfigurations; Setting javax.net.ssl.keyStorePassword
# INFO  - 2023-11-23 10:18:48.652; org.apache.solr.util.configuration.SSLConfigurations; Setting javax.net.ssl.trustStorePassword
# WARNING: URLs provided to this tool needn't include Solr's context-root (e.g. "/solr"). Such URLs are deprecated and support for them will be removed in a future release. Correcting from [https://localhost:40340/solr] to [https://localhost:40340].
# WARN  - 2023-11-23 10:18:49.552; org.apache.solr.common.cloud.SolrZkClient; Using default ZkCredentialsInjector. ZkCredentialsInjector is not secure, it creates an empty list of credentials which leads to 'OPEN_ACL_UNSAFE' ACLs to Zookeeper nodes
# WARN  - 2023-11-23 10:18:49.590; org.apache.solr.common.cloud.SolrZkClient; Using default ZkACLProvider. DefaultZkACLProvider is not secure, it creates 'OPEN_ACL_UNSAFE' ACLs to Zookeeper nodes
ok 76 start solr with mTLS wanted in 46748ms
ok 77 SOLR-11740 check 'solr stop' connection in 14030ms
ok 78 stop command for single port in 17025ms
ok 79 status detects locally running solr in 8793ms
ok 80 status shell script ignores passed in -solrUrl cli parameter from user in 7307ms
ok 81 status help flag outputs message highlighting not to use solrUrl. in 1011ms
ok 82 listing out files in 2947ms
ok 83 copying files around in 6231ms
ok 84 upconfig in 2474ms
ok 85 zkcli.sh gets 'solrhome' from 'solr.home' system property in 1211ms
ok 86 zkcli.sh gets 'solrhome' from 'solrhome' command line option in 1210ms
ok 87 Cleanup in 1949ms

> Task :solr:packaging:integrationTests FAILED

FAILURE: Build completed with 2 failures.

1: Task failed with an exception.
-----------
* What went wrong:
Execution failed for task ':solr:core:compileTestJava'.
> Compilation failed; see the compiler error output for details.

* Try:
> Run with --info option to get more log output.
==============================================================================

2: Task failed with an exception.
-----------
* Where:
Build file '/home/jenkins/jenkins-slave/workspace/Solr/Solr-Check-main/solr/packaging/build.gradle' line: 301

* What went wrong:
Execution failed for task ':solr:packaging:integrationTests'.
> Process 'command '/home/jenkins/jenkins-slave/workspace/Solr/Solr-Check-main/.gradle/node/packaging/node_modules/bats/bin/bats'' finished with non-zero exit value 1

* Try:
> Run with --stacktrace option to get the stack trace.
> Run with --info or --debug option to get more log output.
> Get more help at https://help.gradle.org.
==============================================================================

Deprecated Gradle features were used in this build, making it incompatible with Gradle 9.0.

You can use '--warning-mode all' to show the individual deprecation warnings and determine if they come from your own scripts or plugins.

For more on this, please refer to https://docs.gradle.org/8.4/userguide/command_line_interface.html#sec:command_line_warnings in the Gradle documentation.

BUILD FAILED in 38m 5s
641 actionable tasks: 641 executed

Publishing build scan...
https://ge.apache.org/s/6gfu2g47v7e6g

Build step 'Invoke Gradle script' changed build result to FAILURE
Build step 'Invoke Gradle script' marked build as failure
Archiving artifacts
Recording test results
[Checks API] No suitable checks publisher found.
Email was triggered for: Failure - Any
Sending email for trigger: Failure - Any

[JENKINS] Solr » Solr-Check-main - Build # 8430 - Still Failing!

Posted by Apache Jenkins Server <je...@builds.apache.org>.
Build: https://ci-builds.apache.org/job/Solr/job/Solr-Check-main/8430/

All tests passed

Build Log:
[...truncated 1310 lines...]
#   ERROR: IOException occurred when talking to server at: https://localhost:40887/solr/test/select
#
#   org.apache.solr.client.solrj.SolrServerException: IOException occurred when talking to server at: https://localhost:40887/solr/test/select
#   	at org.apache.solr.client.solrj.impl.Http2SolrClient.request(Http2SolrClient.java:550)
#   	at org.apache.solr.client.solrj.SolrClient.request(SolrClient.java:1193)
#   	at org.apache.solr.cli.ApiTool.callGet(ApiTool.java:97)
#   	at org.apache.solr.cli.ApiTool.runImpl(ApiTool.java:69)
#   	at org.apache.solr.cli.ToolBase.runTool(ToolBase.java:52)
#   	at org.apache.solr.cli.SolrCLI.main(SolrCLI.java:161)
#   Caused by: java.nio.channels.ClosedChannelException
#   	at org.eclipse.jetty.http2.HTTP2Session$StreamsState.onShutdown(HTTP2Session.java:1865)
#   	at org.eclipse.jetty.http2.HTTP2Session.onShutdown(HTTP2Session.java:1036)
#   	at org.eclipse.jetty.http2.HTTP2Connection$HTTP2Producer.produce(HTTP2Connection.java:385)
#   	at org.eclipse.jetty.util.thread.strategy.AdaptiveExecutionStrategy.produceTask(AdaptiveExecutionStrategy.java:455)
#   	at org.eclipse.jetty.util.thread.strategy.AdaptiveExecutionStrategy.tryProduce(AdaptiveExecutionStrategy.java:248)
#   	at org.eclipse.jetty.util.thread.strategy.AdaptiveExecutionStrategy.produce(AdaptiveExecutionStrategy.java:193)
#   	at org.eclipse.jetty.http2.HTTP2Connection.produce(HTTP2Connection.java:208)
#   	at org.eclipse.jetty.http2.client.HTTP2ClientConnectionFactory$HTTP2ClientConnection.succeeded(HTTP2ClientConnectionFactory.java:174)
#   	at org.eclipse.jetty.util.Callback$Nested.succeeded(Callback.java:392)
#   	at org.eclipse.jetty.util.CountingCallback.succeeded(CountingCallback.java:63)
#   	at org.eclipse.jetty.util.Callback$Nested.succeeded(Callback.java:392)
#   	at org.eclipse.jetty.http2.HTTP2Session$ControlEntry.succeeded(HTTP2Session.java:1377)
#   	at java.base/java.util.ArrayList.forEach(ArrayList.java:1541)
#   	at org.eclipse.jetty.http2.HTTP2Flusher.finish(HTTP2Flusher.java:323)
#   	at org.eclipse.jetty.http2.HTTP2Flusher.succeeded(HTTP2Flusher.java:315)
#   	at org.eclipse.jetty.io.WriteFlusher.write(WriteFlusher.java:291)
#   	at org.eclipse.jetty.io.WriteFlusher.write(WriteFlusher.java:254)
#   	at org.eclipse.jetty.io.AbstractEndPoint.write(AbstractEndPoint.java:386)
#   	at org.eclipse.jetty.http2.HTTP2Flusher.process(HTTP2Flusher.java:292)
#   	at org.eclipse.jetty.util.IteratingCallback.processing(IteratingCallback.java:243)
#   	at org.eclipse.jetty.util.IteratingCallback.iterate(IteratingCallback.java:224)
#   	at org.eclipse.jetty.http2.HTTP2Session.frame(HTTP2Session.java:821)
#   	at org.eclipse.jetty.http2.HTTP2Session.frames(HTTP2Session.java:793)
#   	at org.eclipse.jetty.http2.client.HTTP2ClientConnectionFactory$HTTP2ClientConnection.onOpen(HTTP2ClientConnectionFactory.java:161)
#   	at org.eclipse.jetty.io.AbstractEndPoint.upgrade(AbstractEndPoint.java:451)
#   	at org.eclipse.jetty.io.NegotiatingClientConnection.replaceConnection(NegotiatingClientConnection.java:117)
#   	at org.eclipse.jetty.io.NegotiatingClientConnection.onFillable(NegotiatingClientConnection.java:87)
#   	at org.eclipse.jetty.io.AbstractConnection$ReadCallback.succeeded(AbstractConnection.java:314)
#   	at org.eclipse.jetty.io.FillInterest.fillable(FillInterest.java:100)
#   	at org.eclipse.jetty.io.ssl.SslConnection$DecryptedEndPoint.onFillable(SslConnection.java:558)
#   	at org.eclipse.jetty.io.ssl.SslConnection.onFillable(SslConnection.java:379)
#   	at org.eclipse.jetty.io.ssl.SslConnection$2.succeeded(SslConnection.java:146)
#   	at org.eclipse.jetty.io.FillInterest.fillable(FillInterest.java:100)
#   	at org.eclipse.jetty.io.SelectableChannelEndPoint$1.run(SelectableChannelEndPoint.java:53)
#   	at org.apache.solr.common.util.ExecutorUtil$MDCAwareThreadPoolExecutor.lambda$execute$0(ExecutorUtil.java:294)
#   	at java.base/java.util.concurrent.ThreadPoolExecutor.runWorker(ThreadPoolExecutor.java:1128)
#   	at java.base/java.util.concurrent.ThreadPoolExecutor$Worker.run(ThreadPoolExecutor.java:628)
#   	at java.base/java.lang.Thread.run(Thread.java:829)
# --
#
# Please find the SOLR_HOME snapshot for failed test #5 at: /home/jenkins/jenkins-slave/workspace/Solr/Solr-Check-main/solr/packaging/build/test-output/failure-snapshots/75-5
# Last output:
# INFO  - 2023-11-23 07:24:30.048; org.apache.solr.util.configuration.SSLConfigurations; Setting javax.net.ssl.keyStorePassword
# INFO  - 2023-11-23 07:24:30.053; org.apache.solr.util.configuration.SSLConfigurations; Setting javax.net.ssl.trustStorePassword
# WARNING: URLs provided to this tool needn't include Solr's context-root (e.g. "/solr"). Such URLs are deprecated and support for them will be removed in a future release. Correcting from [https://localhost:40888/solr] to [https://localhost:40888].
# WARN  - 2023-11-23 07:24:31.061; org.apache.solr.common.cloud.SolrZkClient; Using default ZkCredentialsInjector. ZkCredentialsInjector is not secure, it creates an empty list of credentials which leads to 'OPEN_ACL_UNSAFE' ACLs to Zookeeper nodes
# WARN  - 2023-11-23 07:24:31.099; org.apache.solr.common.cloud.SolrZkClient; Using default ZkACLProvider. DefaultZkACLProvider is not secure, it creates 'OPEN_ACL_UNSAFE' ACLs to Zookeeper nodes
ok 76 start solr with mTLS wanted in 51676ms
ok 77 SOLR-11740 check 'solr stop' connection in 14034ms
ok 78 stop command for single port in 16702ms
ok 79 status detects locally running solr in 8806ms
ok 80 status shell script ignores passed in -solrUrl cli parameter from user in 7697ms
ok 81 status help flag outputs message highlighting not to use solrUrl. in 1074ms
ok 82 listing out files in 2804ms
ok 83 copying files around in 6475ms
ok 84 upconfig in 3051ms
ok 85 zkcli.sh gets 'solrhome' from 'solr.home' system property in 1230ms
ok 86 zkcli.sh gets 'solrhome' from 'solrhome' command line option in 1220ms
ok 87 Cleanup in 2035ms

> Task :solr:packaging:integrationTests FAILED

FAILURE: Build completed with 2 failures.

1: Task failed with an exception.
-----------
* What went wrong:
Execution failed for task ':solr:core:compileTestJava'.
> Compilation failed; see the compiler error output for details.

* Try:
> Run with --info option to get more log output.
==============================================================================

2: Task failed with an exception.
-----------
* Where:
Build file '/home/jenkins/jenkins-slave/workspace/Solr/Solr-Check-main/solr/packaging/build.gradle' line: 301

* What went wrong:
Execution failed for task ':solr:packaging:integrationTests'.
> Process 'command '/home/jenkins/jenkins-slave/workspace/Solr/Solr-Check-main/.gradle/node/packaging/node_modules/bats/bin/bats'' finished with non-zero exit value 1

* Try:
> Run with --stacktrace option to get the stack trace.
> Run with --info or --debug option to get more log output.
> Get more help at https://help.gradle.org.
==============================================================================

Deprecated Gradle features were used in this build, making it incompatible with Gradle 9.0.

You can use '--warning-mode all' to show the individual deprecation warnings and determine if they come from your own scripts or plugins.

For more on this, please refer to https://docs.gradle.org/8.4/userguide/command_line_interface.html#sec:command_line_warnings in the Gradle documentation.

BUILD FAILED in 39m 1s
641 actionable tasks: 641 executed

Publishing build scan...
https://ge.apache.org/s/hnj43jwkumkbq

Build step 'Invoke Gradle script' changed build result to FAILURE
Build step 'Invoke Gradle script' marked build as failure
Archiving artifacts
Recording test results
[Checks API] No suitable checks publisher found.
Email was triggered for: Failure - Any
Sending email for trigger: Failure - Any

[JENKINS] Solr » Solr-Check-main - Build # 8429 - Still Failing!

Posted by Apache Jenkins Server <je...@builds.apache.org>.
Build: https://ci-builds.apache.org/job/Solr/job/Solr-Check-main/8429/

All tests passed

Build Log:
[...truncated 1309 lines...]
#   ERROR: IOException occurred when talking to server at: https://localhost:36503/solr/test/select
#
#   org.apache.solr.client.solrj.SolrServerException: IOException occurred when talking to server at: https://localhost:36503/solr/test/select
#   	at org.apache.solr.client.solrj.impl.Http2SolrClient.request(Http2SolrClient.java:550)
#   	at org.apache.solr.client.solrj.SolrClient.request(SolrClient.java:1193)
#   	at org.apache.solr.cli.ApiTool.callGet(ApiTool.java:97)
#   	at org.apache.solr.cli.ApiTool.runImpl(ApiTool.java:69)
#   	at org.apache.solr.cli.ToolBase.runTool(ToolBase.java:52)
#   	at org.apache.solr.cli.SolrCLI.main(SolrCLI.java:161)
#   Caused by: java.nio.channels.ClosedChannelException
#   	at org.eclipse.jetty.http2.HTTP2Session$StreamsState.onShutdown(HTTP2Session.java:1865)
#   	at org.eclipse.jetty.http2.HTTP2Session.onShutdown(HTTP2Session.java:1036)
#   	at org.eclipse.jetty.http2.HTTP2Connection$HTTP2Producer.produce(HTTP2Connection.java:385)
#   	at org.eclipse.jetty.util.thread.strategy.AdaptiveExecutionStrategy.produceTask(AdaptiveExecutionStrategy.java:455)
#   	at org.eclipse.jetty.util.thread.strategy.AdaptiveExecutionStrategy.tryProduce(AdaptiveExecutionStrategy.java:248)
#   	at org.eclipse.jetty.util.thread.strategy.AdaptiveExecutionStrategy.produce(AdaptiveExecutionStrategy.java:193)
#   	at org.eclipse.jetty.http2.HTTP2Connection.produce(HTTP2Connection.java:208)
#   	at org.eclipse.jetty.http2.client.HTTP2ClientConnectionFactory$HTTP2ClientConnection.succeeded(HTTP2ClientConnectionFactory.java:174)
#   	at org.eclipse.jetty.util.Callback$Nested.succeeded(Callback.java:392)
#   	at org.eclipse.jetty.util.CountingCallback.succeeded(CountingCallback.java:63)
#   	at org.eclipse.jetty.util.Callback$Nested.succeeded(Callback.java:392)
#   	at org.eclipse.jetty.http2.HTTP2Session$ControlEntry.succeeded(HTTP2Session.java:1377)
#   	at java.base/java.util.ArrayList.forEach(ArrayList.java:1541)
#   	at org.eclipse.jetty.http2.HTTP2Flusher.finish(HTTP2Flusher.java:323)
#   	at org.eclipse.jetty.http2.HTTP2Flusher.succeeded(HTTP2Flusher.java:315)
#   	at org.eclipse.jetty.io.WriteFlusher.write(WriteFlusher.java:291)
#   	at org.eclipse.jetty.io.WriteFlusher.write(WriteFlusher.java:254)
#   	at org.eclipse.jetty.io.AbstractEndPoint.write(AbstractEndPoint.java:386)
#   	at org.eclipse.jetty.http2.HTTP2Flusher.process(HTTP2Flusher.java:292)
#   	at org.eclipse.jetty.util.IteratingCallback.processing(IteratingCallback.java:243)
#   	at org.eclipse.jetty.util.IteratingCallback.iterate(IteratingCallback.java:224)
#   	at org.eclipse.jetty.http2.HTTP2Session.frame(HTTP2Session.java:821)
#   	at org.eclipse.jetty.http2.HTTP2Session.frames(HTTP2Session.java:793)
#   	at org.eclipse.jetty.http2.client.HTTP2ClientConnectionFactory$HTTP2ClientConnection.onOpen(HTTP2ClientConnectionFactory.java:161)
#   	at org.eclipse.jetty.io.AbstractEndPoint.upgrade(AbstractEndPoint.java:451)
#   	at org.eclipse.jetty.io.NegotiatingClientConnection.replaceConnection(NegotiatingClientConnection.java:117)
#   	at org.eclipse.jetty.io.NegotiatingClientConnection.onFillable(NegotiatingClientConnection.java:87)
#   	at org.eclipse.jetty.io.AbstractConnection$ReadCallback.succeeded(AbstractConnection.java:314)
#   	at org.eclipse.jetty.io.FillInterest.fillable(FillInterest.java:100)
#   	at org.eclipse.jetty.io.ssl.SslConnection$DecryptedEndPoint.onFillable(SslConnection.java:558)
#   	at org.eclipse.jetty.io.ssl.SslConnection.onFillable(SslConnection.java:379)
#   	at org.eclipse.jetty.io.ssl.SslConnection$2.succeeded(SslConnection.java:146)
#   	at org.eclipse.jetty.io.FillInterest.fillable(FillInterest.java:100)
#   	at org.eclipse.jetty.io.SelectableChannelEndPoint$1.run(SelectableChannelEndPoint.java:53)
#   	at org.apache.solr.common.util.ExecutorUtil$MDCAwareThreadPoolExecutor.lambda$execute$0(ExecutorUtil.java:294)
#   	at java.base/java.util.concurrent.ThreadPoolExecutor.runWorker(ThreadPoolExecutor.java:1128)
#   	at java.base/java.util.concurrent.ThreadPoolExecutor$Worker.run(ThreadPoolExecutor.java:628)
#   	at java.base/java.lang.Thread.run(Thread.java:829)
# --
#
# Please find the SOLR_HOME snapshot for failed test #5 at: /home/jenkins/jenkins-slave/workspace/Solr/Solr-Check-main/solr/packaging/build/test-output/failure-snapshots/75-5
# Last output:
# INFO  - 2023-11-23 03:25:31.954; org.apache.solr.util.configuration.SSLConfigurations; Setting javax.net.ssl.keyStorePassword
# INFO  - 2023-11-23 03:25:31.958; org.apache.solr.util.configuration.SSLConfigurations; Setting javax.net.ssl.trustStorePassword
# WARNING: URLs provided to this tool needn't include Solr's context-root (e.g. "/solr"). Such URLs are deprecated and support for them will be removed in a future release. Correcting from [https://localhost:36504/solr] to [https://localhost:36504].
# WARN  - 2023-11-23 03:25:32.799; org.apache.solr.common.cloud.SolrZkClient; Using default ZkCredentialsInjector. ZkCredentialsInjector is not secure, it creates an empty list of credentials which leads to 'OPEN_ACL_UNSAFE' ACLs to Zookeeper nodes
# WARN  - 2023-11-23 03:25:32.835; org.apache.solr.common.cloud.SolrZkClient; Using default ZkACLProvider. DefaultZkACLProvider is not secure, it creates 'OPEN_ACL_UNSAFE' ACLs to Zookeeper nodes
ok 76 start solr with mTLS wanted in 46651ms
ok 77 SOLR-11740 check 'solr stop' connection in 14989ms
ok 78 stop command for single port in 16688ms
ok 79 status detects locally running solr in 8483ms
ok 80 status shell script ignores passed in -solrUrl cli parameter from user in 7294ms
ok 81 status help flag outputs message highlighting not to use solrUrl. in 986ms
ok 82 listing out files in 2795ms
ok 83 copying files around in 6039ms
ok 84 upconfig in 2378ms
ok 85 zkcli.sh gets 'solrhome' from 'solr.home' system property in 1207ms
ok 86 zkcli.sh gets 'solrhome' from 'solrhome' command line option in 1207ms
ok 87 Cleanup in 1904ms

> Task :solr:packaging:integrationTests FAILED

FAILURE: Build completed with 2 failures.

1: Task failed with an exception.
-----------
* What went wrong:
Execution failed for task ':solr:core:compileTestJava'.
> Compilation failed; see the compiler error output for details.

* Try:
> Run with --info option to get more log output.
==============================================================================

2: Task failed with an exception.
-----------
* Where:
Build file '/home/jenkins/jenkins-slave/workspace/Solr/Solr-Check-main/solr/packaging/build.gradle' line: 301

* What went wrong:
Execution failed for task ':solr:packaging:integrationTests'.
> Process 'command '/home/jenkins/jenkins-slave/workspace/Solr/Solr-Check-main/.gradle/node/packaging/node_modules/bats/bin/bats'' finished with non-zero exit value 1

* Try:
> Run with --stacktrace option to get the stack trace.
> Run with --info or --debug option to get more log output.
> Get more help at https://help.gradle.org.
==============================================================================

Deprecated Gradle features were used in this build, making it incompatible with Gradle 9.0.

You can use '--warning-mode all' to show the individual deprecation warnings and determine if they come from your own scripts or plugins.

For more on this, please refer to https://docs.gradle.org/8.4/userguide/command_line_interface.html#sec:command_line_warnings in the Gradle documentation.

BUILD FAILED in 36m 46s
641 actionable tasks: 641 executed

Publishing build scan...
https://ge.apache.org/s/d74md52x7maru

Build step 'Invoke Gradle script' changed build result to FAILURE
Build step 'Invoke Gradle script' marked build as failure
Archiving artifacts
Recording test results
[Checks API] No suitable checks publisher found.
Email was triggered for: Failure - Any
Sending email for trigger: Failure - Any

[JENKINS] Solr » Solr-Check-main - Build # 8428 - Still Failing!

Posted by Apache Jenkins Server <je...@builds.apache.org>.
Build: https://ci-builds.apache.org/job/Solr/job/Solr-Check-main/8428/

All tests passed

Build Log:
[...truncated 1308 lines...]
#   ERROR: IOException occurred when talking to server at: https://localhost:45089/solr/test/select
#
#   org.apache.solr.client.solrj.SolrServerException: IOException occurred when talking to server at: https://localhost:45089/solr/test/select
#   	at org.apache.solr.client.solrj.impl.Http2SolrClient.request(Http2SolrClient.java:550)
#   	at org.apache.solr.client.solrj.SolrClient.request(SolrClient.java:1193)
#   	at org.apache.solr.cli.ApiTool.callGet(ApiTool.java:97)
#   	at org.apache.solr.cli.ApiTool.runImpl(ApiTool.java:69)
#   	at org.apache.solr.cli.ToolBase.runTool(ToolBase.java:52)
#   	at org.apache.solr.cli.SolrCLI.main(SolrCLI.java:161)
#   Caused by: java.nio.channels.ClosedChannelException
#   	at org.eclipse.jetty.http2.HTTP2Session$StreamsState.onShutdown(HTTP2Session.java:1865)
#   	at org.eclipse.jetty.http2.HTTP2Session.onShutdown(HTTP2Session.java:1036)
#   	at org.eclipse.jetty.http2.HTTP2Connection$HTTP2Producer.produce(HTTP2Connection.java:385)
#   	at org.eclipse.jetty.util.thread.strategy.AdaptiveExecutionStrategy.produceTask(AdaptiveExecutionStrategy.java:455)
#   	at org.eclipse.jetty.util.thread.strategy.AdaptiveExecutionStrategy.tryProduce(AdaptiveExecutionStrategy.java:248)
#   	at org.eclipse.jetty.util.thread.strategy.AdaptiveExecutionStrategy.produce(AdaptiveExecutionStrategy.java:193)
#   	at org.eclipse.jetty.http2.HTTP2Connection.produce(HTTP2Connection.java:208)
#   	at org.eclipse.jetty.http2.client.HTTP2ClientConnectionFactory$HTTP2ClientConnection.succeeded(HTTP2ClientConnectionFactory.java:174)
#   	at org.eclipse.jetty.util.Callback$Nested.succeeded(Callback.java:392)
#   	at org.eclipse.jetty.util.CountingCallback.succeeded(CountingCallback.java:63)
#   	at org.eclipse.jetty.util.Callback$Nested.succeeded(Callback.java:392)
#   	at org.eclipse.jetty.http2.HTTP2Session$ControlEntry.succeeded(HTTP2Session.java:1377)
#   	at java.base/java.util.ArrayList.forEach(ArrayList.java:1541)
#   	at org.eclipse.jetty.http2.HTTP2Flusher.finish(HTTP2Flusher.java:323)
#   	at org.eclipse.jetty.http2.HTTP2Flusher.succeeded(HTTP2Flusher.java:315)
#   	at org.eclipse.jetty.io.WriteFlusher.write(WriteFlusher.java:291)
#   	at org.eclipse.jetty.io.WriteFlusher.write(WriteFlusher.java:254)
#   	at org.eclipse.jetty.io.AbstractEndPoint.write(AbstractEndPoint.java:386)
#   	at org.eclipse.jetty.http2.HTTP2Flusher.process(HTTP2Flusher.java:292)
#   	at org.eclipse.jetty.util.IteratingCallback.processing(IteratingCallback.java:243)
#   	at org.eclipse.jetty.util.IteratingCallback.iterate(IteratingCallback.java:224)
#   	at org.eclipse.jetty.http2.HTTP2Session.frame(HTTP2Session.java:821)
#   	at org.eclipse.jetty.http2.HTTP2Session.frames(HTTP2Session.java:793)
#   	at org.eclipse.jetty.http2.client.HTTP2ClientConnectionFactory$HTTP2ClientConnection.onOpen(HTTP2ClientConnectionFactory.java:161)
#   	at org.eclipse.jetty.io.AbstractEndPoint.upgrade(AbstractEndPoint.java:451)
#   	at org.eclipse.jetty.io.NegotiatingClientConnection.replaceConnection(NegotiatingClientConnection.java:117)
#   	at org.eclipse.jetty.io.NegotiatingClientConnection.onFillable(NegotiatingClientConnection.java:87)
#   	at org.eclipse.jetty.io.AbstractConnection$ReadCallback.succeeded(AbstractConnection.java:314)
#   	at org.eclipse.jetty.io.FillInterest.fillable(FillInterest.java:100)
#   	at org.eclipse.jetty.io.ssl.SslConnection$DecryptedEndPoint.onFillable(SslConnection.java:558)
#   	at org.eclipse.jetty.io.ssl.SslConnection.onFillable(SslConnection.java:379)
#   	at org.eclipse.jetty.io.ssl.SslConnection$2.succeeded(SslConnection.java:146)
#   	at org.eclipse.jetty.io.FillInterest.fillable(FillInterest.java:100)
#   	at org.eclipse.jetty.io.SelectableChannelEndPoint$1.run(SelectableChannelEndPoint.java:53)
#   	at org.apache.solr.common.util.ExecutorUtil$MDCAwareThreadPoolExecutor.lambda$execute$0(ExecutorUtil.java:294)
#   	at java.base/java.util.concurrent.ThreadPoolExecutor.runWorker(ThreadPoolExecutor.java:1128)
#   	at java.base/java.util.concurrent.ThreadPoolExecutor$Worker.run(ThreadPoolExecutor.java:628)
#   	at java.base/java.lang.Thread.run(Thread.java:829)
# --
#
# Please find the SOLR_HOME snapshot for failed test #5 at: /home/jenkins/jenkins-slave/workspace/Solr/Solr-Check-main/solr/packaging/build/test-output/failure-snapshots/75-5
# Last output:
# INFO  - 2023-11-23 00:12:33.034; org.apache.solr.util.configuration.SSLConfigurations; Setting javax.net.ssl.keyStorePassword
# INFO  - 2023-11-23 00:12:33.037; org.apache.solr.util.configuration.SSLConfigurations; Setting javax.net.ssl.trustStorePassword
# WARNING: URLs provided to this tool needn't include Solr's context-root (e.g. "/solr"). Such URLs are deprecated and support for them will be removed in a future release. Correcting from [https://localhost:45090/solr] to [https://localhost:45090].
# WARN  - 2023-11-23 00:12:33.927; org.apache.solr.common.cloud.SolrZkClient; Using default ZkCredentialsInjector. ZkCredentialsInjector is not secure, it creates an empty list of credentials which leads to 'OPEN_ACL_UNSAFE' ACLs to Zookeeper nodes
# WARN  - 2023-11-23 00:12:33.959; org.apache.solr.common.cloud.SolrZkClient; Using default ZkACLProvider. DefaultZkACLProvider is not secure, it creates 'OPEN_ACL_UNSAFE' ACLs to Zookeeper nodes
ok 76 start solr with mTLS wanted in 46928ms
ok 77 SOLR-11740 check 'solr stop' connection in 13991ms
ok 78 stop command for single port in 17212ms
ok 79 status detects locally running solr in 8618ms
ok 80 status shell script ignores passed in -solrUrl cli parameter from user in 6841ms
ok 81 status help flag outputs message highlighting not to use solrUrl. in 1016ms
ok 82 listing out files in 2530ms
ok 83 copying files around in 6164ms
ok 84 upconfig in 2448ms
ok 85 zkcli.sh gets 'solrhome' from 'solr.home' system property in 1227ms
ok 86 zkcli.sh gets 'solrhome' from 'solrhome' command line option in 1207ms
ok 87 Cleanup in 1958ms

> Task :solr:packaging:integrationTests FAILED

FAILURE: Build completed with 2 failures.

1: Task failed with an exception.
-----------
* What went wrong:
Execution failed for task ':solr:core:compileTestJava'.
> Compilation failed; see the compiler error output for details.

* Try:
> Run with --info option to get more log output.
==============================================================================

2: Task failed with an exception.
-----------
* Where:
Build file '/home/jenkins/jenkins-slave/workspace/Solr/Solr-Check-main/solr/packaging/build.gradle' line: 301

* What went wrong:
Execution failed for task ':solr:packaging:integrationTests'.
> Process 'command '/home/jenkins/jenkins-slave/workspace/Solr/Solr-Check-main/.gradle/node/packaging/node_modules/bats/bin/bats'' finished with non-zero exit value 1

* Try:
> Run with --stacktrace option to get the stack trace.
> Run with --info or --debug option to get more log output.
> Get more help at https://help.gradle.org.
==============================================================================

Deprecated Gradle features were used in this build, making it incompatible with Gradle 9.0.

You can use '--warning-mode all' to show the individual deprecation warnings and determine if they come from your own scripts or plugins.

For more on this, please refer to https://docs.gradle.org/8.4/userguide/command_line_interface.html#sec:command_line_warnings in the Gradle documentation.

BUILD FAILED in 37m 23s
641 actionable tasks: 641 executed

Publishing build scan...
https://ge.apache.org/s/bc6z2txtndx2s

Build step 'Invoke Gradle script' changed build result to FAILURE
Build step 'Invoke Gradle script' marked build as failure
Archiving artifacts
Recording test results
[Checks API] No suitable checks publisher found.
Email was triggered for: Failure - Any
Sending email for trigger: Failure - Any