You are viewing a plain text version of this content. The canonical link for it is here.
Posted to dev@lucene.apache.org by Apache Jenkins Server <je...@builds.apache.org> on 2019/08/15 13:45:55 UTC

[JENKINS] Lucene-Solr-Tests-8.x - Build # 414 - Unstable

Build: https://builds.apache.org/job/Lucene-Solr-Tests-8.x/414/

1 tests failed.
FAILED:  org.apache.solr.update.processor.DimensionalRoutedAliasUpdateProcessorTest.testCatTime

Error Message:
took over 10 seconds after collection creation to update aliases

Stack Trace:
java.lang.AssertionError: took over 10 seconds after collection creation to update aliases
	at __randomizedtesting.SeedInfo.seed([A49B1CEEC4DB6F1A:A39053EDFB283EF2]:0)
	at org.junit.Assert.fail(Assert.java:88)
	at org.apache.solr.update.processor.RoutedAliasUpdateProcessorTest.waitColAndAlias(RoutedAliasUpdateProcessorTest.java:77)
	at org.apache.solr.update.processor.DimensionalRoutedAliasUpdateProcessorTest.testCatTime(DimensionalRoutedAliasUpdateProcessorTest.java:480)
	at sun.reflect.NativeMethodAccessorImpl.invoke0(Native Method)
	at sun.reflect.NativeMethodAccessorImpl.invoke(NativeMethodAccessorImpl.java:62)
	at sun.reflect.DelegatingMethodAccessorImpl.invoke(DelegatingMethodAccessorImpl.java:43)
	at java.lang.reflect.Method.invoke(Method.java:498)
	at com.carrotsearch.randomizedtesting.RandomizedRunner.invoke(RandomizedRunner.java:1750)
	at com.carrotsearch.randomizedtesting.RandomizedRunner$8.evaluate(RandomizedRunner.java:938)
	at com.carrotsearch.randomizedtesting.RandomizedRunner$9.evaluate(RandomizedRunner.java:974)
	at com.carrotsearch.randomizedtesting.RandomizedRunner$10.evaluate(RandomizedRunner.java:988)
	at com.carrotsearch.randomizedtesting.rules.SystemPropertiesRestoreRule$1.evaluate(SystemPropertiesRestoreRule.java:57)
	at org.apache.lucene.util.TestRuleSetupTeardownChained$1.evaluate(TestRuleSetupTeardownChained.java:49)
	at org.apache.lucene.util.AbstractBeforeAfterRule$1.evaluate(AbstractBeforeAfterRule.java:45)
	at org.apache.lucene.util.TestRuleThreadAndTestName$1.evaluate(TestRuleThreadAndTestName.java:48)
	at org.apache.lucene.util.TestRuleIgnoreAfterMaxFailures$1.evaluate(TestRuleIgnoreAfterMaxFailures.java:64)
	at org.apache.lucene.util.TestRuleMarkFailure$1.evaluate(TestRuleMarkFailure.java:47)
	at com.carrotsearch.randomizedtesting.rules.StatementAdapter.evaluate(StatementAdapter.java:36)
	at com.carrotsearch.randomizedtesting.ThreadLeakControl$StatementRunner.run(ThreadLeakControl.java:368)
	at com.carrotsearch.randomizedtesting.ThreadLeakControl.forkTimeoutingTask(ThreadLeakControl.java:817)
	at com.carrotsearch.randomizedtesting.ThreadLeakControl$3.evaluate(ThreadLeakControl.java:468)
	at com.carrotsearch.randomizedtesting.RandomizedRunner.runSingleTest(RandomizedRunner.java:947)
	at com.carrotsearch.randomizedtesting.RandomizedRunner$5.evaluate(RandomizedRunner.java:832)
	at com.carrotsearch.randomizedtesting.RandomizedRunner$6.evaluate(RandomizedRunner.java:883)
	at com.carrotsearch.randomizedtesting.RandomizedRunner$7.evaluate(RandomizedRunner.java:894)
	at com.carrotsearch.randomizedtesting.rules.StatementAdapter.evaluate(StatementAdapter.java:36)
	at com.carrotsearch.randomizedtesting.rules.SystemPropertiesRestoreRule$1.evaluate(SystemPropertiesRestoreRule.java:57)
	at org.apache.lucene.util.AbstractBeforeAfterRule$1.evaluate(AbstractBeforeAfterRule.java:45)
	at com.carrotsearch.randomizedtesting.rules.StatementAdapter.evaluate(StatementAdapter.java:36)
	at org.apache.lucene.util.TestRuleStoreClassName$1.evaluate(TestRuleStoreClassName.java:41)
	at com.carrotsearch.randomizedtesting.rules.NoShadowingOrOverridesOnMethodsRule$1.evaluate(NoShadowingOrOverridesOnMethodsRule.java:40)
	at com.carrotsearch.randomizedtesting.rules.NoShadowingOrOverridesOnMethodsRule$1.evaluate(NoShadowingOrOverridesOnMethodsRule.java:40)
	at com.carrotsearch.randomizedtesting.rules.StatementAdapter.evaluate(StatementAdapter.java:36)
	at com.carrotsearch.randomizedtesting.rules.StatementAdapter.evaluate(StatementAdapter.java:36)
	at com.carrotsearch.randomizedtesting.rules.StatementAdapter.evaluate(StatementAdapter.java:36)
	at org.apache.lucene.util.TestRuleAssertionsRequired$1.evaluate(TestRuleAssertionsRequired.java:53)
	at org.apache.lucene.util.TestRuleMarkFailure$1.evaluate(TestRuleMarkFailure.java:47)
	at org.apache.lucene.util.TestRuleIgnoreAfterMaxFailures$1.evaluate(TestRuleIgnoreAfterMaxFailures.java:64)
	at org.apache.lucene.util.TestRuleIgnoreTestSuites$1.evaluate(TestRuleIgnoreTestSuites.java:54)
	at com.carrotsearch.randomizedtesting.rules.StatementAdapter.evaluate(StatementAdapter.java:36)
	at com.carrotsearch.randomizedtesting.ThreadLeakControl$StatementRunner.run(ThreadLeakControl.java:368)
	at java.lang.Thread.run(Thread.java:748)




Build Log:
[...truncated 13462 lines...]
   [junit4] Suite: org.apache.solr.update.processor.DimensionalRoutedAliasUpdateProcessorTest
   [junit4]   2> 447072 INFO  (SUITE-DimensionalRoutedAliasUpdateProcessorTest-seed#[A49B1CEEC4DB6F1A]-worker) [     ] o.a.s.SolrTestCaseJ4 Created dataDir: /home/jenkins/jenkins-slave/workspace/Lucene-Solr-Tests-8.x/solr/build/solr-core/test/J2/temp/solr.update.processor.DimensionalRoutedAliasUpdateProcessorTest_A49B1CEEC4DB6F1A-001/data-dir-9-001
   [junit4]   2> 447078 INFO  (SUITE-DimensionalRoutedAliasUpdateProcessorTest-seed#[A49B1CEEC4DB6F1A]-worker) [     ] o.a.s.SolrTestCaseJ4 Using PointFields (NUMERIC_POINTS_SYSPROP=true) w/NUMERIC_DOCVALUES_SYSPROP=false
   [junit4]   2> 447079 INFO  (SUITE-DimensionalRoutedAliasUpdateProcessorTest-seed#[A49B1CEEC4DB6F1A]-worker) [     ] o.a.s.SolrTestCaseJ4 Randomized ssl (true) and clientAuth (true) via: @org.apache.solr.util.RandomizeSSL(reason=, ssl=NaN, value=NaN, clientAuth=NaN)
   [junit4]   2> 447106 INFO  (SUITE-DimensionalRoutedAliasUpdateProcessorTest-seed#[A49B1CEEC4DB6F1A]-worker) [     ] o.a.s.SolrTestCaseJ4 SecureRandom sanity checks: test.solr.allowed.securerandom=null & java.security.egd=file:/dev/./urandom
   [junit4]   2> 447113 INFO  (TEST-DimensionalRoutedAliasUpdateProcessorTest.testCatTime-seed#[A49B1CEEC4DB6F1A]) [     ] o.a.s.SolrTestCaseJ4 ###Starting testCatTime
   [junit4]   2> 447113 INFO  (TEST-DimensionalRoutedAliasUpdateProcessorTest.testCatTime-seed#[A49B1CEEC4DB6F1A]) [     ] o.a.s.c.MiniSolrCloudCluster Starting cluster of 4 servers in /home/jenkins/jenkins-slave/workspace/Lucene-Solr-Tests-8.x/solr/build/solr-core/test/J2/temp/solr.update.processor.DimensionalRoutedAliasUpdateProcessorTest_A49B1CEEC4DB6F1A-001/tempDir-001
   [junit4]   2> 447113 INFO  (TEST-DimensionalRoutedAliasUpdateProcessorTest.testCatTime-seed#[A49B1CEEC4DB6F1A]) [     ] o.a.s.c.ZkTestServer STARTING ZK TEST SERVER
   [junit4]   2> 447126 INFO  (ZkTestServer Run Thread) [     ] o.a.s.c.ZkTestServer client port:0.0.0.0/0.0.0.0:0
   [junit4]   2> 447126 INFO  (ZkTestServer Run Thread) [     ] o.a.s.c.ZkTestServer Starting server
   [junit4]   2> 447219 INFO  (TEST-DimensionalRoutedAliasUpdateProcessorTest.testCatTime-seed#[A49B1CEEC4DB6F1A]) [     ] o.a.s.c.ZkTestServer start zk server on port:36054
   [junit4]   2> 447219 INFO  (TEST-DimensionalRoutedAliasUpdateProcessorTest.testCatTime-seed#[A49B1CEEC4DB6F1A]) [     ] o.a.s.c.ZkTestServer parse host and port list: 127.0.0.1:36054
   [junit4]   2> 447219 INFO  (TEST-DimensionalRoutedAliasUpdateProcessorTest.testCatTime-seed#[A49B1CEEC4DB6F1A]) [     ] o.a.s.c.ZkTestServer connecting to 127.0.0.1 36054
   [junit4]   2> 447223 INFO  (TEST-DimensionalRoutedAliasUpdateProcessorTest.testCatTime-seed#[A49B1CEEC4DB6F1A]) [     ] o.a.s.c.c.ConnectionManager Waiting for client to connect to ZooKeeper
   [junit4]   2> 447460 INFO  (zkConnectionManagerCallback-287-thread-1) [     ] o.a.s.c.c.ConnectionManager zkClient has connected
   [junit4]   2> 447460 INFO  (TEST-DimensionalRoutedAliasUpdateProcessorTest.testCatTime-seed#[A49B1CEEC4DB6F1A]) [     ] o.a.s.c.c.ConnectionManager Client is connected to ZooKeeper
   [junit4]   2> 447499 INFO  (TEST-DimensionalRoutedAliasUpdateProcessorTest.testCatTime-seed#[A49B1CEEC4DB6F1A]) [     ] o.a.s.c.c.ConnectionManager Waiting for client to connect to ZooKeeper
   [junit4]   2> 447644 INFO  (zkConnectionManagerCallback-289-thread-1) [     ] o.a.s.c.c.ConnectionManager zkClient has connected
   [junit4]   2> 447644 INFO  (TEST-DimensionalRoutedAliasUpdateProcessorTest.testCatTime-seed#[A49B1CEEC4DB6F1A]) [     ] o.a.s.c.c.ConnectionManager Client is connected to ZooKeeper
   [junit4]   2> 447647 INFO  (TEST-DimensionalRoutedAliasUpdateProcessorTest.testCatTime-seed#[A49B1CEEC4DB6F1A]) [     ] o.a.s.c.c.ConnectionManager Waiting for client to connect to ZooKeeper
   [junit4]   2> 447717 INFO  (zkConnectionManagerCallback-291-thread-1) [     ] o.a.s.c.c.ConnectionManager zkClient has connected
   [junit4]   2> 447717 INFO  (TEST-DimensionalRoutedAliasUpdateProcessorTest.testCatTime-seed#[A49B1CEEC4DB6F1A]) [     ] o.a.s.c.c.ConnectionManager Client is connected to ZooKeeper
   [junit4]   2> 447870 WARN  (jetty-launcher-292-thread-1) [     ] o.e.j.s.AbstractConnector Ignoring deprecated socket close linger time
   [junit4]   2> 447871 INFO  (jetty-launcher-292-thread-1) [     ] o.a.s.c.s.e.JettySolrRunner Start Jetty (original configured port=0)
   [junit4]   2> 447871 INFO  (jetty-launcher-292-thread-1) [     ] o.a.s.c.s.e.JettySolrRunner Trying to start Jetty on port 0 try number 1 ...
   [junit4]   2> 447871 INFO  (jetty-launcher-292-thread-1) [     ] o.e.j.s.Server jetty-9.4.19.v20190610; built: 2019-06-10T16:30:51.723Z; git: afcf563148970e98786327af5e07c261fda175d3; jvm 1.8.0_191-b12
   [junit4]   2> 447914 INFO  (jetty-launcher-292-thread-1) [     ] o.e.j.s.session DefaultSessionIdManager workerName=node0
   [junit4]   2> 447914 INFO  (jetty-launcher-292-thread-1) [     ] o.e.j.s.session No SessionScavenger set, using defaults
   [junit4]   2> 447915 INFO  (jetty-launcher-292-thread-1) [     ] o.e.j.s.session node0 Scavenging every 660000ms
   [junit4]   2> 447915 WARN  (jetty-launcher-292-thread-4) [     ] o.e.j.s.AbstractConnector Ignoring deprecated socket close linger time
   [junit4]   2> 447915 INFO  (jetty-launcher-292-thread-1) [     ] o.e.j.s.h.ContextHandler Started o.e.j.s.ServletContextHandler@496d4807{/solr,null,AVAILABLE}
   [junit4]   2> 447915 INFO  (jetty-launcher-292-thread-4) [     ] o.a.s.c.s.e.JettySolrRunner Start Jetty (original configured port=0)
   [junit4]   2> 447915 INFO  (jetty-launcher-292-thread-4) [     ] o.a.s.c.s.e.JettySolrRunner Trying to start Jetty on port 0 try number 1 ...
   [junit4]   2> 447915 INFO  (jetty-launcher-292-thread-4) [     ] o.e.j.s.Server jetty-9.4.19.v20190610; built: 2019-06-10T16:30:51.723Z; git: afcf563148970e98786327af5e07c261fda175d3; jvm 1.8.0_191-b12
   [junit4]   2> 447919 WARN  (jetty-launcher-292-thread-3) [     ] o.e.j.s.AbstractConnector Ignoring deprecated socket close linger time
   [junit4]   2> 447919 INFO  (jetty-launcher-292-thread-3) [     ] o.a.s.c.s.e.JettySolrRunner Start Jetty (original configured port=0)
   [junit4]   2> 447919 INFO  (jetty-launcher-292-thread-3) [     ] o.a.s.c.s.e.JettySolrRunner Trying to start Jetty on port 0 try number 1 ...
   [junit4]   2> 447919 INFO  (jetty-launcher-292-thread-3) [     ] o.e.j.s.Server jetty-9.4.19.v20190610; built: 2019-06-10T16:30:51.723Z; git: afcf563148970e98786327af5e07c261fda175d3; jvm 1.8.0_191-b12
   [junit4]   2> 447933 WARN  (jetty-launcher-292-thread-2) [     ] o.e.j.s.AbstractConnector Ignoring deprecated socket close linger time
   [junit4]   2> 447933 INFO  (jetty-launcher-292-thread-2) [     ] o.a.s.c.s.e.JettySolrRunner Start Jetty (original configured port=0)
   [junit4]   2> 447933 INFO  (jetty-launcher-292-thread-2) [     ] o.a.s.c.s.e.JettySolrRunner Trying to start Jetty on port 0 try number 1 ...
   [junit4]   2> 447934 INFO  (jetty-launcher-292-thread-2) [     ] o.e.j.s.Server jetty-9.4.19.v20190610; built: 2019-06-10T16:30:51.723Z; git: afcf563148970e98786327af5e07c261fda175d3; jvm 1.8.0_191-b12
   [junit4]   2> 447935 INFO  (jetty-launcher-292-thread-4) [     ] o.e.j.s.session DefaultSessionIdManager workerName=node0
   [junit4]   2> 447935 INFO  (jetty-launcher-292-thread-4) [     ] o.e.j.s.session No SessionScavenger set, using defaults
   [junit4]   2> 447935 INFO  (jetty-launcher-292-thread-4) [     ] o.e.j.s.session node0 Scavenging every 660000ms
   [junit4]   2> 447935 INFO  (jetty-launcher-292-thread-4) [     ] o.e.j.s.h.ContextHandler Started o.e.j.s.ServletContextHandler@38b68eb4{/solr,null,AVAILABLE}
   [junit4]   2> 448107 INFO  (jetty-launcher-292-thread-3) [     ] o.e.j.s.session DefaultSessionIdManager workerName=node0
   [junit4]   2> 448107 INFO  (jetty-launcher-292-thread-3) [     ] o.e.j.s.session No SessionScavenger set, using defaults
   [junit4]   2> 448107 INFO  (jetty-launcher-292-thread-3) [     ] o.e.j.s.session node0 Scavenging every 660000ms
   [junit4]   2> 448123 INFO  (jetty-launcher-292-thread-3) [     ] o.e.j.s.h.ContextHandler Started o.e.j.s.ServletContextHandler@21e3915b{/solr,null,AVAILABLE}
   [junit4]   2> 448370 INFO  (jetty-launcher-292-thread-2) [     ] o.e.j.s.session DefaultSessionIdManager workerName=node0
   [junit4]   2> 448370 INFO  (jetty-launcher-292-thread-2) [     ] o.e.j.s.session No SessionScavenger set, using defaults
   [junit4]   2> 448370 INFO  (jetty-launcher-292-thread-2) [     ] o.e.j.s.session node0 Scavenging every 600000ms
   [junit4]   2> 448390 INFO  (jetty-launcher-292-thread-2) [     ] o.e.j.s.h.ContextHandler Started o.e.j.s.ServletContextHandler@6d3d885a{/solr,null,AVAILABLE}
   [junit4]   2> 448662 INFO  (jetty-launcher-292-thread-2) [     ] o.e.j.s.AbstractConnector Started ServerConnector@241286f4{SSL,[ssl, http/1.1]}{127.0.0.1:37660}
   [junit4]   2> 448662 INFO  (jetty-launcher-292-thread-2) [     ] o.e.j.s.Server Started @448870ms
   [junit4]   2> 448662 INFO  (jetty-launcher-292-thread-2) [     ] o.a.s.c.s.e.JettySolrRunner Jetty properties: {hostContext=/solr, hostPort=37660}
   [junit4]   2> 448662 ERROR (jetty-launcher-292-thread-2) [     ] o.a.s.u.StartupLoggingUtils Missing Java Option solr.log.dir. Logging may be missing or incomplete.
   [junit4]   2> 448662 INFO  (jetty-launcher-292-thread-2) [     ] o.a.s.s.SolrDispatchFilter Using logger factory org.apache.logging.slf4j.Log4jLoggerFactory
   [junit4]   2> 448662 INFO  (jetty-launcher-292-thread-2) [     ] o.a.s.s.SolrDispatchFilter  ___      _       Welcome to Apache Solr? version 8.3.0
   [junit4]   2> 448662 INFO  (jetty-launcher-292-thread-2) [     ] o.a.s.s.SolrDispatchFilter / __| ___| |_ _   Starting in cloud mode on port null
   [junit4]   2> 448662 INFO  (jetty-launcher-292-thread-2) [     ] o.a.s.s.SolrDispatchFilter \__ \/ _ \ | '_|  Install dir: null
   [junit4]   2> 448662 INFO  (jetty-launcher-292-thread-2) [     ] o.a.s.s.SolrDispatchFilter |___/\___/_|_|    Start time: 2019-08-15T11:57:10.007Z
   [junit4]   2> 448682 INFO  (jetty-launcher-292-thread-2) [     ] o.a.s.c.c.ConnectionManager Waiting for client to connect to ZooKeeper
   [junit4]   2> 448734 INFO  (jetty-launcher-292-thread-1) [     ] o.e.j.s.AbstractConnector Started ServerConnector@77945a63{SSL,[ssl, http/1.1]}{127.0.0.1:40600}
   [junit4]   2> 448734 INFO  (jetty-launcher-292-thread-1) [     ] o.e.j.s.Server Started @448942ms
   [junit4]   2> 448734 INFO  (jetty-launcher-292-thread-1) [     ] o.a.s.c.s.e.JettySolrRunner Jetty properties: {hostContext=/solr, hostPort=40600}
   [junit4]   2> 448735 ERROR (jetty-launcher-292-thread-1) [     ] o.a.s.u.StartupLoggingUtils Missing Java Option solr.log.dir. Logging may be missing or incomplete.
   [junit4]   2> 448735 INFO  (jetty-launcher-292-thread-1) [     ] o.a.s.s.SolrDispatchFilter Using logger factory org.apache.logging.slf4j.Log4jLoggerFactory
   [junit4]   2> 448735 INFO  (jetty-launcher-292-thread-1) [     ] o.a.s.s.SolrDispatchFilter  ___      _       Welcome to Apache Solr? version 8.3.0
   [junit4]   2> 448735 INFO  (jetty-launcher-292-thread-1) [     ] o.a.s.s.SolrDispatchFilter / __| ___| |_ _   Starting in cloud mode on port null
   [junit4]   2> 448735 INFO  (jetty-launcher-292-thread-1) [     ] o.a.s.s.SolrDispatchFilter \__ \/ _ \ | '_|  Install dir: null
   [junit4]   2> 448735 INFO  (jetty-launcher-292-thread-1) [     ] o.a.s.s.SolrDispatchFilter |___/\___/_|_|    Start time: 2019-08-15T11:57:10.080Z
   [junit4]   2> 448762 INFO  (jetty-launcher-292-thread-1) [     ] o.a.s.c.c.ConnectionManager Waiting for client to connect to ZooKeeper
   [junit4]   2> 448763 INFO  (jetty-launcher-292-thread-4) [     ] o.e.j.s.AbstractConnector Started ServerConnector@39d00d6a{SSL,[ssl, http/1.1]}{127.0.0.1:38610}
   [junit4]   2> 448763 INFO  (jetty-launcher-292-thread-4) [     ] o.e.j.s.Server Started @448971ms
   [junit4]   2> 448763 INFO  (jetty-launcher-292-thread-4) [     ] o.a.s.c.s.e.JettySolrRunner Jetty properties: {hostContext=/solr, hostPort=38610}
   [junit4]   2> 448763 ERROR (jetty-launcher-292-thread-4) [     ] o.a.s.u.StartupLoggingUtils Missing Java Option solr.log.dir. Logging may be missing or incomplete.
   [junit4]   2> 448763 INFO  (jetty-launcher-292-thread-4) [     ] o.a.s.s.SolrDispatchFilter Using logger factory org.apache.logging.slf4j.Log4jLoggerFactory
   [junit4]   2> 448763 INFO  (jetty-launcher-292-thread-4) [     ] o.a.s.s.SolrDispatchFilter  ___      _       Welcome to Apache Solr? version 8.3.0
   [junit4]   2> 448763 INFO  (jetty-launcher-292-thread-4) [     ] o.a.s.s.SolrDispatchFilter / __| ___| |_ _   Starting in cloud mode on port null
   [junit4]   2> 448763 INFO  (jetty-launcher-292-thread-4) [     ] o.a.s.s.SolrDispatchFilter \__ \/ _ \ | '_|  Install dir: null
   [junit4]   2> 448763 INFO  (jetty-launcher-292-thread-4) [     ] o.a.s.s.SolrDispatchFilter |___/\___/_|_|    Start time: 2019-08-15T11:57:10.108Z
   [junit4]   2> 448779 INFO  (jetty-launcher-292-thread-4) [     ] o.a.s.c.c.ConnectionManager Waiting for client to connect to ZooKeeper
   [junit4]   2> 448807 INFO  (jetty-launcher-292-thread-3) [     ] o.e.j.s.AbstractConnector Started ServerConnector@12e8009{SSL,[ssl, http/1.1]}{127.0.0.1:37499}
   [junit4]   2> 448807 INFO  (jetty-launcher-292-thread-3) [     ] o.e.j.s.Server Started @449015ms
   [junit4]   2> 448807 INFO  (jetty-launcher-292-thread-3) [     ] o.a.s.c.s.e.JettySolrRunner Jetty properties: {hostContext=/solr, hostPort=37499}
   [junit4]   2> 448807 ERROR (jetty-launcher-292-thread-3) [     ] o.a.s.u.StartupLoggingUtils Missing Java Option solr.log.dir. Logging may be missing or incomplete.
   [junit4]   2> 448807 INFO  (jetty-launcher-292-thread-3) [     ] o.a.s.s.SolrDispatchFilter Using logger factory org.apache.logging.slf4j.Log4jLoggerFactory
   [junit4]   2> 448808 INFO  (jetty-launcher-292-thread-3) [     ] o.a.s.s.SolrDispatchFilter  ___      _       Welcome to Apache Solr? version 8.3.0
   [junit4]   2> 448808 INFO  (jetty-launcher-292-thread-3) [     ] o.a.s.s.SolrDispatchFilter / __| ___| |_ _   Starting in cloud mode on port null
   [junit4]   2> 448808 INFO  (jetty-launcher-292-thread-3) [     ] o.a.s.s.SolrDispatchFilter \__ \/ _ \ | '_|  Install dir: null
   [junit4]   2> 448808 INFO  (jetty-launcher-292-thread-3) [     ] o.a.s.s.SolrDispatchFilter |___/\___/_|_|    Start time: 2019-08-15T11:57:10.153Z
   [junit4]   2> 448896 INFO  (jetty-launcher-292-thread-3) [     ] o.a.s.c.c.ConnectionManager Waiting for client to connect to ZooKeeper
   [junit4]   2> 448945 INFO  (zkConnectionManagerCallback-294-thread-1) [     ] o.a.s.c.c.ConnectionManager zkClient has connected
   [junit4]   2> 448953 INFO  (jetty-launcher-292-thread-2) [     ] o.a.s.c.c.ConnectionManager Client is connected to ZooKeeper
   [junit4]   2> 448972 INFO  (jetty-launcher-292-thread-2) [     ] o.a.s.s.SolrDispatchFilter solr.xml found in ZooKeeper. Loading...
   [junit4]   2> 449026 INFO  (zkConnectionManagerCallback-296-thread-1) [     ] o.a.s.c.c.ConnectionManager zkClient has connected
   [junit4]   2> 449029 INFO  (zkConnectionManagerCallback-300-thread-1) [     ] o.a.s.c.c.ConnectionManager zkClient has connected
   [junit4]   2> 449029 INFO  (jetty-launcher-292-thread-3) [     ] o.a.s.c.c.ConnectionManager Client is connected to ZooKeeper
   [junit4]   2> 449029 INFO  (jetty-launcher-292-thread-1) [     ] o.a.s.c.c.ConnectionManager Client is connected to ZooKeeper
   [junit4]   2> 449066 INFO  (zkConnectionManagerCallback-298-thread-1) [     ] o.a.s.c.c.ConnectionManager zkClient has connected
   [junit4]   2> 449079 INFO  (jetty-launcher-292-thread-4) [     ] o.a.s.c.c.ConnectionManager Client is connected to ZooKeeper
   [junit4]   2> 449080 INFO  (jetty-launcher-292-thread-1) [     ] o.a.s.s.SolrDispatchFilter solr.xml found in ZooKeeper. Loading...
   [junit4]   2> 449080 INFO  (jetty-launcher-292-thread-3) [     ] o.a.s.s.SolrDispatchFilter solr.xml found in ZooKeeper. Loading...
   [junit4]   2> 449137 INFO  (jetty-launcher-292-thread-4) [     ] o.a.s.s.SolrDispatchFilter solr.xml found in ZooKeeper. Loading...
   [junit4]   2> 450756 INFO  (jetty-launcher-292-thread-2) [     ] o.a.s.h.c.HttpShardHandlerFactory Host whitelist initialized: WhitelistHostChecker [whitelistHosts=null, whitelistHostCheckingEnabled=true]
   [junit4]   2> 450757 WARN  (jetty-launcher-292-thread-2) [     ] o.a.s.c.s.i.Http2SolrClient Create Http2SolrClient with HTTP/1.1 transport since Java 8 or lower versions does not support SSL + HTTP/2
   [junit4]   2> 450974 WARN  (jetty-launcher-292-thread-2) [     ] o.e.j.u.s.S.config Trusting all certificates configured for Client@e04854b[provider=null,keyStore=null,trustStore=null]
   [junit4]   2> 450974 WARN  (jetty-launcher-292-thread-2) [     ] o.e.j.u.s.S.config No Client EndPointIdentificationAlgorithm configured for Client@e04854b[provider=null,keyStore=null,trustStore=null]
   [junit4]   2> 451020 WARN  (jetty-launcher-292-thread-2) [     ] o.a.s.c.s.i.Http2SolrClient Create Http2SolrClient with HTTP/1.1 transport since Java 8 or lower versions does not support SSL + HTTP/2
   [junit4]   2> 451121 INFO  (jetty-launcher-292-thread-3) [     ] o.a.s.h.c.HttpShardHandlerFactory Host whitelist initialized: WhitelistHostChecker [whitelistHosts=null, whitelistHostCheckingEnabled=true]
   [junit4]   2> 451121 WARN  (jetty-launcher-292-thread-3) [     ] o.a.s.c.s.i.Http2SolrClient Create Http2SolrClient with HTTP/1.1 transport since Java 8 or lower versions does not support SSL + HTTP/2
   [junit4]   2> 451124 WARN  (jetty-launcher-292-thread-2) [     ] o.e.j.u.s.S.config Trusting all certificates configured for Client@1387dc4d[provider=null,keyStore=null,trustStore=null]
   [junit4]   2> 451124 WARN  (jetty-launcher-292-thread-2) [     ] o.e.j.u.s.S.config No Client EndPointIdentificationAlgorithm configured for Client@1387dc4d[provider=null,keyStore=null,trustStore=null]
   [junit4]   2> 451125 INFO  (jetty-launcher-292-thread-2) [     ] o.a.s.c.ZkContainer Zookeeper client=127.0.0.1:36054/solr
   [junit4]   2> 451145 INFO  (jetty-launcher-292-thread-2) [     ] o.a.s.c.c.ConnectionManager Waiting for client to connect to ZooKeeper
   [junit4]   2> 451227 WARN  (jetty-launcher-292-thread-3) [     ] o.e.j.u.s.S.config Trusting all certificates configured for Client@381c278b[provider=null,keyStore=null,trustStore=null]
   [junit4]   2> 451227 WARN  (jetty-launcher-292-thread-3) [     ] o.e.j.u.s.S.config No Client EndPointIdentificationAlgorithm configured for Client@381c278b[provider=null,keyStore=null,trustStore=null]
   [junit4]   2> 451246 WARN  (jetty-launcher-292-thread-3) [     ] o.a.s.c.s.i.Http2SolrClient Create Http2SolrClient with HTTP/1.1 transport since Java 8 or lower versions does not support SSL + HTTP/2
   [junit4]   2> 451335 WARN  (jetty-launcher-292-thread-3) [     ] o.e.j.u.s.S.config Trusting all certificates configured for Client@3dd2359a[provider=null,keyStore=null,trustStore=null]
   [junit4]   2> 451335 WARN  (jetty-launcher-292-thread-3) [     ] o.e.j.u.s.S.config No Client EndPointIdentificationAlgorithm configured for Client@3dd2359a[provider=null,keyStore=null,trustStore=null]
   [junit4]   2> 451336 INFO  (jetty-launcher-292-thread-3) [     ] o.a.s.c.ZkContainer Zookeeper client=127.0.0.1:36054/solr
   [junit4]   2> 451337 INFO  (jetty-launcher-292-thread-3) [     ] o.a.s.c.c.ConnectionManager Waiting for client to connect to ZooKeeper
   [junit4]   2> 451355 INFO  (zkConnectionManagerCallback-311-thread-1) [     ] o.a.s.c.c.ConnectionManager zkClient has connected
   [junit4]   2> 451359 INFO  (jetty-launcher-292-thread-2) [     ] o.a.s.c.c.ConnectionManager Client is connected to ZooKeeper
   [junit4]   2> 451423 INFO  (jetty-launcher-292-thread-1) [     ] o.a.s.h.c.HttpShardHandlerFactory Host whitelist initialized: WhitelistHostChecker [whitelistHosts=null, whitelistHostCheckingEnabled=true]
   [junit4]   2> 451445 INFO  (zkConnectionManagerCallback-316-thread-1) [     ] o.a.s.c.c.ConnectionManager zkClient has connected
   [junit4]   2> 451445 INFO  (jetty-launcher-292-thread-3) [     ] o.a.s.c.c.ConnectionManager Client is connected to ZooKeeper
   [junit4]   2> 451486 WARN  (jetty-launcher-292-thread-1) [     ] o.a.s.c.s.i.Http2SolrClient Create Http2SolrClient with HTTP/1.1 transport since Java 8 or lower versions does not support SSL + HTTP/2
   [junit4]   2> 451538 WARN  (jetty-launcher-292-thread-1) [     ] o.e.j.u.s.S.config Trusting all certificates configured for Client@94e42ff[provider=null,keyStore=null,trustStore=null]
   [junit4]   2> 451539 WARN  (jetty-launcher-292-thread-1) [     ] o.e.j.u.s.S.config No Client EndPointIdentificationAlgorithm configured for Client@94e42ff[provider=null,keyStore=null,trustStore=null]
   [junit4]   2> 451541 WARN  (jetty-launcher-292-thread-1) [     ] o.a.s.c.s.i.Http2SolrClient Create Http2SolrClient with HTTP/1.1 transport since Java 8 or lower versions does not support SSL + HTTP/2
   [junit4]   2> 451545 WARN  (jetty-launcher-292-thread-1) [     ] o.e.j.u.s.S.config Trusting all certificates configured for Client@2821d884[provider=null,keyStore=null,trustStore=null]
   [junit4]   2> 451545 WARN  (jetty-launcher-292-thread-1) [     ] o.e.j.u.s.S.config No Client EndPointIdentificationAlgorithm configured for Client@2821d884[provider=null,keyStore=null,trustStore=null]
   [junit4]   2> 451566 INFO  (jetty-launcher-292-thread-1) [     ] o.a.s.c.ZkContainer Zookeeper client=127.0.0.1:36054/solr
   [junit4]   2> 451602 INFO  (jetty-launcher-292-thread-1) [     ] o.a.s.c.c.ConnectionManager Waiting for client to connect to ZooKeeper
   [junit4]   2> 451604 INFO  (jetty-launcher-292-thread-2) [n:127.0.0.1:37660_solr     ] o.a.s.c.c.ConnectionManager Waiting for client to connect to ZooKeeper
   [junit4]   2> 451712 INFO  (jetty-launcher-292-thread-3) [n:127.0.0.1:37499_solr     ] o.a.s.c.c.ConnectionManager Waiting for client to connect to ZooKeeper
   [junit4]   2> 451802 INFO  (jetty-launcher-292-thread-4) [     ] o.a.s.h.c.HttpShardHandlerFactory Host whitelist initialized: WhitelistHostChecker [whitelistHosts=null, whitelistHostCheckingEnabled=true]
   [junit4]   2> 451802 INFO  (zkConnectionManagerCallback-322-thread-1) [     ] o.a.s.c.c.ConnectionManager zkClient has connected
   [junit4]   2> 451802 INFO  (jetty-launcher-292-thread-1) [     ] o.a.s.c.c.ConnectionManager Client is connected to ZooKeeper
   [junit4]   2> 451821 WARN  (jetty-launcher-292-thread-4) [     ] o.a.s.c.s.i.Http2SolrClient Create Http2SolrClient with HTTP/1.1 transport since Java 8 or lower versions does not support SSL + HTTP/2
   [junit4]   2> 451841 INFO  (zkConnectionManagerCallback-326-thread-1) [     ] o.a.s.c.c.ConnectionManager zkClient has connected
   [junit4]   2> 451841 INFO  (jetty-launcher-292-thread-3) [n:127.0.0.1:37499_solr     ] o.a.s.c.c.ConnectionManager Client is connected to ZooKeeper
   [junit4]   2> 451842 INFO  (zkConnectionManagerCallback-324-thread-1) [     ] o.a.s.c.c.ConnectionManager zkClient has connected
   [junit4]   2> 451842 INFO  (jetty-launcher-292-thread-2) [n:127.0.0.1:37660_solr     ] o.a.s.c.c.ConnectionManager Client is connected to ZooKeeper
   [junit4]   2> 451843 WARN  (jetty-launcher-292-thread-4) [     ] o.e.j.u.s.S.config Trusting all certificates configured for Client@60777a[provider=null,keyStore=null,trustStore=null]
   [junit4]   2> 451843 WARN  (jetty-launcher-292-thread-4) [     ] o.e.j.u.s.S.config No Client EndPointIdentificationAlgorithm configured for Client@60777a[provider=null,keyStore=null,trustStore=null]
   [junit4]   2> 451884 WARN  (jetty-launcher-292-thread-4) [     ] o.a.s.c.s.i.Http2SolrClient Create Http2SolrClient with HTTP/1.1 transport since Java 8 or lower versions does not support SSL + HTTP/2
   [junit4]   2> 451951 WARN  (jetty-launcher-292-thread-4) [     ] o.e.j.u.s.S.config Trusting all certificates configured for Client@1094dec2[provider=null,keyStore=null,trustStore=null]
   [junit4]   2> 451951 WARN  (jetty-launcher-292-thread-4) [     ] o.e.j.u.s.S.config No Client EndPointIdentificationAlgorithm configured for Client@1094dec2[provider=null,keyStore=null,trustStore=null]
   [junit4]   2> 451952 INFO  (jetty-launcher-292-thread-4) [     ] o.a.s.c.ZkContainer Zookeeper client=127.0.0.1:36054/solr
   [junit4]   2> 451957 INFO  (jetty-launcher-292-thread-4) [     ] o.a.s.c.c.ConnectionManager Waiting for client to connect to ZooKeeper
   [junit4]   2> 452032 INFO  (jetty-launcher-292-thread-1) [n:127.0.0.1:40600_solr     ] o.a.s.c.c.ConnectionManager Waiting for client to connect to ZooKeeper
   [junit4]   2> 452032 INFO  (zkConnectionManagerCallback-332-thread-1) [     ] o.a.s.c.c.ConnectionManager zkClient has connected
   [junit4]   2> 452056 INFO  (jetty-launcher-292-thread-4) [     ] o.a.s.c.c.ConnectionManager Client is connected to ZooKeeper
   [junit4]   2> 452076 INFO  (zkConnectionManagerCallback-334-thread-1) [     ] o.a.s.c.c.ConnectionManager zkClient has connected
   [junit4]   2> 452076 INFO  (jetty-launcher-292-thread-1) [n:127.0.0.1:40600_solr     ] o.a.s.c.c.ConnectionManager Client is connected to ZooKeeper
   [junit4]   2> 452185 INFO  (jetty-launcher-292-thread-4) [n:127.0.0.1:38610_solr     ] o.a.s.c.c.ConnectionManager Waiting for client to connect to ZooKeeper
   [junit4]   2> 452209 INFO  (zkConnectionManagerCallback-338-thread-1) [     ] o.a.s.c.c.ConnectionManager zkClient has connected
   [junit4]   2> 452209 INFO  (jetty-launcher-292-thread-4) [n:127.0.0.1:38610_solr     ] o.a.s.c.c.ConnectionManager Client is connected to ZooKeeper
   [junit4]   2> 452621 INFO  (jetty-launcher-292-thread-4) [n:127.0.0.1:38610_solr     ] o.a.s.c.OverseerElectionContext I am going to be the leader 127.0.0.1:38610_solr
   [junit4]   2> 452639 INFO  (jetty-launcher-292-thread-4) [n:127.0.0.1:38610_solr     ] o.a.s.c.Overseer Overseer (id=75216929238941710-127.0.0.1:38610_solr-n_0000000000) starting
   [junit4]   2> 452789 INFO  (jetty-launcher-292-thread-4) [n:127.0.0.1:38610_solr     ] o.a.s.c.c.ConnectionManager Waiting for client to connect to ZooKeeper
   [junit4]   2> 452879 INFO  (zkConnectionManagerCallback-349-thread-1) [     ] o.a.s.c.c.ConnectionManager zkClient has connected
   [junit4]   2> 452879 INFO  (jetty-launcher-292-thread-4) [n:127.0.0.1:38610_solr     ] o.a.s.c.c.ConnectionManager Client is connected to ZooKeeper
   [junit4]   2> 453034 INFO  (jetty-launcher-292-thread-4) [n:127.0.0.1:38610_solr     ] o.a.s.c.s.i.ZkClientClusterStateProvider Cluster at 127.0.0.1:36054/solr ready
   [junit4]   2> 453049 INFO  (OverseerStateUpdate-75216929238941710-127.0.0.1:38610_solr-n_0000000000) [n:127.0.0.1:38610_solr     ] o.a.s.c.Overseer Starting to work on the main queue : 127.0.0.1:38610_solr
   [junit4]   2> 453049 INFO  (jetty-launcher-292-thread-4) [n:127.0.0.1:38610_solr     ] o.a.s.c.ZkController Register node as live in ZooKeeper:/live_nodes/127.0.0.1:38610_solr
   [junit4]   2> 453068 INFO  (OverseerStateUpdate-75216929238941710-127.0.0.1:38610_solr-n_0000000000) [n:127.0.0.1:38610_solr     ] o.a.s.c.c.ZkStateReader Updated live nodes from ZooKeeper... (0) -> (1)
   [junit4]   2> 453073 INFO  (zkCallback-348-thread-1) [     ] o.a.s.c.c.ZkStateReader Updated live nodes from ZooKeeper... (0) -> (1)
   [junit4]   2> 453105 INFO  (jetty-launcher-292-thread-4) [n:127.0.0.1:38610_solr     ] o.a.s.c.LibListener clusterprops.json changed , version 0
   [junit4]   2> 453246 INFO  (jetty-launcher-292-thread-4) [n:127.0.0.1:38610_solr     ] o.a.s.h.a.MetricsHistoryHandler No .system collection, keeping metrics history in memory.
   [junit4]   2> 453381 INFO  (jetty-launcher-292-thread-4) [n:127.0.0.1:38610_solr     ] o.a.s.m.r.SolrJmxReporter JMX monitoring for 'solr_38610.solr.node' (registry 'solr.node') enabled at server: com.sun.jmx.mbeanserver.JmxMBeanServer@4e071109
   [junit4]   2> 453404 INFO  (jetty-launcher-292-thread-4) [n:127.0.0.1:38610_solr     ] o.a.s.m.r.SolrJmxReporter JMX monitoring for 'solr_38610.solr.jvm' (registry 'solr.jvm') enabled at server: com.sun.jmx.mbeanserver.JmxMBeanServer@4e071109
   [junit4]   2> 453404 INFO  (jetty-launcher-292-thread-4) [n:127.0.0.1:38610_solr     ] o.a.s.m.r.SolrJmxReporter JMX monitoring for 'solr_38610.solr.jetty' (registry 'solr.jetty') enabled at server: com.sun.jmx.mbeanserver.JmxMBeanServer@4e071109
   [junit4]   2> 453417 INFO  (jetty-launcher-292-thread-4) [n:127.0.0.1:38610_solr     ] o.a.s.c.CorePropertiesLocator Found 0 core definitions underneath /home/jenkins/jenkins-slave/workspace/Lucene-Solr-Tests-8.x/solr/build/solr-core/test/J2/temp/solr.update.processor.DimensionalRoutedAliasUpdateProcessorTest_A49B1CEEC4DB6F1A-001/tempDir-001/node2/.
   [junit4]   2> 453672 INFO  (jetty-launcher-292-thread-3) [n:127.0.0.1:37499_solr     ] o.a.s.c.c.ZkStateReader Updated live nodes from ZooKeeper... (0) -> (1)
   [junit4]   2> 453699 INFO  (jetty-launcher-292-thread-3) [n:127.0.0.1:37499_solr     ] o.a.s.c.ZkController Publish node=127.0.0.1:37499_solr as DOWN
   [junit4]   2> 453721 INFO  (jetty-launcher-292-thread-3) [n:127.0.0.1:37499_solr     ] o.a.s.c.TransientSolrCoreCacheDefault Allocating transient cache for 2147483647 transient cores
   [junit4]   2> 453721 INFO  (jetty-launcher-292-thread-3) [n:127.0.0.1:37499_solr     ] o.a.s.c.ZkController Register node as live in ZooKeeper:/live_nodes/127.0.0.1:37499_solr
   [junit4]   2> 453723 INFO  (zkCallback-337-thread-1) [     ] o.a.s.c.c.ZkStateReader Updated live nodes from ZooKeeper... (1) -> (2)
   [junit4]   2> 453723 INFO  (zkCallback-348-thread-1) [     ] o.a.s.c.c.ZkStateReader Updated live nodes from ZooKeeper... (1) -> (2)
   [junit4]   2> 453723 INFO  (zkCallback-325-thread-1) [     ] o.a.s.c.c.ZkStateReader Updated live nodes from ZooKeeper... (1) -> (2)
   [junit4]   2> 453724 INFO  (jetty-launcher-292-thread-3) [n:127.0.0.1:37499_solr     ] o.a.s.c.c.ConnectionManager Waiting for client to connect to ZooKeeper
   [junit4]   2> 453757 INFO  (zkConnectionManagerCallback-355-thread-1) [     ] o.a.s.c.c.ConnectionManager zkClient has connected
   [junit4]   2> 453758 INFO  (jetty-launcher-292-thread-3) [n:127.0.0.1:37499_solr     ] o.a.s.c.c.ConnectionManager Client is connected to ZooKeeper
   [junit4]   2> 453807 INFO  (jetty-launcher-292-thread-3) [n:127.0.0.1:37499_solr     ] o.a.s.c.c.ZkStateReader Updated live nodes from ZooKeeper... (0) -> (2)
   [junit4]   2> 453808 INFO  (jetty-launcher-292-thread-3) [n:127.0.0.1:37499_solr     ] o.a.s.c.s.i.ZkClientClusterStateProvider Cluster at 127.0.0.1:36054/solr ready
   [junit4]   2> 453808 INFO  (jetty-launcher-292-thread-3) [n:127.0.0.1:37499_solr     ] o.a.s.c.LibListener clusterprops.json changed , version 0
   [junit4]   2> 453905 INFO  (jetty-launcher-292-thread-3) [n:127.0.0.1:37499_solr     ] o.a.s.h.a.MetricsHistoryHandler No .system collection, keeping metrics history in memory.
   [junit4]   2> 454054 INFO  (jetty-launcher-292-thread-1) [n:127.0.0.1:40600_solr     ] o.a.s.c.c.ZkStateReader Updated live nodes from ZooKeeper... (0) -> (2)
   [junit4]   2> 454066 INFO  (jetty-launcher-292-thread-3) [n:127.0.0.1:37499_solr     ] o.a.s.m.r.SolrJmxReporter JMX monitoring for 'solr_37499.solr.node' (registry 'solr.node') enabled at server: com.sun.jmx.mbeanserver.JmxMBeanServer@4e071109
   [junit4]   2> 454074 INFO  (jetty-launcher-292-thread-1) [n:127.0.0.1:40600_solr     ] o.a.s.c.ZkController Publish node=127.0.0.1:40600_solr as DOWN
   [junit4]   2> 454075 INFO  (jetty-launcher-292-thread-1) [n:127.0.0.1:40600_solr     ] o.a.s.c.TransientSolrCoreCacheDefault Allocating transient cache for 2147483647 transient cores
   [junit4]   2> 454075 INFO  (jetty-launcher-292-thread-1) [n:127.0.0.1:40600_solr     ] o.a.s.c.ZkController Register node as live in ZooKeeper:/live_nodes/127.0.0.1:40600_solr
   [junit4]   2> 454090 INFO  (zkCallback-348-thread-1) [     ] o.a.s.c.c.ZkStateReader Updated live nodes from ZooKeeper... (2) -> (3)
   [junit4]   2> 454090 INFO  (zkCallback-333-thread-1) [     ] o.a.s.c.c.ZkStateReader Updated live nodes from ZooKeeper... (2) -> (3)
   [junit4]   2> 454091 INFO  (zkCallback-354-thread-1) [     ] o.a.s.c.c.ZkStateReader Updated live nodes from ZooKeeper... (2) -> (3)
   [junit4]   2> 454091 INFO  (zkCallback-325-thread-1) [     ] o.a.s.c.c.ZkStateReader Updated live nodes from ZooKeeper... (2) -> (3)
   [junit4]   2> 454091 INFO  (zkCallback-337-thread-2) [     ] o.a.s.c.c.ZkStateReader Updated live nodes from ZooKeeper... (2) -> (3)
   [junit4]   2> 454092 INFO  (jetty-launcher-292-thread-1) [n:127.0.0.1:40600_solr     ] o.a.s.c.c.ConnectionManager Waiting for client to connect to ZooKeeper
   [junit4]   2> 454123 INFO  (jetty-launcher-292-thread-3) [n:127.0.0.1:37499_solr     ] o.a.s.m.r.SolrJmxReporter JMX monitoring for 'solr_37499.solr.jvm' (registry 'solr.jvm') enabled at server: com.sun.jmx.mbeanserver.JmxMBeanServer@4e071109
   [junit4]   2> 454123 INFO  (jetty-launcher-292-thread-3) [n:127.0.0.1:37499_solr     ] o.a.s.m.r.SolrJmxReporter JMX monitoring for 'solr_37499.solr.jetty' (registry 'solr.jetty') enabled at server: com.sun.jmx.mbeanserver.JmxMBeanServer@4e071109
   [junit4]   2> 454124 INFO  (jetty-launcher-292-thread-3) [n:127.0.0.1:37499_solr     ] o.a.s.c.CorePropertiesLocator Found 0 core definitions underneath /home/jenkins/jenkins-slave/workspace/Lucene-Solr-Tests-8.x/solr/build/solr-core/test/J2/temp/solr.update.processor.DimensionalRoutedAliasUpdateProcessorTest_A49B1CEEC4DB6F1A-001/tempDir-001/node3/.
   [junit4]   2> 454132 INFO  (jetty-launcher-292-thread-2) [n:127.0.0.1:37660_solr     ] o.a.s.c.c.ZkStateReader Updated live nodes from ZooKeeper... (0) -> (3)
   [junit4]   2> 454208 INFO  (zkConnectionManagerCallback-361-thread-1) [     ] o.a.s.c.c.ConnectionManager zkClient has connected
   [junit4]   2> 454208 INFO  (jetty-launcher-292-thread-1) [n:127.0.0.1:40600_solr     ] o.a.s.c.c.ConnectionManager Client is connected to ZooKeeper
   [junit4]   2> 454264 INFO  (jetty-launcher-292-thread-1) [n:127.0.0.1:40600_solr     ] o.a.s.c.c.ZkStateReader Updated live nodes from ZooKeeper... (0) -> (3)
   [junit4]   2> 454284 INFO  (jetty-launcher-292-thread-1) [n:127.0.0.1:40600_solr     ] o.a.s.c.s.i.ZkClientClusterStateProvider Cluster at 127.0.0.1:36054/solr ready
   [junit4]   2> 454285 INFO  (jetty-launcher-292-thread-1) [n:127.0.0.1:40600_solr     ] o.a.s.c.LibListener clusterprops.json changed , version 0
   [junit4]   2> 454300 INFO  (jetty-launcher-292-thread-2) [n:127.0.0.1:37660_solr     ] o.a.s.c.ZkController Publish node=127.0.0.1:37660_solr as DOWN
   [junit4]   2> 454330 INFO  (jetty-launcher-292-thread-2) [n:127.0.0.1:37660_solr     ] o.a.s.c.TransientSolrCoreCacheDefault Allocating transient cache for 2147483647 transient cores
   [junit4]   2> 454330 INFO  (jetty-launcher-292-thread-2) [n:127.0.0.1:37660_solr     ] o.a.s.c.ZkController Register node as live in ZooKeeper:/live_nodes/127.0.0.1:37660_solr
   [junit4]   2> 454332 INFO  (zkCallback-337-thread-2) [     ] o.a.s.c.c.ZkStateReader Updated live nodes from ZooKeeper... (3) -> (4)
   [junit4]   2> 454332 INFO  (zkCallback-348-thread-1) [     ] o.a.s.c.c.ZkStateReader Updated live nodes from ZooKeeper... (3) -> (4)
   [junit4]   2> 454332 INFO  (zkCallback-325-thread-1) [     ] o.a.s.c.c.ZkStateReader Updated live nodes from ZooKeeper... (3) -> (4)
   [junit4]   2> 454332 INFO  (zkCallback-323-thread-1) [     ] o.a.s.c.c.ZkStateReader Updated live nodes from ZooKeeper... (3) -> (4)
   [junit4]   2> 454341 INFO  (jetty-launcher-292-thread-2) [n:127.0.0.1:37660_solr     ] o.a.s.c.c.ConnectionManager Waiting for client to connect to ZooKeeper
   [junit4]   2> 454366 INFO  (zkConnectionManagerCallback-366-thread-1) [     ] o.a.s.c.c.ConnectionManager zkClient has connected
   [junit4]   2> 454368 INFO  (jetty-launcher-292-thread-2) [n:127.0.0.1:37660_solr     ] o.a.s.c.c.ConnectionManager Client is connected to ZooKeeper
   [junit4]   2> 454394 INFO  (zkCallback-360-thread-1) [     ] o.a.s.c.c.ZkStateReader Updated live nodes from ZooKeeper... (3) -> (4)
   [junit4]   2> 454395 INFO  (jetty-launcher-292-thread-2) [n:127.0.0.1:37660_solr     ] o.a.s.c.c.ZkStateReader Updated live nodes from ZooKeeper... (0) -> (4)
   [junit4]   2> 454396 INFO  (jetty-launcher-292-thread-2) [n:127.0.0.1:37660_solr     ] o.a.s.c.s.i.ZkClientClusterStateProvider Cluster at 127.0.0.1:36054/solr ready
   [junit4]   2> 454396 INFO  (jetty-launcher-292-thread-2) [n:127.0.0.1:37660_solr     ] o.a.s.c.LibListener clusterprops.json changed , version 0
   [junit4]   2> 454413 INFO  (zkCallback-333-thread-1) [     ] o.a.s.c.c.ZkStateReader Updated live nodes from ZooKeeper... (3) -> (4)
   [junit4]   2> 454414 INFO  (zkCallback-354-thread-1) [     ] o.a.s.c.c.ZkStateReader Updated live nodes from ZooKeeper... (3) -> (4)
   [junit4]   2> 454442 INFO  (jetty-launcher-292-thread-1) [n:127.0.0.1:40600_solr     ] o.a.s.h.a.MetricsHistoryHandler No .system collection, keeping metrics history in memory.
   [junit4]   2> 454485 INFO  (jetty-launcher-292-thread-2) [n:127.0.0.1:37660_solr     ] o.a.s.h.a.MetricsHistoryHandler No .system collection, keeping metrics history in memory.
   [junit4]   2> 454486 INFO  (jetty-launcher-292-thread-1) [n:127.0.0.1:40600_solr     ] o.a.s.m.r.SolrJmxReporter JMX monitoring for 'solr_40600.solr.node' (registry 'solr.node') enabled at server: com.sun.jmx.mbeanserver.JmxMBeanServer@4e071109
   [junit4]   2> 454521 INFO  (jetty-launcher-292-thread-1) [n:127.0.0.1:40600_solr     ] o.a.s.m.r.SolrJmxReporter JMX monitoring for 'solr_40600.solr.jvm' (registry 'solr.jvm') enabled at server: com.sun.jmx.mbeanserver.JmxMBeanServer@4e071109
   [junit4]   2> 454522 INFO  (jetty-launcher-292-thread-1) [n:127.0.0.1:40600_solr     ] o.a.s.m.r.SolrJmxReporter JMX monitoring for 'solr_40600.solr.jetty' (registry 'solr.jetty') enabled at server: com.sun.jmx.mbeanserver.JmxMBeanServer@4e071109
   [junit4]   2> 454523 INFO  (jetty-launcher-292-thread-1) [n:127.0.0.1:40600_solr     ] o.a.s.c.CorePropertiesLocator Found 0 core definitions underneath /home/jenkins/jenkins-slave/workspace/Lucene-Solr-Tests-8.x/solr/build/solr-core/test/J2/temp/solr.update.processor.DimensionalRoutedAliasUpdateProcessorTest_A49B1CEEC4DB6F1A-001/tempDir-001/node1/.
   [junit4]   2> 454538 INFO  (jetty-launcher-292-thread-2) [n:127.0.0.1:37660_solr     ] o.a.s.m.r.SolrJmxReporter JMX monitoring for 'solr_37660.solr.node' (registry 'solr.node') enabled at server: com.sun.jmx.mbeanserver.JmxMBeanServer@4e071109
   [junit4]   2> 454574 INFO  (jetty-launcher-292-thread-2) [n:127.0.0.1:37660_solr     ] o.a.s.m.r.SolrJmxReporter JMX monitoring for 'solr_37660.solr.jvm' (registry 'solr.jvm') enabled at server: com.sun.jmx.mbeanserver.JmxMBeanServer@4e071109
   [junit4]   2> 454574 INFO  (jetty-launcher-292-thread-2) [n:127.0.0.1:37660_solr     ] o.a.s.m.r.SolrJmxReporter JMX monitoring for 'solr_37660.solr.jetty' (registry 'solr.jetty') enabled at server: com.sun.jmx.mbeanserver.JmxMBeanServer@4e071109
   [junit4]   2> 454575 INFO  (jetty-launcher-292-thread-2) [n:127.0.0.1:37660_solr     ] o.a.s.c.CorePropertiesLocator Found 0 core definitions underneath /home/jenkins/jenkins-slave/workspace/Lucene-Solr-Tests-8.x/solr/build/solr-core/test/J2/temp/solr.update.processor.DimensionalRoutedAliasUpdateProcessorTest_A49B1CEEC4DB6F1A-001/tempDir-001/node4/.
   [junit4]   2> 455429 INFO  (TEST-DimensionalRoutedAliasUpdateProcessorTest.testCatTime-seed#[A49B1CEEC4DB6F1A]) [     ] o.a.s.c.c.ConnectionManager Waiting for client to connect to ZooKeeper
   [junit4]   2> 455536 INFO  (zkConnectionManagerCallback-373-thread-1) [     ] o.a.s.c.c.ConnectionManager zkClient has connected
   [junit4]   2> 455536 INFO  (TEST-DimensionalRoutedAliasUpdateProcessorTest.testCatTime-seed#[A49B1CEEC4DB6F1A]) [     ] o.a.s.c.c.ConnectionManager Client is connected to ZooKeeper
   [junit4]   2> 455561 INFO  (TEST-DimensionalRoutedAliasUpdateProcessorTest.testCatTime-seed#[A49B1CEEC4DB6F1A]) [     ] o.a.s.c.c.ZkStateReader Updated live nodes from ZooKeeper... (0) -> (4)
   [junit4]   2> 455562 INFO  (TEST-DimensionalRoutedAliasUpdateProcessorTest.testCatTime-seed#[A49B1CEEC4DB6F1A]) [     ] o.a.s.c.s.i.ZkClientClusterStateProvider Cluster at 127.0.0.1:36054/solr ready
   [junit4]   2> 455959 INFO  (qtp1982523364-1099) [n:127.0.0.1:38610_solr     ] o.a.s.h.a.CollectionsHandler Invoked Collection Action :clusterstatus with params action=CLUSTERSTATUS&wt=javabin&version=2 and sendToOCPQueue=true
   [junit4]   2> 455996 INFO  (qtp1982523364-1099) [n:127.0.0.1:38610_solr     ] o.a.s.s.HttpSolrCall [admin] webapp=null path=/admin/collections params={action=CLUSTERSTATUS&wt=javabin&version=2} status=0 QTime=37
   [junit4]   2> 456083 INFO  (TEST-DimensionalRoutedAliasUpdateProcessorTest.testCatTime-seed#[A49B1CEEC4DB6F1A]) [     ] o.a.s.u.p.DimensionalRoutedAliasUpdateProcessorTest SolrClient: org.apache.solr.client.solrj.impl.CloudSolrClient@55eeb994
   [junit4]   2> 456083 INFO  (TEST-DimensionalRoutedAliasUpdateProcessorTest.testCatTime-seed#[A49B1CEEC4DB6F1A]) [     ] o.a.s.u.p.DimensionalRoutedAliasUpdateProcessorTest ClusterStateProvider org.apache.solr.client.solrj.impl.HttpClusterStateProvider@65d00990
   [junit4]   2> 456345 INFO  (qtp1810395074-1107) [n:127.0.0.1:37660_solr     ] o.a.s.h.a.CollectionsHandler Invoked Collection Action :clusterstatus with params action=CLUSTERSTATUS&wt=javabin&version=2 and sendToOCPQueue=true
   [junit4]   2> 456379 INFO  (qtp1810395074-1107) [n:127.0.0.1:37660_solr     ] o.a.s.s.HttpSolrCall [admin] webapp=null path=/admin/collections params={action=CLUSTERSTATUS&wt=javabin&version=2} status=0 QTime=34
   [junit4]   2> 456488 INFO  (qtp1810395074-1108) [n:127.0.0.1:37660_solr     ] o.a.s.h.a.CollectionsHandler Invoked Collection Action :clusterstatus with params action=CLUSTERSTATUS&wt=javabin&version=2 and sendToOCPQueue=true
   [junit4]   2> 456489 INFO  (qtp1810395074-1108) [n:127.0.0.1:37660_solr     ] o.a.s.s.HttpSolrCall [admin] webapp=null path=/admin/collections params={action=CLUSTERSTATUS&wt=javabin&version=2} status=0 QTime=0
   [junit4]   2> 456524 INFO  (qtp1810395074-1109) [n:127.0.0.1:37660_solr     ] o.a.s.h.a.CollectionsHandler Invoked Collection Action :clusterstatus with params action=CLUSTERSTATUS&wt=javabin&version=2 and sendToOCPQueue=true
   [junit4]   2> 456525 INFO  (qtp1810395074-1109) [n:127.0.0.1:37660_solr     ] o.a.s.s.HttpSolrCall [admin] webapp=null path=/admin/collections params={action=CLUSTERSTATUS&wt=javabin&version=2} status=0 QTime=0
   [junit4]   2> 456582 INFO  (qtp1810395074-1111) [n:127.0.0.1:37660_solr     ] o.a.s.h.a.CollectionsHandler Invoked Collection Action :clusterstatus with params action=CLUSTERSTATUS&wt=javabin&version=2 and sendToOCPQueue=true
   [junit4]   2> 456582 INFO  (qtp1810395074-1111) [n:127.0.0.1:37660_solr     ] o.a.s.s.HttpSolrCall [admin] webapp=null path=/admin/collections params={action=CLUSTERSTATUS&wt=javabin&version=2} status=0 QTime=1
   [junit4]   2> 456710 INFO  (qtp1810395074-1108) [n:127.0.0.1:37660_solr     ] o.a.s.h.a.ConfigSetsHandler Invoked ConfigSet Action :create with params baseConfigSet=_default&name=testCatTime&action=CREATE&wt=javabin&version=2 
   [junit4]   2> 456817 INFO  (OverseerThreadFactory-464-thread-1-processing-n:127.0.0.1:38610_solr) [n:127.0.0.1:38610_solr     ] o.a.s.c.OverseerConfigSetMessageHandler OverseerConfigSetMessageHandler.processMessage : create , {
   [junit4]   2>   "name":"testCatTime",
   [junit4]   2>   "baseConfigSet":"_default",
   [junit4]   2>   "immutable":"false",
   [junit4]   2>   "operation":"configsets:create"}
   [junit4]   2> 456856 INFO  (OverseerThreadFactory-464-thread-1-processing-n:127.0.0.1:38610_solr) [n:127.0.0.1:38610_solr     ] o.a.s.c.c.ZkConfigManager Copying zk node /configs/_default/protwords.txt to /configs/testCatTime/protwords.txt
   [junit4]   2> 456870 INFO  (OverseerThreadFactory-464-thread-1-processing-n:127.0.0.1:38610_solr) [n:127.0.0.1:38610_solr     ] o.a.s.c.c.ZkConfigManager Copying zk node /configs/_default/managed-schema to /configs/testCatTime/managed-schema
   [junit4]   2> 456872 INFO  (OverseerThreadFactory-464-thread-1-processing-n:127.0.0.1:38610_solr) [n:127.0.0.1:38610_solr     ] o.a.s.c.c.ZkConfigManager Copying zk node /configs/_default/solrconfig.xml to /configs/testCatTime/solrconfig.xml
   [junit4]   2> 456890 INFO  (OverseerThreadFactory-464-thread-1-processing-n:127.0.0.1:38610_solr) [n:127.0.0.1:38610_solr     ] o.a.s.c.c.ZkConfigManager Copying zk node /configs/_default/synonyms.txt to /configs/testCatTime/synonyms.txt
   [junit4]   2> 456891 INFO  (OverseerThreadFactory-464-thread-1-processing-n:127.0.0.1:38610_solr) [n:127.0.0.1:38610_solr     ] o.a.s.c.c.ZkConfigManager Copying zk node /configs/_default/stopwords.txt to /configs/testCatTime/stopwords.txt
   [junit4]   2> 456892 INFO  (OverseerThreadFactory-464-thread-1-processing-n:127.0.0.1:38610_solr) [n:127.0.0.1:38610_solr     ] o.a.s.c.c.ZkConfigManager Copying zk node /configs/_default/params.json to /configs/testCatTime/params.json
   [junit4]   2> 456906 INFO  (OverseerThreadFactory-464-thread-1-processing-n:127.0.0.1:38610_solr) [n:127.0.0.1:38610_solr     ] o.a.s.c.c.ZkConfigManager Copying zk node /configs/_default/lang/contractions_it.txt to /configs/testCatTime/lang/contractions_it.txt
   [junit4]   2> 456907 INFO  (OverseerThreadFactory-464-thread-1-processing-n:127.0.0.1:38610_solr) [n:127.0.0.1:38610_solr     ] o.a.s.c.c.ZkConfigManager Copying zk node /configs/_default/lang/stopwords_no.txt to /configs/testCatTime/lang/stopwords_no.txt
   [junit4]   2> 456908 INFO  (OverseerThreadFactory-464-thread-1-processing-n:127.0.0.1:38610_solr) [n:127.0.0.1:38610_solr     ] o.a.s.c.c.ZkConfigManager Copying zk node /configs/_default/lang/stopwords_hy.txt to /configs/testCatTime/lang/stopwords_hy.txt
   [junit4]   2> 456926 INFO  (OverseerThreadFactory-464-thread-1-processing-n:127.0.0.1:38610_solr) [n:127.0.0.1:38610_solr     ] o.a.s.c.c.ZkConfigManager Copying zk node /configs/_default/lang/stemdict_nl.txt to /configs/testCatTime/lang/stemdict_nl.txt
   [junit4]   2> 456927 INFO  (OverseerThreadFactory-464-thread-1-processing-n:127.0.0.1:38610_solr) [n:127.0.0.1:38610_solr     ] o.a.s.c.c.ZkConfigManager Copying zk node /configs/_default/lang/contractions_ca.txt to /configs/testCatTime/lang/contractions_ca.txt
   [junit4]   2> 456928 INFO  (OverseerThreadFactory-464-thread-1-processing-n:127.0.0.1:38610_solr) [n:127.0.0.1:38610_solr     ] o.a.s.c.c.ZkConfigManager Copying zk node /configs/_default/lang/stopwords_id.txt to /configs/testCatTime/lang/stopwords_id.txt
   [junit4]   2> 456944 INFO  (OverseerThreadFactory-464-thread-1-processing-n:127.0.0.1:38610_solr) [n:127.0.0.1:38610_solr     ] o.a.s.c.c.ZkConfigManager Copying zk node /configs/_default/lang/stopwords_et.txt to /configs/testCatTime/lang/stopwords_et.txt
   [junit4]   2> 456962 INFO  (OverseerThreadFactory-464-thread-1-processing-n:127.0.0.1:38610_solr) [n:127.0.0.1:38610_solr     ] o.a.s.c.c.ZkConfigManager Copying zk node /configs/_default/lang/stopwords_ga.txt to /configs/testCatTime/lang/stopwords_ga.txt
   [junit4]   2> 456964 INFO  (OverseerThreadFactory-464-thread-1-processing-n:127.0.0.1:38610_solr) [n:127.0.0.1:38610_solr     ] o.a.s.c.c.ZkConfigManager Copying zk node /configs/_default/lang/stopwords_da.txt to /configs/testCatTime/lang/stopwords_da.txt
   [junit4]   2> 456965 INFO  (OverseerThreadFactory-464-thread-1-processing-n:127.0.0.1:38610_solr) [n:127.0.0.1:38610_solr     ] o.a.s.c.c.ZkConfigManager Copying zk node /configs/_default/lang/stopwords_hi.txt to /configs/testCatTime/lang/stopwords_hi.txt
   [junit4]   2> 456979 INFO  (OverseerThreadFactory-464-thread-1-processing-n:127.0.0.1:38610_solr) [n:127.0.0.1:38610_solr     ] o.a.s.c.c.ZkConfigManager Copying zk node /configs/_default/lang/stopwords_ja.txt to /configs/testCatTime/lang/stopwords_ja.txt
   [junit4]   2> 456981 INFO  (OverseerThreadFactory-464-thread-1-processing-n:127.0.0.1:38610_solr) [n:127.0.0.1:38610_solr     ] o.a.s.c.c.ZkConfigManager Copying zk node /configs/_default/lang/stopwords_pt.txt to /configs/testCatTime/lang/stopwords_pt.txt
   [junit4]   2> 457000 INFO  (OverseerThreadFactory-464-thread-1-processing-n:127.0.0.1:38610_solr) [n:127.0.0.1:38610_solr     ] o.a.s.c.c.ZkConfigManager Copying zk node /configs/_default/lang/stopwords_hu.txt to /configs/testCatTime/lang/stopwords_hu.txt
   [junit4]   2> 457001 INFO  (OverseerThreadFactory-464-thread-1-processing-n:127.0.0.1:38610_solr) [n:127.0.0.1:38610_solr     ] o.a.s.c.c.ZkConfigManager Copying zk node /configs/_default/lang/stopwords_el.txt to /configs/testCatTime/lang/stopwords_el.txt
   [junit4]   2> 457015 INFO  (OverseerThreadFactory-464-thread-1-processing-n:127.0.0.1:38610_solr) [n:127.0.0.1:38610_solr     ] o.a.s.c.c.ZkConfigManager Copying zk node /configs/_default/lang/stopwords_ru.txt to /configs/testCatTime/lang/stopwords_ru.txt
   [junit4]   2> 457016 INFO  (OverseerThreadFactory-464-thread-1-processing-n:127.0.0.1:38610_solr) [n:127.0.0.1:38610_solr     ] o.a.s.c.c.ZkConfigManager Copying zk node /configs/_default/lang/stopwords_tr.txt to /configs/testCatTime/lang/stopwords_tr.txt
   [junit4]   2> 457018 INFO  (OverseerThreadFactory-464-thread-1-processing-n:127.0.0.1:38610_solr) [n:127.0.0.1:38610_solr     ] o.a.s.c.c.ZkConfigManager Copying zk node /configs/_default/lang/stopwords_ar.txt to /configs/testCatTime/lang/stopwords_ar.txt
   [junit4]   2> 457072 INFO  (OverseerThreadFactory-464-thread-1-processing-n:127.0.0.1:38610_solr) [n:127.0.0.1:38610_solr     ] o.a.s.c.c.ZkConfigManager Copying zk node /configs/_default/lang/userdict_ja.txt to /configs/testCatTime/lang/userdict_ja.txt
   [junit4]   2> 457073 INFO  (OverseerThreadFactory-464-thread-1-processing-n:127.0.0.1:38610_solr) [n:127.0.0.1:38610_solr     ] o.a.s.c.c.ZkConfigManager Copying zk node /configs/_default/lang/stopwords_it.txt to /configs/testCatTime/lang/stopwords_it.txt
   [junit4]   2> 457074 INFO  (OverseerThreadFactory-464-thread-1-processing-n:127.0.0.1:38610_solr) [n:127.0.0.1:38610_solr     ] o.a.s.c.c.ZkConfigManager Copying zk node /configs/_default/lang/stopwords_eu.txt to /configs/testCatTime/lang/stopwords_eu.txt
   [junit4]   2> 457088 INFO  (OverseerThreadFactory-464-thread-1-processing-n:127.0.0.1:38610_solr) [n:127.0.0.1:38610_solr     ] o.a.s.c.c.ZkConfigManager Copying zk node /configs/_default/lang/stopwords_cz.txt to /configs/testCatTime/lang/stopwords_cz.txt
   [junit4]   2> 457089 INFO  (OverseerThreadFactory-464-thread-1-processing-n:127.0.0.1:38610_solr) [n:127.0.0.1:38610_solr     ] o.a.s.c.c.ZkConfigManager Copying zk node /configs/_default/lang/stoptags_ja.txt to /configs/testCatTime/lang/stoptags_ja.txt
   [junit4]   2> 457090 INFO  (OverseerThreadFactory-464-thread-1-processing-n:127.0.0.1:38610_solr) [n:127.0.0.1:38610_solr     ] o.a.s.c.c.ZkConfigManager Copying zk node /configs/_default/lang/contractions_fr.txt to /configs/testCatTime/lang/contractions_fr.txt
   [junit4]   2> 457108 INFO  (OverseerThreadFactory-464-thread-1-processing-n:127.0.0.1:38610_solr) [n:127.0.0.1:38610_solr     ] o.a.s.c.c.ZkConfigManager Copying zk node /configs/_default/lang/stopwords_fa.txt to /configs/testCatTime/lang/stopwords_fa.txt
   [junit4]   2> 457109 INFO  (OverseerThreadFactory-464-thread-1-processing-n:127.0.0.1:38610_solr) [n:127.0.0.1:38610_solr     ] o.a.s.c.c.ZkConfigManager Copying zk node /configs/_default/lang/stopwords_de.txt to /configs/testCatTime/lang/stopwords_de.txt
   [junit4]   2> 457111 INFO  (OverseerThreadFactory-464-thread-1-processing-n:127.0.0.1:38610_solr) [n:127.0.0.1:38610_solr     ] o.a.s.c.c.ZkConfigManager Copying zk node /configs/_default/lang/contractions_ga.txt to /configs/testCatTime/lang/contractions_ga.txt
   [junit4]   2> 457124 INFO  (OverseerThreadFactory-464-thread-1-processing-n:127.0.0.1:38610_solr) [n:127.0.0.1:38610_solr     ] o.a.s.c.c.ZkConfigManager Copying zk node /configs/_default/lang/stopwords_ca.txt to /configs/testCatTime/lang/stopwords_ca.txt
   [junit4]   2> 457125 INFO  (OverseerThreadFactory-464-thread-1-processing-n:127.0.0.1:38610_solr) [n:127.0.0.1:38610_solr     ] o.a.s.c.c.ZkConfigManager Copying zk node /configs/_default/lang/stopwords_nl.txt to /configs/testCatTime/lang/stopwords_nl.txt
   [junit4]   2> 457126 INFO  (OverseerThreadFactory-464-thread-1-processing-n:127.0.0.1:38610_solr) [n:127.0.0.1:38610_solr     ] o.a.s.c.c.ZkConfigManager Copying zk node /configs/_default/lang/stopwords_bg.txt to /configs/testCatTime/lang/stopwords_bg.txt
   [junit4]   2> 457127 INFO  (OverseerThreadFactory-464-thread-1-processing-n:127.0.0.1:38610_solr) [n:127.0.0.1:38610_solr     ] o.a.s.c.c.ZkConfigManager Copying zk node /configs/_default/lang/stopwords_es.txt to /configs/testCatTime/lang/stopwords_es.txt
   [junit4]   2> 457146 INFO  (OverseerThreadFactory-464-thread-1-processing-n:127.0.0.1:38610_solr) [n:127.0.0.1:38610_solr     ] o.a.s.c.c.ZkConfigManager Copying zk node /configs/_default/lang/stopwords_en.txt to /configs/testCatTime/lang/stopwords_en.txt
   [junit4]   2> 457147 INFO  (OverseerThreadFactory-464-thread-1-processing-n:127.0.0.1:38610_solr) [n:127.0.0.1:38610_solr     ] o.a.s.c.c.ZkConfigManager Copying zk node /configs/_default/lang/stopwords_lv.txt to /configs/testCatTime/lang/stopwords_lv.txt
   [junit4]   2> 457160 INFO  (OverseerThreadFactory-464-thread-1-processing-n:127.0.0.1:38610_solr) [n:127.0.0.1:38610_solr     ] o.a.s.c.c.ZkConfigManager Copying zk node /configs/_default/lang/stopwords_th.txt to /configs/testCatTime/lang/stopwords_th.txt
   [junit4]   2> 457162 INFO  (OverseerThreadFactory-464-thread-1-processing-n:127.0.0.1:38610_solr) [n:127.0.0.1:38610_solr     ] o.a.s.c.c.ZkConfigManager Copying zk node /configs/_default/lang/stopwords_ro.txt to /configs/testCatTime/lang/stopwords_ro.txt
   [junit4]   2> 457163 INFO  (OverseerThreadFactory-464-thread-1-processing-n:127.0.0.1:38610_solr) [n:127.0.0.1:38610_solr     ] o.a.s.c.c.ZkConfigManager Copying zk node /configs/_default/lang/stopwords_fr.txt to /configs/testCatTime/lang/stopwords_fr.txt
   [junit4]   2> 457164 INFO  (OverseerThreadFactory-464-thread-1-processing-n:127.0.0.1:38610_solr) [n:127.0.0.1:38610_solr     ] o.a.s.c.c.ZkConfigManager Copying zk node /configs/_default/lang/stopwords_sv.txt to /configs/testCatTime/lang/stopwords_sv.txt
   [junit4]   2> 457181 INFO  (OverseerThreadFactory-464-thread-1-processing-n:127.0.0.1:38610_solr) [n:127.0.0.1:38610_solr     ] o.a.s.c.c.ZkConfigManager Copying zk node /configs/_default/lang/stopwords_fi.txt to /configs/testCatTime/lang/stopwords_fi.txt
   [junit4]   2> 457183 INFO  (OverseerThreadFactory-464-thread-1-processing-n:127.0.0.1:38610_solr) [n:127.0.0.1:38610_solr     ] o.a.s.c.c.ZkConfigManager Copying zk node /configs/_default/lang/hyphenations_ga.txt to /configs/testCatTime/lang/hyphenations_ga.txt
   [junit4]   2> 457233 INFO  (OverseerThreadFactory-464-thread-1-processing-n:127.0.0.1:38610_solr) [n:127.0.0.1:38610_solr     ] o.a.s.c.c.ZkConfigManager Copying zk node /configs/_default/lang/stopwords_gl.txt to /configs/testCatTime/lang/stopwords_gl.txt
   [junit4]   2> 457380 INFO  (qtp1810395074-1108) [n:127.0.0.1:37660_solr     ] o.a.s.s.HttpSolrCall [admin] webapp=null path=/admin/configs params={baseConfigSet=_default&name=testCatTime&action=CREATE&wt=javabin&version=2} status=0 QTime=669
   [junit4]   2> 457400 INFO  (qtp1810395074-1109) [n:127.0.0.1:37660_solr     ] o.a.s.h.a.CollectionsHandler Invoked Collection Action :clusterstatus with params action=CLUSTERSTATUS&wt=javabin&version=2 and sendToOCPQueue=true
   [junit4]   2> 457402 INFO  (qtp1810395074-1109) [n:127.0.0.1:37660_solr     ] o.a.s.s.HttpSolrCall [admin] webapp=null path=/admin/collections params={action=CLUSTERSTATUS&wt=javabin&version=2} status=0 QTime=2
   [junit4]   2> 457403 INFO  (qtp1810395074-1106) [n:127.0.0.1:37660_solr     ] o.a.s.h.a.CollectionsHandler Invoked Collection Action :clusterstatus with params action=CLUSTERSTATUS&wt=javabin&version=2 and sendToOCPQueue=true
   [junit4]   2> 457416 INFO  (qtp1810395074-1106) [n:127.0.0.1:37660_solr     ] o.a.s.s.HttpSolrCall [admin] webapp=null path=/admin/collections params={action=CLUSTERSTATUS&wt=javabin&version=2} status=0 QTime=13
   [junit4]   2> 457417 INFO  (qtp1810395074-1106) [n:127.0.0.1:37660_solr     ] o.a.s.h.a.CollectionsHandler Invoked Collection Action :clusterstatus with params action=CLUSTERSTATUS&wt=javabin&version=2 and sendToOCPQueue=true
   [junit4]   2> 457418 INFO  (qtp1810395074-1106) [n:127.0.0.1:37660_solr     ] o.a.s.s.HttpSolrCall [admin] webapp=null path=/admin/collections params={action=CLUSTERSTATUS&wt=javabin&version=2} status=0 QTime=0
   [junit4]   2> 457419 INFO  (qtp1810395074-1106) [n:127.0.0.1:37660_solr     ] o.a.s.h.a.CollectionsHandler Invoked Collection Action :clusterstatus with params action=CLUSTERSTATUS&wt=javabin&version=2 and sendToOCPQueue=true
   [junit4]   2> 457419 INFO  (qtp1810395074-1106) [n:127.0.0.1:37660_solr     ] o.a.s.s.HttpSolrCall [admin] webapp=null path=/admin/collections params={action=CLUSTERSTATUS&wt=javabin&version=2} status=0 QTime=0
   [junit4]   2> 457511 INFO  (qtp1810395074-1107) [n:127.0.0.1:37660_solr     ] o.a.s.h.a.CollectionsHandler Invoked Collection Action :create with params collection.configName=testCatTime&name=testCatTime&nrtReplicas=1&action=CREATE&numShards=1&wt=javabin&version=2 and sendToOCPQueue=true
   [junit4]   2> 457546 INFO  (OverseerThreadFactory-464-thread-2-processing-n:127.0.0.1:38610_solr) [n:127.0.0.1:38610_solr     ] o.a.s.c.a.c.CreateCollectionCmd Create collection testCatTime
   [junit4]   2> 457546 INFO  (OverseerCollectionConfigSetProcessor-75216929238941710-127.0.0.1:38610_solr-n_0000000000) [n:127.0.0.1:38610_solr     ] o.a.s.c.OverseerTaskQueue Response ZK path: /overseer/collection-queue-work/qnr-0000000000 doesn't exist.  Requestor may have disconnected from ZooKeeper
   [junit4]   2> 457746 INFO  (OverseerStateUpdate-75216929238941710-127.0.0.1:38610_solr-n_0000000000) [n:127.0.0.1:38610_solr     ] o.a.s.c.o.SliceMutator createReplica() {
   [junit4]   2>   "operation":"ADDREPLICA",
   [junit4]   2>   "collection":"testCatTime",
   [junit4]   2>   "shard":"shard1",
   [junit4]   2>   "core":"testCatTime_shard1_replica_n1",
   [junit4]   2>   "state":"down",
   [junit4]   2>   "base_url":"https://127.0.0.1:37660/solr",
   [junit4]   2>   "type":"NRT",
   [junit4]   2>   "waitForFinalState":"false"} 
   [junit4]   2> 458213 INFO  (qtp1810395074-1109) [n:127.0.0.1:37660_solr    x:testCatTime_shard1_replica_n1 ] o.a.s.h.a.CoreAdminOperation core create command qt=/admin/cores&coreNodeName=core_node2&collection.configName=testCatTime&newCollection=true&name=testCatTime_shard1_replica_n1&action=CREATE&numShards=1&collection=testCatTime&shard=shard1&wt=javabin&version=2&replicaType=NRT
   [junit4]   2> 459687 INFO  (qtp1810395074-1109) [n:127.0.0.1:37660_solr c:testCatTime s:shard1 r:core_node2 x:testCatTime_shard1_replica_n1 ] o.a.s.c.RequestParams conf resource params.json loaded . version : 0 
   [junit4]   2> 459688 INFO  (qtp1810395074-1109) [n:127.0.0.1:37660_solr c:testCatTime s:shard1 r:core_node2 x:testCatTime_shard1_replica_n1 ] o.a.s.c.RequestParams request params refreshed to version 0
   [junit4]   2> 459702 WARN  (qtp1810395074-1109) [n:127.0.0.1:37660_solr c:testCatTime s:shard1 r:core_node2 x:testCatTime_shard1_replica_n1 ] o.a.s.c.SolrConfig Couldn't add files from /home/jenkins/jenkins-slave/workspace/Lucene-Solr-Tests-8.x/solr/build/solr-core/test/J2/temp/solr.update.processor.DimensionalRoutedAliasUpdateProcessorTest_A49B1CEEC4DB6F1A-001/tempDir-001/node4/testCatTime_shard1_replica_n1/../../../../contrib/extraction/lib filtered by .*\.jar to classpath: /home/jenkins/jenkins-slave/workspace/Lucene-Solr-Tests-8.x/solr/build/solr-core/test/J2/temp/solr.update.processor.DimensionalRoutedAliasUpdateProcessorTest_A49B1CEEC4DB6F1A-001/tempDir-001/node4/testCatTime_shard1_replica_n1/../../../../contrib/extraction/lib
   [junit4]   2> 459721 WARN  (qtp1810395074-1109) [n:127.0.0.1:37660_solr c:testCatTime s:shard1 r:core_node2 x:testCatTime_shard1_replica_n1 ] o.a.s.c.SolrConfig Couldn't add files from /home/jenkins/jenkins-slave/workspace/Lucene-Solr-Tests-8.x/solr/build/solr-core/test/J2/temp/solr.update.processor.DimensionalRoutedAliasUpdateProcessorTest_A49B1CEEC4DB6F1A-001/tempDir-001/node4/testCatTime_shard1_replica_n1/../../../../dist filtered by solr-cell-\d.*\.jar to classpath: /home/jenkins/jenkins-slave/workspace/Lucene-Solr-Tests-8.x/solr/build/solr-core/test/J2/temp/solr.update.processor.DimensionalRoutedAliasUpdateProcessorTest_A49B1CEEC4DB6F1A-001/tempDir-001/node4/testCatTime_shard1_replica_n1/../../../../dist
   [junit4]   2> 459721 WARN  (qtp1810395074-1109) [n:127.0.0.1:37660_solr c:testCatTime s:shard1 r:core_node2 x:testCatTime_shard1_replica_n1 ] o.a.s.c.SolrConfig Couldn't add files from /home/jenkins/jenkins-slave/workspace/Lucene-Solr-Tests-8.x/solr/build/solr-core/test/J2/temp/solr.update.processor.DimensionalRoutedAliasUpdateProcessorTest_A49B1CEEC4DB6F1A-001/tempDir-001/node4/testCatTime_shard1_replica_n1/../../../../contrib/clustering/lib filtered by .*\.jar to classpath: /home/jenkins/jenkins-slave/workspace/Lucene-Solr-Tests-8.x/solr/build/solr-core/test/J2/temp/solr.update.processor.DimensionalRoutedAliasUpdateProcessorTest_A49B1CEEC4DB6F1A-001/tempDir-001/node4/testCatTime_shard1_replica_n1/../../../../contrib/clustering/lib
   [junit4]   2> 459721 WARN  (qtp1810395074-1109) [n:127.0.0.1:37660_solr c:testCatTime s:shard1 r:core_node2 x:testCatTime_shard1_replica_n1 ] o.a.s.c.SolrConfig Couldn't add files from /home/jenkins/jenkins-slave/workspace/Lucene-Solr-Tests-8.x/solr/build/solr-core/test/J2/temp/solr.update.processor.DimensionalRoutedAliasUpdateProcessorTest_A49B1CEEC4DB6F1A-001/tempDir-001/node4/testCatTime_shard1_replica_n1/../../../../dist filtered by solr-clustering-\d.*\.jar to classpath: /home/jenkins/jenkins-slave/workspace/Lucene-Solr-Tests-8.x/solr/build/solr-core/test/J2/temp/solr.update.processor.DimensionalRoutedAliasUpdateProcessorTest_A49B1CEEC4DB6F1A-001/tempDir-001/node4/testCatTime_shard1_replica_n1/../../../../dist
   [junit4]   2> 459722 WARN  (qtp1810395074-1109) [n:127.0.0.1:37660_solr c:testCatTime s:shard1 r:core_node2 x:testCatTime_shard1_replica_n1 ] o.a.s.c.SolrConfig Couldn't add files from /home/jenkins/jenkins-slave/workspace/Lucene-Solr-Tests-8.x/solr/build/solr-core/test/J2/temp/solr.update.processor.DimensionalRoutedAliasUpdateProcessorTest_A49B1CEEC4DB6F1A-001/tempDir-001/node4/testCatTime_shard1_replica_n1/../../../../contrib/langid/lib filtered by .*\.jar to classpath: /home/jenkins/jenkins-slave/workspace/Lucene-Solr-Tests-8.x/solr/build/solr-core/test/J2/temp/solr.update.processor.DimensionalRoutedAliasUpdateProcessorTest_A49B1CEEC4DB6F1A-001/tempDir-001/node4/testCatTime_shard1_replica_n1/../../../../contrib/langid/lib
   [junit4]   2> 459722 WARN  (qtp1810395074-1109) [n:127.0.0.1:37660_solr c:testCatTime s:shard1 r:core_node2 x:testCatTime_shard1_replica_n1 ] o.a.s.c.SolrConfig Couldn't add files from /home/jenkins/jenkins-slave/workspace/Lucene-Solr-Tests-8.x/solr/build/solr-core/test/J2/temp/solr.update.processor.DimensionalRoutedAliasUpdateProcessorTest_A49B1CEEC4DB6F1A-001/tempDir-001/node4/testCatTime_shard1_replica_n1/../../../../dist filtered by solr-langid-\d.*\.jar to classpath: /home/jenkins/jenkins-slave/workspace/Lucene-Solr-Tests-8.x/solr/build/solr-core/test/J2/temp/solr.update.processor.DimensionalRoutedAliasUpdateProcessorTest_A49B1CEEC4DB6F1A-001/tempDir-001/node4/testCatTime_shard1_replica_n1/../../../../dist
   [junit4]   2> 459722 WARN  (qtp1810395074-1109) [n:127.0.0.1:37660_solr c:testCatTime s:shard1 r:core_node2 x:testCatTime_shard1_replica_n1 ] o.a.s.c.SolrConfig Couldn't add files from /home/jenkins/jenkins-slave/workspace/Lucene-Solr-Tests-8.x/solr/build/solr-core/test/J2/temp/solr.update.processor.DimensionalRoutedAliasUpdateProcessorTest_A49B1CEEC4DB6F1A-001/tempDir-001/node4/testCatTime_shard1_replica_n1/../../../../contrib/velocity/lib filtered by .*\.jar to classpath: /home/jenkins/jenkins-slave/workspace/Lucene-Solr-Tests-8.x/solr/build/solr-core/test/J2/temp/solr.update.processor.DimensionalRoutedAliasUpdateProcessorTest_A49B1CEEC4DB6F1A-001/tempDir-001/node4/testCatTime_shard1_replica_n1/../../../../contrib/velocity/lib
   [junit4]   2> 459722 WARN  (qtp1810395074-1109) [n:127.0.0.1:37660_solr c:testCatTime s:shard1 r:core_node2 x:testCatTime_shard1_replica_n1 ] o.a.s.c.SolrConfig Couldn't add files from /home/jenkins/jenkins-slave/workspace/Lucene-Solr-Tests-8.x/solr/build/solr-core/test/J2/temp/solr.update.processor.DimensionalRoutedAliasUpdateProcessorTest_A49B1CEEC4DB6F1A-001/tempDir-001/node4/testCatTime_shard1_replica_n1/../../../../dist filtered by solr-velocity-\d.*\.jar to classpath: /home/jenkins/jenkins-slave/workspace/Lucene-Solr-Tests-8.x/solr/build/solr-core/test/J2/temp/solr.update.processor.DimensionalRoutedAliasUpdateProcessorTest_A49B1CEEC4DB6F1A-001/tempDir-001/node4/testCatTime_shard1_replica_n1/../../../../dist
   [junit4]   2> 459722 WARN  (qtp1810395074-1109) [n:127.0.0.1:37660_solr c:testCatTime s:shard1 r:core_node2 x:testCatTime_shard1_replica_n1 ] o.a.s.c.SolrConfig Couldn't add files from /home/jenkins/jenkins-slave/workspace/Lucene-Solr-Tests-8.x/solr/build/solr-core/test/J2/temp/solr.update.processor.DimensionalRoutedAliasUpdateProcessorTest_A49B1CEEC4DB6F1A-001/tempDir-001/node4/testCatTime_shard1_replica_n1/../../../../dist filtered by solr-ltr-\d.*\.jar to classpath: /home/jenkins/jenkins-slave/workspace/Lucene-Solr-Tests-8.x/solr/build/solr-core/test/J2/temp/solr.update.processor.DimensionalRoutedAliasUpdateProcessorTest_A49B1CEEC4DB6F1A-001/tempDir-001/node4/testCatTime_shard1_replica_n1/../../../../dist
   [junit4]   2> 459723 INFO  (qtp1810395074-1109) [n:127.0.0.1:37660_solr c:testCatTime s:shard1 r:core_node2 x:testCatTime_shard1_replica_n1 ] o.a.s.c.SolrConfig Using Lucene MatchVersion: 8.3.0
   [junit4]   2> 460073 INFO  (qtp1810395074-1109) [n:127.0.0.1:37660_solr c:testCatTime s:shard1 r:core_node2 x:testCatTime_shard1_replica_n1 ] o.a.s.s.IndexSchema [testCatTime_shard1_replica_n1] Schema name=default-config
   [junit4]   2> 461488 INFO  (qtp1810395074-1109) [n:127.0.0.1:37660_solr c:testCatTime s:shard1 r:core_node2 x:testCatTime_shard1_replica_n1 ] o.a.s.s.IndexSchema Loaded schema default-config/1.6 with uniqueid field id
   [junit4]   2> 461886 INFO  (qtp1810395074-1109) [n:127.0.0.1:37660_solr c:testCatTime s:shard1 r:core_node2 x:testCatTime_shard1_replica_n1 ] o.a.s.c.CoreContainer Creating SolrCore 'testCatTime_shard1_replica_n1' using configuration from collection testCatTime, trusted=true
   [junit4]   2> 461887 INFO  (qtp1810395074-1109) [n:127.0.0.1:37660_solr c:testCatTime s:shard1 r:core_node2 x:testCatTime_shard1_replica_n1 ] o.a.s.m.r.SolrJmxReporter JMX monitoring for 'solr_37660.solr.core.testCatTime.shard1.replica_n1' (registry 'solr.core.testCatTime.shard1.replica_n1') enabled at server: com.sun.jmx.mbeanserver.JmxMBeanServer@4e071109
   [junit4]   2> 461887 INFO  (qtp1810395074-1109) [n:127.0.0.1:37660_solr c:testCatTime s:shard1 r:core_node2 x:testCatTime_shard1_replica_n1 ] o.a.s.c.SolrCore [[testCatTime_shard1_replica_n1] ] Opening new SolrCore at [/home/jenkins/jenkins-slave/workspace/Lucene-Solr-Tests-8.x/solr/build/solr-core/test/J2/temp/solr.update.processor.DimensionalRoutedAliasUpdateProcessorTest_A49B1CEEC4DB6F1A-001/tempDir-001/node4/testCatTime_shard1_replica_n1], dataDir=[/home/jenkins/jenkins-slave/workspace/Lucene-Solr-Tests-8.x/solr/build/solr-core/test/J2/temp/solr.update.processor.DimensionalRoutedAliasUpdateProcessorTest_A49B1CEEC4DB6F1A-001/tempDir-001/node4/./testCatTime_shard1_replica_n1/data/]
   [junit4]   2> 462069 INFO  (qtp1810395074-1109) [n:127.0.0.1:37660_solr c:testCatTime s:shard1 r:core_node2 x:testCatTime_shard1_replica_n1 ] o.a.s.r.XSLTResponseWriter xsltCacheLifetimeSeconds=5
   [junit4]   2> 463699 INFO  (qtp1810395074-1109) [n:127.0.0.1:37660_solr c:testCatTime s:shard1 r:core_node2 x:testCatTime_shard1_replica_n1 ] o.a.s.u.UpdateHandler Using UpdateLog implementation: org.apache.solr.update.UpdateLog
   [junit4]   2> 463699 INFO  (qtp1810395074-1109) [n:127.0.0.1:37660_solr c:testCatTime s:shard1 r:core_node2 x:testCatTime_shard1_replica_n1 ] o.a.s.u.UpdateLog Initializing UpdateLog: dataDir= defaultSyncLevel=FLUSH numRecordsToKeep=100 maxNumLogsToKeep=10 numVersionBuckets=65536
   [junit4]   2> 463717 INFO  (qtp1810395074-1109) [n:127.0.0.1:37660_solr c:testCatTime s:shard1 r:core_node2 x:testCatTime_shard1_replica_n1 ] o.a.s.u.CommitTracker Hard AutoCommit: if uncommitted for 15000ms; 
   [junit4]   2> 463717 INFO  (qtp1810395074-1109) [n:127.0.0.1:37660_solr c:testCatTime s:shard1 r:core_node2 x:testCatTime_shard1_replica_n1 ] o.a.s.u.CommitTracker Soft AutoCommit: disabled
   [junit4]   2> 463719 INFO  (qtp1810395074-1109) [n:127.0.0.1:37660_solr c:testCatTime s:shard1 r:core_node2 x:testCatTime_shard1_replica_n1 ] o.a.s.s.SolrIndexSearcher Opening [Searcher@573be818[testCatTime_shard1_replica_n1] main]
   [junit4]   2> 463805 INFO  (qtp1810395074-1109) [n:127.0.0.1:37660_solr c:testCatTime s:shard1 r:core_node2 x:testCatTime_shard1_replica_n1 ] o.a.s.r.ManagedResourceStorage Configured ZooKeeperStorageIO with znodeBase: /configs/testCatTime
   [junit4]   2> 463805 INFO  (qtp1810395074-1109) [n:127.0.0.1:37660_solr c:testCatTime s:shard1 r:core_node2 x:testCatTime_shard1_replica_n1 ] o.a.s.r.ManagedResourceStorage Loaded null at path _rest_managed.json using ZooKeeperStorageIO:path=/configs/testCatTime
   [junit4]   2> 463808 INFO  (qtp1810395074-1109) [n:127.0.0.1:37660_solr c:testCatTime s:shard1 r:core_node2 x:testCatTime_shard1_replica_n1 ] o.a.s.s.ZkIndexSchemaReader Creating ZooKeeper watch for the managed schema at /configs/testCatTime/managed-schema
   [junit4]   2> 463842 INFO  (qtp1810395074-1109) [n:127.0.0.1:37660_solr c:testCatTime s:shard1 r:core_node2 x:testCatTime_shard1_replica_n1 ] o.a.s.s.ZkIndexSchemaReader Current schema version 0 is already the latest
   [junit4]   2> 463843 INFO  (qtp1810395074-1109) [n:127.0.0.1:37660_solr c:testCatTime s:shard1 r:core_node2 x:testCatTime_shard1_replica_n1 ] o.a.s.h.c.SpellCheckComponent Initializing spell checkers
   [junit4]   2> 463890 INFO  (qtp1810395074-1109) [n:127.0.0.1:37660_solr c:testCatTime s:shard1 r:core_node2 x:testCatTime_shard1_replica_n1 ] o.a.s.s.DirectSolrSpellChecker init: {name=default,field=_text_,classname=solr.DirectSolrSpellChecker,distanceMeasure=internal,accuracy=0.5,maxEdits=2,minPrefix=1,maxInspections=5,minQueryLength=4,maxQueryFrequency=0.01}
   [junit4]   2> 463932 INFO  (qtp1810395074-1109) [n:127.0.0.1:37660_solr c:testCatTime s:shard1 r:core_node2 x:testCatTime_shard1_replica_n1 ] o.a.s.h.ReplicationHandler Commits will be reserved for 10000ms.
   [junit4]   2> 463951 INFO  (qtp1810395074-1109) [n:127.0.0.1:37660_solr c:testCatTime s:shard1 r:core_node2 x:testCatTime_shard1_replica_n1 ] o.a.s.u.UpdateLog Could not find max version in index or recent updates, using new clock 1641933958331498496
   [junit4]   2> 463954 INFO  (searcherExecutor-481-thread-1-processing-n:127.0.0.1:37660_solr x:testCatTime_shard1_replica_n1 c:testCatTime s:shard1 r:core_node2) [n:127.0.0.1:37660_solr c:testCatTime s:shard1 r:core_node2 x:testCatTime_shard1_replica_n1 ] o.a.s.c.QuerySenderListener QuerySenderListener sending requests to Searcher@573be818[testCatTime_shard1_replica_n1] main{ExitableDirectoryReader(UninvertingDirectoryReader())}
   [junit4]   2> 463954 INFO  (searcherExecutor-481-thread-1-processing-n:127.0.0.1:37660_solr x:testCatTime_shard1_replica_n1 c:testCatTime s:shard1 r:core_node2) [n:127.0.0.1:37660_solr c:testCatTime s:shard1 r:core_node2 x:testCatTime_shard1_replica_n1 ] o.a.s.c.QuerySenderListener QuerySenderListener done.
   [junit4]   2> 463954 INFO  (searcherExecutor-481-thread-1-processing-n:127.0.0.1:37660_solr x:testCatTime_shard1_replica_n1 c:testCatTime s:shard1 r:core_node2) [n:127.0.0.1:37660_solr c:testCatTime s:shard1 r:core_node2 x:testCatTime_shard1_replica_n1 ] o.a.s.h.c.SpellCheckComponent Loading spell index for spellchecker: default
   [junit4]   2> 464001 INFO  (searcherExecutor-481-thread-1-processing-n:127.0.0.1:37660_solr x:testCatTime_shard1_replica_n1 c:testCatTime s:shard1 r:core_node2) [n:127.0.0.1:37660_solr c:testCatTime s:shard1 r:core_node2 x:testCatTime_shard1_replica_n1 ] o.a.s.c.SolrCore [testCatTime_shard1_replica_n1] Registered new searcher Searcher@573be818[testCatTime_shard1_replica_n1] main{ExitableDirectoryReader(UninvertingDirectoryReader())}
   [junit4]   2> 464028 INFO  (qtp1810395074-1109) [n:127.0.0.1:37660_solr c:testCatTime s:shard1 r:core_node2 x:testCatTime_shard1_replica_n1 ] o.a.s.c.ZkShardTerms Successful update of terms at /collections/testCatTime/terms/shard1 to Terms{values={core_node2=0}, version=0}
   [junit4]   2> 464028 INFO  (qtp1810395074-1109) [n:127.0.0.1:37660_solr c:testCatTime s:shard1 r:core_node2 x:testCatTime_shard1_replica_n1 ] o.a.s.c.ShardLeaderElectionContextBase make sure parent is created /collections/testCatTime/leaders/shard1
   [junit4]   2> 464040 INFO  (qtp1810395074-1109) [n:127.0.0.1:37660_solr c:testCatTime s:shard1 r:core_node2 x:testCatTime_shard1_replica_n1 ] o.a.s.c.ShardLeaderElectionContext Enough replicas found to continue.
   [junit4]   2> 464040 INFO  (qtp1810395074-1109) [n:127.0.0.1:37660_solr c:testCatTime s:shard1 r:core_node2 x:testCatTime_shard1_replica_n1 ] o.a.s.c.ShardLeaderElectionContext I may be the new leader - try and sync
   [junit4]   2> 464040 INFO  (qtp1810395074-1109) [n:127.0.0.1:37660_solr c:testCatTime s:shard1 r:core_node2 x:testCatTime_shard1_replica_n1 ] o.a.s.c.SyncStrategy Sync replicas to https://127.0.0.1:37660/solr/testCatTime_shard1_replica_n1/
   [junit4]   2> 464040 INFO  (qtp1810395074-1109) [n:127.0.0.1:37660_solr c:testCatTime s:shard1 r:core_node2 x:testCatTime_shard1_replica_n1 ] o.a.s.c.SyncStrategy Sync Success - now sync replicas to me
   [junit4]   2> 464041 INFO  (qtp1810395074-1109) [n:127.0.0.1:37660_solr c:testCatTime s:shard1 r:core_node2 x:testCatTime_shard1_replica_n1 ] o.a.s.c.SyncStrategy https://127.0.0.1:37660/solr/testCatTime_shard1_replica_n1/ has no replicas
   [junit4]   2> 464041 INFO  (qtp1810395074-1109) [n:127.0.0.1:37660_solr c:testCatTime s:shard1 r:core_node2 x:testCatTime_shard1_replica_n1 ] o.a.s.c.ShardLeaderElectionContextBase Creating leader registration node /collections/testCatTime/leaders/shard1/leader after winning as /collections/testCatTime/leader_elect/shard1/election/75216929238941706-core_node2-n_0000000000
   [junit4]   2> 464043 INFO  (qtp1810395074-1109) [n:127.0.0.1:37660_solr c:testCatTime s:shard1 r:core_node2 x:testCatTime_shard1_replica_n1 ] o.a.s.c.ShardLeaderElectionContext I am the new leader: https://127.0.0.1:37660/solr/testCatTime_shard1_replica_n1/ shard1
   [junit4]   2> 464052 INFO  (zkCallback-323-thread-1) [     ] o.a.s.c.c.ZkStateReader A cluster state change: [WatchedEvent state:SyncConnected type:NodeDataChanged path:/collections/testCatTime/state.json] for collection [testCatTime] has occurred - updating... (live nodes size: [4])
   [junit4]   2> 464053 INFO  (zkCallback-323-thread-2) [     ] o.a.s.c.c.ZkStateReader A cluster state change: [WatchedEvent state:SyncConnected type:NodeDataChanged path:/collections/testCatTime/state.json] for collection [testCatTime] has occurred - updating... (live nodes size: [4])
   [junit4]   2> 464054 INFO  (qtp1810395074-1109) [n:127.0.0.1:37660_solr c:testCatTime s:shard1 r:core_node2 x:testCatTime_shard1_replica_n1 ] o.a.s.c.ZkController I am the leader, no recovery necessary
   [junit4]   2> 464070 INFO  (qtp1810395074-1109) [n:127.0.0.1:37660_solr c:testCatTime s:shard1 r:core_node2 x:testCatTime_shard1_replica_n1 ] o.a.s.s.HttpSolrCall [admin] webapp=null path=/admin/cores params={qt=/admin/cores&coreNodeName=core_node2&collection.configName=testCatTime&newCollection=true&name=testCatTime_shard1_replica_n1&action=CREATE&numShards=1&collection=testCatTime&shard=shard1&wt=javabin&version=2&replicaType=NRT} status=0 QTime=5857
   [junit4]   2> 464086 INFO  (qtp1810395074-1107) [n:127.0.0.1:37660_solr     ] o.a.s.h.a.CollectionsHandler Wait for new collection to be active for at most 45 seconds. Check all shard replicas
   [junit4]   2> 464156 INFO  (zkCallback-323-thread-2) [     ] o.a.s.c.c.ZkStateReader A cluster state change: [WatchedEvent state:SyncConnected type:NodeDataChanged path:/collections/testCatTime/state.json] for collection [testCatTime] has occurred - updating... (live nodes size: [4])
   [junit4]   2> 464156 INFO  (zkCallback-323-thread-1) [     ] o.a.s.c.c.ZkStateReader A cluster state change: [WatchedEvent state:SyncConnected type:NodeDataChanged path:/collections/testCatTime/state.json] for collection [testCatTime] has occurred - updating... (live nodes size: [4])
   [junit4]   2> 464157 INFO  (zkCallback-323-thread-3) [     ] o.a.s.c.c.ZkStateReader A cluster state change: [WatchedEvent state:SyncConnected type:NodeDataChanged path:/collections/testCatTime/state.json] for collection [testCatTime] has occurred - updating... (live nodes size: [4])
   [junit4]   2> 464173 INFO  (qtp1810395074-1107) [n:127.0.0.1:37660_solr     ] o.a.s.s.HttpSolrCall [admin] webapp=null path=/admin/collections params={collection.configName=testCatTime&name=testCatTime&nrtReplicas=1&action=CREATE&numShards=1&wt=javabin&version=2} status=0 QTime=6662
   [junit4]   2> 464694 INFO  (qtp1810395074-1106) [n:127.0.0.1:37660_solr     ] o.a.s.h.a.CollectionsHandler Invoked Collection Action :clusterstatus with params action=CLUSTERSTATUS&wt=javabin&version=2 and sendToOCPQueue=true
   [junit4]   2> 464698 INFO  (qtp1810395074-1106) [n:127.0.0.1:37660_solr     ] o.a.s.s.HttpSolrCall [admin] webapp=null path=/admin/collections params={action=CLUSTERSTATUS&wt=javabin&version=2} status=0 QTime=4
   [junit4]   2> 464699 INFO  (qtp1810395074-1111) [n:127.0.0.1:37660_solr     ] o.a.s.h.a.CollectionsHandler Invoked Collection Action :clusterstatus with params action=CLUSTERSTATUS&wt=javabin&version=2 and sendToOCPQueue=true
   [junit4]   2> 464714 INFO  (qtp1810395074-1111) [n:127.0.0.1:37660_solr     ] o.a.s.s.HttpSolrCall [admin] webapp=null path=/admin/collections params={action=CLUSTERSTATUS&wt=javabin&version=2} status=0 QTime=14
   [junit4]   2> 464852 INFO  (qtp1810395074-1108) [n:127.0.0.1:37660_solr c:testCatTime s:shard1 r:core_node2 x:testCatTime_shard1_replica_n1 ] o.a.s.h.SolrConfigHandler Executed config commands successfully and persisted to ZK [{"set-user-property":{"update.autoCreateFields":false}}, {"add-updateprocessor":{
   [junit4]   2>     "name":"tolerant",
   [junit4]   2>     "class":"solr.TolerantUpdateProcessorFactory"}}, {"add-updateprocessor":{
   [junit4]   2>     "name":"tracking-testSliceRouting",
   [junit4]   2>     "class":"solr.TrackingUpdateProcessorFactory",
   [junit4]   2>     "group":"testCatTime"}}, {"add-updateprocessor":{
   [junit4]   2>     "name":"inc",
   [junit4]   2>     "class":"org.apache.solr.update.processor.RoutedAliasUpdateProcessorTest$IncrementURPFactory",
   [junit4]   2>     "fieldName":"integer_i"}}]
   [junit4]   2> 464862 INFO  (qtp1810395074-1108) [n:127.0.0.1:37660_solr c:testCatTime s:shard1 r:core_node2 x:testCatTime_shard1_replica_n1 ] o.a.s.h.SolrConfigHandler Waiting up to 30 secs for 1 replicas to set the property overlay to be of version 0 for collection testCatTime
   [junit4]   2> 464864 INFO  (Thread-124) [     ] o.a.s.c.SolrCore config update listener called for core testCatTime_shard1_replica_n1
   [junit4]   2> 464876 INFO  (solrHandlerExecutor-486-thread-1-processing-n:127.0.0.1:37660_solr x:testCatTime_shard1_replica_n1 c:testCatTime s:shard1 r:core_node2) [n:127.0.0.1:37660_solr c:testCatTime s:shard1 r:core_node2 x:testCatTime_shard1_replica_n1 ] o.a.s.h.SolrConfigHandler Time elapsed : 0 secs, maxWait 30
   [junit4]   2> 464884 INFO  (Thread-124) [     ] o.a.s.c.SolrCore core reload testCatTime_shard1_replica_n1
   [junit4]   2> 464933 INFO  (Thread-124) [     ] o.a.s.c.RequestParams conf resource params.json loaded . version : 0 
   [junit4]   2> 464947 INFO  (Thread-124) [     ] o.a.s.c.RequestParams request params refreshed to version 0
   [junit4]   2> 464948 WARN  (Thread-124) [     ] o.a.s.c.SolrConfig Couldn't add files from /home/jenkins/jenkins-slave/workspace/Lucene-Solr-Tests-8.x/solr/build/solr-core/test/J2/temp/solr.update.processor.DimensionalRoutedAliasUpdateProcessorTest_A49B1CEEC4DB6F1A-001/tempDir-001/node4/testCatTime_shard1_replica_n1/../../../../contrib/extraction/lib filtered by .*\.jar to classpath: /home/jenkins/jenkins-slave/workspace/Lucene-Solr-Tests-8.x/solr/build/solr-core/test/J2/temp/solr.update.processor.DimensionalRoutedAliasUpdateProcessorTest_A49B1CEEC4DB6F1A-001/tempDir-001/node4/testCatTime_shard1_replica_n1/../../../../contrib/extraction/lib
   [junit4]   2> 464948 WARN  (Thread-124) [     ] o.a.s.c.SolrConfig Couldn't add files from /home/jenkins/jenkins-slave/workspace/Lucene-Solr-Tests-8.x/solr/build/solr-core/test/J2/temp/solr.update.processor.DimensionalRoutedAliasUpdateProcessorTest_A49B1CEEC4DB6F1A-001/tempDir-001/node4/testCatTime_shard1_replica_n1/../../../../dist filtered by solr-cell-\d.*\.jar to classpath: /home/jenkins/jenkins-slave/workspace/Lucene-Solr-Tests-8.x/solr/build/solr-core/test/J2/temp/solr.update.processor.DimensionalRoutedAliasUpdateProcessorTest_A49B1CEEC4DB6F1A-001/tempDir-001/node4/testCatTime_shard1_replica_n1/../../../../dist
   [junit4]   2> 464948 WARN  (Thread-124) [     ] o.a.s.c.SolrConfig Couldn't add files from /home/jenkins/jenkins-slave/workspace/Lucene-Solr-Tests-8.x/solr/build/solr-core/test/J2/temp/solr.update.processor.DimensionalRoutedAliasUpdateProcessorTest_A49B1CEEC4DB6F1A-001/tempDir-001/node4/testCatTime_shard1_replica_n1/../../../../contrib/clustering/lib filtered by .*\.jar to classpath: /home/jenkins/jenkins-slave/workspace/Lucene-Solr-Tests-8.x/solr/build/solr-core/test/J2/temp/solr.update.processor.DimensionalRoutedAliasUpdateProcessorTest_A49B1CEEC4DB6F1A-001/tempDir-001/node4/testCatTime_shard1_replica_n1/../../../../contrib/clustering/lib
   [junit4]   2> 464948 WARN  (Thread-124) [     ] o.a.s.c.SolrConfig Couldn't add files from /home/jenkins/jenkins-slave/workspace/Lucene-Solr-Tests-8.x/solr/build/solr-core/test/J2/temp/solr.update.processor.DimensionalRoutedAliasUpdateProcessorTest_A49B1CEEC4DB6F1A-001/tempDir-001/node4/testCatTime_shard1_replica_n1/../../../../dist filtered by solr-clustering-\d.*\.jar to classpath: /home/jenkins/jenkins-slave/workspace/Lucene-Solr-Tests-8.x/solr/build/solr-core/test/J2/temp/solr.update.processor.DimensionalRoutedAliasUpdateProcessorTest_A49B1CEEC4DB6F1A-001/tempDir-001/node4/testCatTime_shard1_replica_n1/../../../../dist
   [junit4]   2> 464948 WARN  (Thread-124) [     ] o.a.s.c.SolrConfig Couldn't add files from /home/jenkins/jenkins-slave/workspace/Lucene-Solr-Tests-8.x/solr/build/solr-core/test/J2/temp/solr.update.processor.DimensionalRoutedAliasUpdateProcessorTest_A49B1CEEC4DB6F1A-001/tempDir-001/node4/testCatTime_shard1_replica_n1/../../../../contrib/langid/lib filtered by .*\.jar to classpath: /home/jenkins/jenkins-slave/workspace/Lucene-Solr-Tests-8.x/solr/build/solr-core/test/J2/temp/solr.update.processor.DimensionalRoutedAliasUpdateProcessorTest_A49B1CEEC4DB6F1A-001/tempDir-001/node4/testCatTime_shard1_replica_n1/../../../../contrib/langid/lib
   [junit4]   2> 464948 WARN  (Thread-124) [     ] o.a.s.c.SolrConfig Couldn't add files from /home/jenkins/jenkins-slave/workspace/Lucene-Solr-Tests-8.x/solr/build/solr-core/test/J2/temp/solr.update.processor.DimensionalRoutedAliasUpdateProcessorTest_A49B1CEEC4DB6F1A-001/tempDir-001/node4/testCatTime_shard1_replica_n1/../../../../dist filtered by solr-langid-\d.*\.jar to classpath: /home/jenkins/jenkins-slave/workspace/Lucene-Solr-Tests-8.x/solr/build/solr-core/test/J2/temp/solr.update.processor.DimensionalRoutedAliasUpdateProcessorTest_A49B1CEEC4DB6F1A-001/tempDir-001/node4/testCatTime_shard1_replica_n1/../../../../dist
   [junit4]   2> 464948 WARN  (Thread-124) [     ] o.a.s.c.SolrConfig Couldn't add files from /home/jenkins/jenkins-slave/workspace/Lucene-Solr-Tests-8.x/solr/build/solr-core/test/J2/temp/solr.update.processor.DimensionalRoutedAliasUpdateProcessorTest_A49B1CEEC4DB6F1A-001/tempDir-001/node4/testCatTime_shard1_replica_n1/../../../../contrib/velocity/lib filtered by .*\.jar to classpath: /home/jenkins/jenkins-slave/workspace/Lucene-Solr-Tests-8.x/solr/build/solr-core/test/J2/temp/solr.update.processor.DimensionalRoutedAliasUpdateProcessorTest_A49B1CEEC4DB6F1A-001/tempDir-001/node4/testCatTime_shard1_replica_n1/../../../../contrib/velocity/lib
   [junit4]   2> 464948 WARN  (Thread-124) [     ] o.a.s.c.SolrConfig Couldn't add files from /home/jenkins/jenkins-slave/workspace/Lucene-Solr-Tests-8.x/solr/build/solr-core/test/J2/temp/solr.update.processor.DimensionalRoutedAliasUpdateProcessorT

[...truncated too long message...]

gs :: file = /home/jenkins/jenkins-slave/workspace/Lucene-Solr-Tests-8.x/lucene/top-level-ivy-settings.xml

resolve:

ivy-availability-check:
[loadresource] Do not set property disallowed.ivy.jars.list as its length is 0.

-ivy-fail-disallowed-ivy-version:

ivy-fail:

ivy-configure:
[ivy:configure] :: loading settings :: file = /home/jenkins/jenkins-slave/workspace/Lucene-Solr-Tests-8.x/lucene/top-level-ivy-settings.xml

resolve:

ivy-availability-check:
[loadresource] Do not set property disallowed.ivy.jars.list as its length is 0.

-ivy-fail-disallowed-ivy-version:

ivy-fail:

ivy-fail:

ivy-configure:
[ivy:configure] :: loading settings :: file = /home/jenkins/jenkins-slave/workspace/Lucene-Solr-Tests-8.x/lucene/top-level-ivy-settings.xml

resolve:

ivy-availability-check:
[loadresource] Do not set property disallowed.ivy.jars.list as its length is 0.

-ivy-fail-disallowed-ivy-version:

ivy-fail:

ivy-configure:
[ivy:configure] :: loading settings :: file = /home/jenkins/jenkins-slave/workspace/Lucene-Solr-Tests-8.x/lucene/top-level-ivy-settings.xml

resolve:

ivy-availability-check:
[loadresource] Do not set property disallowed.ivy.jars.list as its length is 0.

-ivy-fail-disallowed-ivy-version:

ivy-fail:

ivy-fail:

ivy-configure:
[ivy:configure] :: loading settings :: file = /home/jenkins/jenkins-slave/workspace/Lucene-Solr-Tests-8.x/lucene/top-level-ivy-settings.xml

resolve:

ivy-availability-check:
[loadresource] Do not set property disallowed.ivy.jars.list as its length is 0.

-ivy-fail-disallowed-ivy-version:

ivy-fail:

ivy-fail:

ivy-configure:
[ivy:configure] :: loading settings :: file = /home/jenkins/jenkins-slave/workspace/Lucene-Solr-Tests-8.x/lucene/top-level-ivy-settings.xml

resolve:

ivy-availability-check:
[loadresource] Do not set property disallowed.ivy.jars.list as its length is 0.

-ivy-fail-disallowed-ivy-version:

ivy-fail:

ivy-fail:

ivy-configure:
[ivy:configure] :: loading settings :: file = /home/jenkins/jenkins-slave/workspace/Lucene-Solr-Tests-8.x/lucene/top-level-ivy-settings.xml

resolve:

ivy-availability-check:
[loadresource] Do not set property disallowed.ivy.jars.list as its length is 0.

-ivy-fail-disallowed-ivy-version:

ivy-fail:

ivy-fail:

ivy-configure:
[ivy:configure] :: loading settings :: file = /home/jenkins/jenkins-slave/workspace/Lucene-Solr-Tests-8.x/lucene/top-level-ivy-settings.xml

resolve:

ivy-availability-check:
[loadresource] Do not set property disallowed.ivy.jars.list as its length is 0.

-ivy-fail-disallowed-ivy-version:

ivy-fail:

ivy-fail:

ivy-configure:
[ivy:configure] :: loading settings :: file = /home/jenkins/jenkins-slave/workspace/Lucene-Solr-Tests-8.x/lucene/top-level-ivy-settings.xml

resolve:

ivy-availability-check:
[loadresource] Do not set property disallowed.ivy.jars.list as its length is 0.

-ivy-fail-disallowed-ivy-version:

ivy-fail:

ivy-fail:

ivy-configure:
[ivy:configure] :: loading settings :: file = /home/jenkins/jenkins-slave/workspace/Lucene-Solr-Tests-8.x/lucene/top-level-ivy-settings.xml

resolve:

ivy-availability-check:
[loadresource] Do not set property disallowed.ivy.jars.list as its length is 0.

-ivy-fail-disallowed-ivy-version:

ivy-fail:

ivy-fail:

ivy-configure:
[ivy:configure] :: loading settings :: file = /home/jenkins/jenkins-slave/workspace/Lucene-Solr-Tests-8.x/lucene/top-level-ivy-settings.xml

resolve:

ivy-availability-check:
[loadresource] Do not set property disallowed.ivy.jars.list as its length is 0.

-ivy-fail-disallowed-ivy-version:

ivy-fail:

ivy-fail:

ivy-configure:
[ivy:configure] :: loading settings :: file = /home/jenkins/jenkins-slave/workspace/Lucene-Solr-Tests-8.x/lucene/top-level-ivy-settings.xml

resolve:

ivy-availability-check:
[loadresource] Do not set property disallowed.ivy.jars.list as its length is 0.

-ivy-fail-disallowed-ivy-version:

ivy-fail:

ivy-fail:

ivy-configure:
[ivy:configure] :: loading settings :: file = /home/jenkins/jenkins-slave/workspace/Lucene-Solr-Tests-8.x/lucene/top-level-ivy-settings.xml

resolve:

ivy-availability-check:
[loadresource] Do not set property disallowed.ivy.jars.list as its length is 0.

-ivy-fail-disallowed-ivy-version:

ivy-fail:

ivy-fail:

ivy-configure:
[ivy:configure] :: loading settings :: file = /home/jenkins/jenkins-slave/workspace/Lucene-Solr-Tests-8.x/lucene/top-level-ivy-settings.xml

resolve:

ivy-availability-check:
[loadresource] Do not set property disallowed.ivy.jars.list as its length is 0.

-ivy-fail-disallowed-ivy-version:

ivy-fail:

ivy-fail:

ivy-configure:
[ivy:configure] :: loading settings :: file = /home/jenkins/jenkins-slave/workspace/Lucene-Solr-Tests-8.x/lucene/top-level-ivy-settings.xml

resolve:

jar-checksums:
    [mkdir] Created dir: /home/jenkins/jenkins-slave/workspace/Lucene-Solr-Tests-8.x/solr/null2049304929
     [copy] Copying 249 files to /home/jenkins/jenkins-slave/workspace/Lucene-Solr-Tests-8.x/solr/null2049304929
   [delete] Deleting directory /home/jenkins/jenkins-slave/workspace/Lucene-Solr-Tests-8.x/solr/null2049304929

check-working-copy:
[ivy:cachepath] :: resolving dependencies :: #;working@lucene2-us-west.apache.org
[ivy:cachepath] 	confs: [default]
[ivy:cachepath] 	found org.eclipse.jgit#org.eclipse.jgit;5.3.0.201903130848-r in public
[ivy:cachepath] 	found com.jcraft#jsch;0.1.54 in public
[ivy:cachepath] 	found com.jcraft#jzlib;1.1.1 in public
[ivy:cachepath] 	found com.googlecode.javaewah#JavaEWAH;1.1.6 in public
[ivy:cachepath] 	found org.slf4j#slf4j-api;1.7.2 in public
[ivy:cachepath] 	found org.bouncycastle#bcpg-jdk15on;1.60 in public
[ivy:cachepath] 	found org.bouncycastle#bcprov-jdk15on;1.60 in public
[ivy:cachepath] 	found org.bouncycastle#bcpkix-jdk15on;1.60 in public
[ivy:cachepath] 	found org.slf4j#slf4j-nop;1.7.2 in public
[ivy:cachepath] :: resolution report :: resolve 19ms :: artifacts dl 1ms
	---------------------------------------------------------------------
	|                  |            modules            ||   artifacts   |
	|       conf       | number| search|dwnlded|evicted|| number|dwnlded|
	---------------------------------------------------------------------
	|      default     |   9   |   0   |   0   |   0   ||   9   |   0   |
	---------------------------------------------------------------------
[wc-checker] Initializing working copy...
[wc-checker] Checking working copy status...

-jenkins-base:

BUILD SUCCESSFUL
Total time: 190 minutes 45 seconds
Archiving artifacts
java.lang.InterruptedException: no matches found within 10000
	at hudson.FilePath$ValidateAntFileMask.hasMatch(FilePath.java:2847)
	at hudson.FilePath$ValidateAntFileMask.invoke(FilePath.java:2726)
	at hudson.FilePath$ValidateAntFileMask.invoke(FilePath.java:2707)
	at hudson.FilePath$FileCallableWrapper.call(FilePath.java:3086)
Also:   hudson.remoting.Channel$CallSiteStackTrace: Remote call to lucene2
		at hudson.remoting.Channel.attachCallSiteStackTrace(Channel.java:1741)
		at hudson.remoting.UserRequest$ExceptionResponse.retrieve(UserRequest.java:357)
		at hudson.remoting.Channel.call(Channel.java:955)
		at hudson.FilePath.act(FilePath.java:1072)
		at hudson.FilePath.act(FilePath.java:1061)
		at hudson.FilePath.validateAntFileMask(FilePath.java:2705)
		at hudson.tasks.ArtifactArchiver.perform(ArtifactArchiver.java:243)
		at hudson.tasks.BuildStepCompatibilityLayer.perform(BuildStepCompatibilityLayer.java:81)
		at hudson.tasks.BuildStepMonitor$1.perform(BuildStepMonitor.java:20)
		at hudson.model.AbstractBuild$AbstractBuildExecution.perform(AbstractBuild.java:744)
		at hudson.model.AbstractBuild$AbstractBuildExecution.performAllBuildSteps(AbstractBuild.java:690)
		at hudson.model.Build$BuildExecution.post2(Build.java:186)
		at hudson.model.AbstractBuild$AbstractBuildExecution.post(AbstractBuild.java:635)
		at hudson.model.Run.execute(Run.java:1835)
		at hudson.model.FreeStyleBuild.run(FreeStyleBuild.java:43)
		at hudson.model.ResourceController.execute(ResourceController.java:97)
		at hudson.model.Executor.run(Executor.java:429)
Caused: hudson.FilePath$TunneledInterruptedException
	at hudson.FilePath$FileCallableWrapper.call(FilePath.java:3088)
	at hudson.remoting.UserRequest.perform(UserRequest.java:212)
	at hudson.remoting.UserRequest.perform(UserRequest.java:54)
	at hudson.remoting.Request$2.run(Request.java:369)
	at hudson.remoting.InterceptingExecutorService$1.call(InterceptingExecutorService.java:72)
	at java.util.concurrent.FutureTask.run(FutureTask.java:266)
	at java.util.concurrent.ThreadPoolExecutor.runWorker(ThreadPoolExecutor.java:1142)
	at java.util.concurrent.ThreadPoolExecutor$Worker.run(ThreadPoolExecutor.java:617)
	at java.lang.Thread.run(Thread.java:748)
Caused: java.lang.InterruptedException: java.lang.InterruptedException: no matches found within 10000
	at hudson.FilePath.act(FilePath.java:1074)
	at hudson.FilePath.act(FilePath.java:1061)
	at hudson.FilePath.validateAntFileMask(FilePath.java:2705)
	at hudson.tasks.ArtifactArchiver.perform(ArtifactArchiver.java:243)
	at hudson.tasks.BuildStepCompatibilityLayer.perform(BuildStepCompatibilityLayer.java:81)
	at hudson.tasks.BuildStepMonitor$1.perform(BuildStepMonitor.java:20)
	at hudson.model.AbstractBuild$AbstractBuildExecution.perform(AbstractBuild.java:744)
	at hudson.model.AbstractBuild$AbstractBuildExecution.performAllBuildSteps(AbstractBuild.java:690)
	at hudson.model.Build$BuildExecution.post2(Build.java:186)
	at hudson.model.AbstractBuild$AbstractBuildExecution.post(AbstractBuild.java:635)
	at hudson.model.Run.execute(Run.java:1835)
	at hudson.model.FreeStyleBuild.run(FreeStyleBuild.java:43)
	at hudson.model.ResourceController.execute(ResourceController.java:97)
	at hudson.model.Executor.run(Executor.java:429)
No artifacts found that match the file pattern "**/*.events,heapdumps/**,**/hs_err_pid*". Configuration error?
Recording test results
Build step 'Publish JUnit test result report' changed build result to UNSTABLE
Email was triggered for: Unstable (Test Failures)
Sending email for trigger: Unstable (Test Failures)

[JENKINS] Lucene-Solr-Tests-8.x - Build # 415 - Still Unstable

Posted by Apache Jenkins Server <je...@builds.apache.org>.
Build: https://builds.apache.org/job/Lucene-Solr-Tests-8.x/415/

1 tests failed.
FAILED:  org.apache.solr.handler.TestContainerReqHandler.testRuntimeLib

Error Message:
attempt: 9 Mismatch for value : 'requestHandler' in response {   "responseHeader":{     "status":0,     "QTime":0},   "metadata":{"version":3},   "runtimeLib":[{       "name":"foo",       "url":"http://localhost:36368/jar3.jar",       "60ec88c2a2e9b409f7afc309273383810a0d07a078b482434eda9674f7e25b8adafa8a67c9913c996cbfb78a7f6ad2b9db26dbd4fe0ca4068f248d5db563f922":"60ec88c2a2e9b409f7afc309273383810a0d07a078b482434eda9674f7e25b8adafa8a67c9913c996cbfb78a7f6ad2b9db26dbd4fe0ca4068f248d5db563f922"}],   "requestHandler":[{"bar":"org.apache.solr.core.RuntimeLibReqHandler"}]}

Stack Trace:
java.lang.AssertionError: attempt: 9 Mismatch for value : 'requestHandler' in response {
  "responseHeader":{
    "status":0,
    "QTime":0},
  "metadata":{"version":3},
  "runtimeLib":[{
      "name":"foo",
      "url":"http://localhost:36368/jar3.jar",
      "60ec88c2a2e9b409f7afc309273383810a0d07a078b482434eda9674f7e25b8adafa8a67c9913c996cbfb78a7f6ad2b9db26dbd4fe0ca4068f248d5db563f922":"60ec88c2a2e9b409f7afc309273383810a0d07a078b482434eda9674f7e25b8adafa8a67c9913c996cbfb78a7f6ad2b9db26dbd4fe0ca4068f248d5db563f922"}],
  "requestHandler":[{"bar":"org.apache.solr.core.RuntimeLibReqHandler"}]}
	at __randomizedtesting.SeedInfo.seed([C05E7BAA7922060F:F3F9EFFE8AB2F7BB]:0)
	at org.junit.Assert.fail(Assert.java:88)
	at org.apache.solr.handler.TestContainerReqHandler.assertResponseValues(TestContainerReqHandler.java:106)
	at org.apache.solr.handler.TestContainerReqHandler.testRuntimeLib(TestContainerReqHandler.java:222)
	at sun.reflect.NativeMethodAccessorImpl.invoke0(Native Method)
	at sun.reflect.NativeMethodAccessorImpl.invoke(NativeMethodAccessorImpl.java:62)
	at sun.reflect.DelegatingMethodAccessorImpl.invoke(DelegatingMethodAccessorImpl.java:43)
	at java.lang.reflect.Method.invoke(Method.java:498)
	at com.carrotsearch.randomizedtesting.RandomizedRunner.invoke(RandomizedRunner.java:1750)
	at com.carrotsearch.randomizedtesting.RandomizedRunner$8.evaluate(RandomizedRunner.java:938)
	at com.carrotsearch.randomizedtesting.RandomizedRunner$9.evaluate(RandomizedRunner.java:974)
	at com.carrotsearch.randomizedtesting.RandomizedRunner$10.evaluate(RandomizedRunner.java:988)
	at com.carrotsearch.randomizedtesting.rules.SystemPropertiesRestoreRule$1.evaluate(SystemPropertiesRestoreRule.java:57)
	at org.apache.lucene.util.TestRuleSetupTeardownChained$1.evaluate(TestRuleSetupTeardownChained.java:49)
	at org.apache.lucene.util.AbstractBeforeAfterRule$1.evaluate(AbstractBeforeAfterRule.java:45)
	at org.apache.lucene.util.TestRuleThreadAndTestName$1.evaluate(TestRuleThreadAndTestName.java:48)
	at org.apache.lucene.util.TestRuleIgnoreAfterMaxFailures$1.evaluate(TestRuleIgnoreAfterMaxFailures.java:64)
	at org.apache.lucene.util.TestRuleMarkFailure$1.evaluate(TestRuleMarkFailure.java:47)
	at com.carrotsearch.randomizedtesting.rules.StatementAdapter.evaluate(StatementAdapter.java:36)
	at com.carrotsearch.randomizedtesting.ThreadLeakControl$StatementRunner.run(ThreadLeakControl.java:368)
	at com.carrotsearch.randomizedtesting.ThreadLeakControl.forkTimeoutingTask(ThreadLeakControl.java:817)
	at com.carrotsearch.randomizedtesting.ThreadLeakControl$3.evaluate(ThreadLeakControl.java:468)
	at com.carrotsearch.randomizedtesting.RandomizedRunner.runSingleTest(RandomizedRunner.java:947)
	at com.carrotsearch.randomizedtesting.RandomizedRunner$5.evaluate(RandomizedRunner.java:832)
	at com.carrotsearch.randomizedtesting.RandomizedRunner$6.evaluate(RandomizedRunner.java:883)
	at com.carrotsearch.randomizedtesting.RandomizedRunner$7.evaluate(RandomizedRunner.java:894)
	at com.carrotsearch.randomizedtesting.rules.StatementAdapter.evaluate(StatementAdapter.java:36)
	at com.carrotsearch.randomizedtesting.rules.SystemPropertiesRestoreRule$1.evaluate(SystemPropertiesRestoreRule.java:57)
	at org.apache.lucene.util.AbstractBeforeAfterRule$1.evaluate(AbstractBeforeAfterRule.java:45)
	at com.carrotsearch.randomizedtesting.rules.StatementAdapter.evaluate(StatementAdapter.java:36)
	at org.apache.lucene.util.TestRuleStoreClassName$1.evaluate(TestRuleStoreClassName.java:41)
	at com.carrotsearch.randomizedtesting.rules.NoShadowingOrOverridesOnMethodsRule$1.evaluate(NoShadowingOrOverridesOnMethodsRule.java:40)
	at com.carrotsearch.randomizedtesting.rules.NoShadowingOrOverridesOnMethodsRule$1.evaluate(NoShadowingOrOverridesOnMethodsRule.java:40)
	at com.carrotsearch.randomizedtesting.rules.StatementAdapter.evaluate(StatementAdapter.java:36)
	at com.carrotsearch.randomizedtesting.rules.StatementAdapter.evaluate(StatementAdapter.java:36)
	at com.carrotsearch.randomizedtesting.rules.StatementAdapter.evaluate(StatementAdapter.java:36)
	at org.apache.lucene.util.TestRuleAssertionsRequired$1.evaluate(TestRuleAssertionsRequired.java:53)
	at org.apache.lucene.util.TestRuleMarkFailure$1.evaluate(TestRuleMarkFailure.java:47)
	at org.apache.lucene.util.TestRuleIgnoreAfterMaxFailures$1.evaluate(TestRuleIgnoreAfterMaxFailures.java:64)
	at org.apache.lucene.util.TestRuleIgnoreTestSuites$1.evaluate(TestRuleIgnoreTestSuites.java:54)
	at com.carrotsearch.randomizedtesting.rules.StatementAdapter.evaluate(StatementAdapter.java:36)
	at com.carrotsearch.randomizedtesting.ThreadLeakControl$StatementRunner.run(ThreadLeakControl.java:368)
	at java.lang.Thread.run(Thread.java:748)




Build Log:
[...truncated 13405 lines...]
   [junit4] Suite: org.apache.solr.handler.TestContainerReqHandler
   [junit4]   2> 424095 INFO  (SUITE-TestContainerReqHandler-seed#[C05E7BAA7922060F]-worker) [     ] o.a.s.SolrTestCaseJ4 Created dataDir: /home/jenkins/jenkins-slave/workspace/Lucene-Solr-Tests-8.x/solr/build/solr-core/test/J0/temp/solr.handler.TestContainerReqHandler_C05E7BAA7922060F-001/data-dir-27-001
   [junit4]   2> 424095 WARN  (SUITE-TestContainerReqHandler-seed#[C05E7BAA7922060F]-worker) [     ] o.a.s.SolrTestCaseJ4 startTrackingSearchers: numOpens=1 numCloses=1
   [junit4]   2> 424095 INFO  (SUITE-TestContainerReqHandler-seed#[C05E7BAA7922060F]-worker) [     ] o.a.s.SolrTestCaseJ4 Using PointFields (NUMERIC_POINTS_SYSPROP=true) w/NUMERIC_DOCVALUES_SYSPROP=true
   [junit4]   2> 424097 INFO  (SUITE-TestContainerReqHandler-seed#[C05E7BAA7922060F]-worker) [     ] o.a.s.SolrTestCaseJ4 Randomized ssl (false) and clientAuth (false) via: @org.apache.solr.SolrTestCaseJ4$SuppressSSL(bugUrl=None)
   [junit4]   2> 424097 INFO  (SUITE-TestContainerReqHandler-seed#[C05E7BAA7922060F]-worker) [     ] o.a.s.SolrTestCaseJ4 SecureRandom sanity checks: test.solr.allowed.securerandom=null & java.security.egd=file:/dev/./urandom
   [junit4]   2> 424112 INFO  (TEST-TestContainerReqHandler.testPluginGlobalLoader-seed#[C05E7BAA7922060F]) [     ] o.a.s.SolrTestCaseJ4 ###Starting testPluginGlobalLoader
   [junit4]   2> 424152 INFO  (TEST-TestContainerReqHandler.testPluginGlobalLoader-seed#[C05E7BAA7922060F]) [     ] o.e.j.s.Server jetty-9.4.19.v20190610; built: 2019-06-10T16:30:51.723Z; git: afcf563148970e98786327af5e07c261fda175d3; jvm 1.8.0_191-b12
   [junit4]   2> 424168 INFO  (TEST-TestContainerReqHandler.testPluginGlobalLoader-seed#[C05E7BAA7922060F]) [     ] o.e.j.s.AbstractConnector Started ServerConnector@45e4d875{HTTP/1.1,[http/1.1]}{0.0.0.0:๔๖๖๒๒}
   [junit4]   2> 424168 INFO  (TEST-TestContainerReqHandler.testPluginGlobalLoader-seed#[C05E7BAA7922060F]) [     ] o.e.j.s.Server Started @๔๒๔๓๗๐ms
   [junit4]   2> 424169 INFO  (TEST-TestContainerReqHandler.testPluginGlobalLoader-seed#[C05E7BAA7922060F]) [     ] o.a.s.c.MiniSolrCloudCluster Starting cluster of 4 servers in /home/jenkins/jenkins-slave/workspace/Lucene-Solr-Tests-8.x/solr/build/solr-core/test/J0/temp/solr.handler.TestContainerReqHandler_C05E7BAA7922060F-001/tempDir-001
   [junit4]   2> 424169 INFO  (TEST-TestContainerReqHandler.testPluginGlobalLoader-seed#[C05E7BAA7922060F]) [     ] o.a.s.c.ZkTestServer STARTING ZK TEST SERVER
   [junit4]   2> 424170 INFO  (ZkTestServer Run Thread) [     ] o.a.s.c.ZkTestServer client port:0.0.0.0/0.0.0.0:0
   [junit4]   2> 424170 INFO  (ZkTestServer Run Thread) [     ] o.a.s.c.ZkTestServer Starting server
   [junit4]   2> 424270 INFO  (TEST-TestContainerReqHandler.testPluginGlobalLoader-seed#[C05E7BAA7922060F]) [     ] o.a.s.c.ZkTestServer start zk server on port:35891
   [junit4]   2> 424270 INFO  (TEST-TestContainerReqHandler.testPluginGlobalLoader-seed#[C05E7BAA7922060F]) [     ] o.a.s.c.ZkTestServer parse host and port list: 127.0.0.1:35891
   [junit4]   2> 424270 INFO  (TEST-TestContainerReqHandler.testPluginGlobalLoader-seed#[C05E7BAA7922060F]) [     ] o.a.s.c.ZkTestServer connecting to 127.0.0.1 35891
   [junit4]   2> 424272 INFO  (TEST-TestContainerReqHandler.testPluginGlobalLoader-seed#[C05E7BAA7922060F]) [     ] o.a.s.c.c.ConnectionManager Waiting for client to connect to ZooKeeper
   [junit4]   2> 424274 INFO  (zkConnectionManagerCallback-2074-thread-1) [     ] o.a.s.c.c.ConnectionManager zkClient has connected
   [junit4]   2> 424274 INFO  (TEST-TestContainerReqHandler.testPluginGlobalLoader-seed#[C05E7BAA7922060F]) [     ] o.a.s.c.c.ConnectionManager Client is connected to ZooKeeper
   [junit4]   2> 424276 INFO  (TEST-TestContainerReqHandler.testPluginGlobalLoader-seed#[C05E7BAA7922060F]) [     ] o.a.s.c.c.ConnectionManager Waiting for client to connect to ZooKeeper
   [junit4]   2> 424277 INFO  (zkConnectionManagerCallback-2076-thread-1) [     ] o.a.s.c.c.ConnectionManager zkClient has connected
   [junit4]   2> 424277 INFO  (TEST-TestContainerReqHandler.testPluginGlobalLoader-seed#[C05E7BAA7922060F]) [     ] o.a.s.c.c.ConnectionManager Client is connected to ZooKeeper
   [junit4]   2> 424278 INFO  (TEST-TestContainerReqHandler.testPluginGlobalLoader-seed#[C05E7BAA7922060F]) [     ] o.a.s.c.c.ConnectionManager Waiting for client to connect to ZooKeeper
   [junit4]   2> 424279 INFO  (zkConnectionManagerCallback-2078-thread-1) [     ] o.a.s.c.c.ConnectionManager zkClient has connected
   [junit4]   2> 424279 INFO  (TEST-TestContainerReqHandler.testPluginGlobalLoader-seed#[C05E7BAA7922060F]) [     ] o.a.s.c.c.ConnectionManager Client is connected to ZooKeeper
   [junit4]   2> 424381 WARN  (jetty-launcher-2079-thread-1) [     ] o.e.j.s.AbstractConnector Ignoring deprecated socket close linger time
   [junit4]   2> 424381 WARN  (jetty-launcher-2079-thread-3) [     ] o.e.j.s.AbstractConnector Ignoring deprecated socket close linger time
   [junit4]   2> 424381 WARN  (jetty-launcher-2079-thread-4) [     ] o.e.j.s.AbstractConnector Ignoring deprecated socket close linger time
   [junit4]   2> 424381 INFO  (jetty-launcher-2079-thread-1) [     ] o.a.s.c.s.e.JettySolrRunner Start Jetty (original configured port=0)
   [junit4]   2> 424381 INFO  (jetty-launcher-2079-thread-4) [     ] o.a.s.c.s.e.JettySolrRunner Start Jetty (original configured port=0)
   [junit4]   2> 424381 INFO  (jetty-launcher-2079-thread-3) [     ] o.a.s.c.s.e.JettySolrRunner Start Jetty (original configured port=0)
   [junit4]   2> 424381 INFO  (jetty-launcher-2079-thread-4) [     ] o.a.s.c.s.e.JettySolrRunner Trying to start Jetty on port 0 try number 1 ...
   [junit4]   2> 424381 INFO  (jetty-launcher-2079-thread-3) [     ] o.a.s.c.s.e.JettySolrRunner Trying to start Jetty on port 0 try number 1 ...
   [junit4]   2> 424381 INFO  (jetty-launcher-2079-thread-4) [     ] o.e.j.s.Server jetty-9.4.19.v20190610; built: 2019-06-10T16:30:51.723Z; git: afcf563148970e98786327af5e07c261fda175d3; jvm 1.8.0_191-b12
   [junit4]   2> 424381 INFO  (jetty-launcher-2079-thread-3) [     ] o.e.j.s.Server jetty-9.4.19.v20190610; built: 2019-06-10T16:30:51.723Z; git: afcf563148970e98786327af5e07c261fda175d3; jvm 1.8.0_191-b12
   [junit4]   2> 424381 INFO  (jetty-launcher-2079-thread-1) [     ] o.a.s.c.s.e.JettySolrRunner Trying to start Jetty on port 0 try number 1 ...
   [junit4]   2> 424381 INFO  (jetty-launcher-2079-thread-1) [     ] o.e.j.s.Server jetty-9.4.19.v20190610; built: 2019-06-10T16:30:51.723Z; git: afcf563148970e98786327af5e07c261fda175d3; jvm 1.8.0_191-b12
   [junit4]   2> 424382 WARN  (jetty-launcher-2079-thread-2) [     ] o.e.j.s.AbstractConnector Ignoring deprecated socket close linger time
   [junit4]   2> 424382 INFO  (jetty-launcher-2079-thread-2) [     ] o.a.s.c.s.e.JettySolrRunner Start Jetty (original configured port=0)
   [junit4]   2> 424382 INFO  (jetty-launcher-2079-thread-2) [     ] o.a.s.c.s.e.JettySolrRunner Trying to start Jetty on port 0 try number 1 ...
   [junit4]   2> 424382 INFO  (jetty-launcher-2079-thread-2) [     ] o.e.j.s.Server jetty-9.4.19.v20190610; built: 2019-06-10T16:30:51.723Z; git: afcf563148970e98786327af5e07c261fda175d3; jvm 1.8.0_191-b12
   [junit4]   2> 424384 INFO  (jetty-launcher-2079-thread-1) [     ] o.e.j.s.session DefaultSessionIdManager workerName=node0
   [junit4]   2> 424384 INFO  (jetty-launcher-2079-thread-1) [     ] o.e.j.s.session No SessionScavenger set, using defaults
   [junit4]   2> 424384 INFO  (jetty-launcher-2079-thread-1) [     ] o.e.j.s.session node0 Scavenging every 600000ms
   [junit4]   2> 424384 INFO  (jetty-launcher-2079-thread-2) [     ] o.e.j.s.session DefaultSessionIdManager workerName=node0
   [junit4]   2> 424384 INFO  (jetty-launcher-2079-thread-2) [     ] o.e.j.s.session No SessionScavenger set, using defaults
   [junit4]   2> 424384 INFO  (jetty-launcher-2079-thread-2) [     ] o.e.j.s.session node0 Scavenging every 600000ms
   [junit4]   2> 424384 INFO  (jetty-launcher-2079-thread-4) [     ] o.e.j.s.session DefaultSessionIdManager workerName=node0
   [junit4]   2> 424384 INFO  (jetty-launcher-2079-thread-4) [     ] o.e.j.s.session No SessionScavenger set, using defaults
   [junit4]   2> 424384 INFO  (jetty-launcher-2079-thread-4) [     ] o.e.j.s.session node0 Scavenging every 600000ms
   [junit4]   2> 424384 INFO  (jetty-launcher-2079-thread-3) [     ] o.e.j.s.session DefaultSessionIdManager workerName=node0
   [junit4]   2> 424384 INFO  (jetty-launcher-2079-thread-3) [     ] o.e.j.s.session No SessionScavenger set, using defaults
   [junit4]   2> 424385 INFO  (jetty-launcher-2079-thread-3) [     ] o.e.j.s.session node0 Scavenging every 600000ms
   [junit4]   2> 424385 INFO  (jetty-launcher-2079-thread-1) [     ] o.e.j.s.h.ContextHandler Started o.e.j.s.ServletContextHandler@304b1fb8{/solr,null,AVAILABLE}
   [junit4]   2> 424385 INFO  (jetty-launcher-2079-thread-4) [     ] o.e.j.s.h.ContextHandler Started o.e.j.s.ServletContextHandler@4be4d087{/solr,null,AVAILABLE}
   [junit4]   2> 424385 INFO  (jetty-launcher-2079-thread-2) [     ] o.e.j.s.h.ContextHandler Started o.e.j.s.ServletContextHandler@75856209{/solr,null,AVAILABLE}
   [junit4]   2> 424385 INFO  (jetty-launcher-2079-thread-3) [     ] o.e.j.s.h.ContextHandler Started o.e.j.s.ServletContextHandler@25ddaad7{/solr,null,AVAILABLE}
   [junit4]   2> 424386 INFO  (jetty-launcher-2079-thread-2) [     ] o.e.j.s.AbstractConnector Started ServerConnector@62db2c7{HTTP/1.1,[http/1.1, h2c]}{127.0.0.1:๓๙๕๒๓}
   [junit4]   2> 424386 INFO  (jetty-launcher-2079-thread-2) [     ] o.e.j.s.Server Started @๔๒๔๕๘๗ms
   [junit4]   2> 424386 INFO  (jetty-launcher-2079-thread-2) [     ] o.a.s.c.s.e.JettySolrRunner Jetty properties: {hostContext=/solr, hostPort=39523}
   [junit4]   2> 424386 INFO  (jetty-launcher-2079-thread-3) [     ] o.e.j.s.AbstractConnector Started ServerConnector@71e5178a{HTTP/1.1,[http/1.1, h2c]}{127.0.0.1:๔๐๙๔๐}
   [junit4]   2> 424386 INFO  (jetty-launcher-2079-thread-3) [     ] o.e.j.s.Server Started @๔๒๔๕๘๗ms
   [junit4]   2> 424386 ERROR (jetty-launcher-2079-thread-2) [     ] o.a.s.u.StartupLoggingUtils Missing Java Option solr.log.dir. Logging may be missing or incomplete.
   [junit4]   2> 424386 INFO  (jetty-launcher-2079-thread-2) [     ] o.a.s.s.SolrDispatchFilter Using logger factory org.apache.logging.slf4j.Log4jLoggerFactory
   [junit4]   2> 424386 INFO  (jetty-launcher-2079-thread-2) [     ] o.a.s.s.SolrDispatchFilter  ___      _       Welcome to Apache Solr™ version 8.3.0
   [junit4]   2> 424386 INFO  (jetty-launcher-2079-thread-2) [     ] o.a.s.s.SolrDispatchFilter / __| ___| |_ _   Starting in cloud mode on port null
   [junit4]   2> 424386 INFO  (jetty-launcher-2079-thread-2) [     ] o.a.s.s.SolrDispatchFilter \__ \/ _ \ | '_|  Install dir: null
   [junit4]   2> 424386 INFO  (jetty-launcher-2079-thread-2) [     ] o.a.s.s.SolrDispatchFilter |___/\___/_|_|    Start time: 2019-08-15T15:09:09.731Z
   [junit4]   2> 424387 INFO  (jetty-launcher-2079-thread-1) [     ] o.e.j.s.AbstractConnector Started ServerConnector@d1aeca6{HTTP/1.1,[http/1.1, h2c]}{127.0.0.1:๔๒๔๗๑}
   [junit4]   2> 424387 INFO  (jetty-launcher-2079-thread-1) [     ] o.e.j.s.Server Started @๔๒๔๕๘๘ms
   [junit4]   2> 424387 INFO  (jetty-launcher-2079-thread-1) [     ] o.a.s.c.s.e.JettySolrRunner Jetty properties: {hostContext=/solr, hostPort=42471}
   [junit4]   2> 424387 ERROR (jetty-launcher-2079-thread-1) [     ] o.a.s.u.StartupLoggingUtils Missing Java Option solr.log.dir. Logging may be missing or incomplete.
   [junit4]   2> 424387 INFO  (jetty-launcher-2079-thread-1) [     ] o.a.s.s.SolrDispatchFilter Using logger factory org.apache.logging.slf4j.Log4jLoggerFactory
   [junit4]   2> 424387 INFO  (jetty-launcher-2079-thread-1) [     ] o.a.s.s.SolrDispatchFilter  ___      _       Welcome to Apache Solr™ version 8.3.0
   [junit4]   2> 424387 INFO  (jetty-launcher-2079-thread-1) [     ] o.a.s.s.SolrDispatchFilter / __| ___| |_ _   Starting in cloud mode on port null
   [junit4]   2> 424387 INFO  (jetty-launcher-2079-thread-1) [     ] o.a.s.s.SolrDispatchFilter \__ \/ _ \ | '_|  Install dir: null
   [junit4]   2> 424387 INFO  (jetty-launcher-2079-thread-1) [     ] o.a.s.s.SolrDispatchFilter |___/\___/_|_|    Start time: 2019-08-15T15:09:09.732Z
   [junit4]   2> 424387 INFO  (jetty-launcher-2079-thread-3) [     ] o.a.s.c.s.e.JettySolrRunner Jetty properties: {hostContext=/solr, hostPort=40940}
   [junit4]   2> 424388 ERROR (jetty-launcher-2079-thread-3) [     ] o.a.s.u.StartupLoggingUtils Missing Java Option solr.log.dir. Logging may be missing or incomplete.
   [junit4]   2> 424388 INFO  (jetty-launcher-2079-thread-3) [     ] o.a.s.s.SolrDispatchFilter Using logger factory org.apache.logging.slf4j.Log4jLoggerFactory
   [junit4]   2> 424388 INFO  (jetty-launcher-2079-thread-3) [     ] o.a.s.s.SolrDispatchFilter  ___      _       Welcome to Apache Solr™ version 8.3.0
   [junit4]   2> 424388 INFO  (jetty-launcher-2079-thread-3) [     ] o.a.s.s.SolrDispatchFilter / __| ___| |_ _   Starting in cloud mode on port null
   [junit4]   2> 424388 INFO  (jetty-launcher-2079-thread-3) [     ] o.a.s.s.SolrDispatchFilter \__ \/ _ \ | '_|  Install dir: null
   [junit4]   2> 424388 INFO  (jetty-launcher-2079-thread-3) [     ] o.a.s.s.SolrDispatchFilter |___/\___/_|_|    Start time: 2019-08-15T15:09:09.733Z
   [junit4]   2> 424394 INFO  (jetty-launcher-2079-thread-4) [     ] o.e.j.s.AbstractConnector Started ServerConnector@6d649b3a{HTTP/1.1,[http/1.1, h2c]}{127.0.0.1:๔๑๐๐๖}
   [junit4]   2> 424394 INFO  (jetty-launcher-2079-thread-4) [     ] o.e.j.s.Server Started @๔๒๔๕๙๕ms
   [junit4]   2> 424394 INFO  (jetty-launcher-2079-thread-4) [     ] o.a.s.c.s.e.JettySolrRunner Jetty properties: {hostContext=/solr, hostPort=41006}
   [junit4]   2> 424402 INFO  (jetty-launcher-2079-thread-2) [     ] o.a.s.c.c.ConnectionManager Waiting for client to connect to ZooKeeper
   [junit4]   2> 424402 ERROR (jetty-launcher-2079-thread-4) [     ] o.a.s.u.StartupLoggingUtils Missing Java Option solr.log.dir. Logging may be missing or incomplete.
   [junit4]   2> 424402 INFO  (jetty-launcher-2079-thread-4) [     ] o.a.s.s.SolrDispatchFilter Using logger factory org.apache.logging.slf4j.Log4jLoggerFactory
   [junit4]   2> 424402 INFO  (jetty-launcher-2079-thread-4) [     ] o.a.s.s.SolrDispatchFilter  ___      _       Welcome to Apache Solr™ version 8.3.0
   [junit4]   2> 424402 INFO  (jetty-launcher-2079-thread-4) [     ] o.a.s.s.SolrDispatchFilter / __| ___| |_ _   Starting in cloud mode on port null
   [junit4]   2> 424402 INFO  (jetty-launcher-2079-thread-4) [     ] o.a.s.s.SolrDispatchFilter \__ \/ _ \ | '_|  Install dir: null
   [junit4]   2> 424402 INFO  (jetty-launcher-2079-thread-4) [     ] o.a.s.s.SolrDispatchFilter |___/\___/_|_|    Start time: 2019-08-15T15:09:09.747Z
   [junit4]   2> 424402 INFO  (jetty-launcher-2079-thread-3) [     ] o.a.s.c.c.ConnectionManager Waiting for client to connect to ZooKeeper
   [junit4]   2> 424403 INFO  (jetty-launcher-2079-thread-1) [     ] o.a.s.c.c.ConnectionManager Waiting for client to connect to ZooKeeper
   [junit4]   2> 424404 INFO  (jetty-launcher-2079-thread-4) [     ] o.a.s.c.c.ConnectionManager Waiting for client to connect to ZooKeeper
   [junit4]   2> 424405 INFO  (zkConnectionManagerCallback-2083-thread-1) [     ] o.a.s.c.c.ConnectionManager zkClient has connected
   [junit4]   2> 424405 INFO  (zkConnectionManagerCallback-2085-thread-1) [     ] o.a.s.c.c.ConnectionManager zkClient has connected
   [junit4]   2> 424405 INFO  (jetty-launcher-2079-thread-1) [     ] o.a.s.c.c.ConnectionManager Client is connected to ZooKeeper
   [junit4]   2> 424405 INFO  (zkConnectionManagerCallback-2081-thread-1) [     ] o.a.s.c.c.ConnectionManager zkClient has connected
   [junit4]   2> 424405 INFO  (jetty-launcher-2079-thread-2) [     ] o.a.s.c.c.ConnectionManager Client is connected to ZooKeeper
   [junit4]   2> 424405 INFO  (jetty-launcher-2079-thread-3) [     ] o.a.s.c.c.ConnectionManager Client is connected to ZooKeeper
   [junit4]   2> 424405 INFO  (jetty-launcher-2079-thread-2) [     ] o.a.s.s.SolrDispatchFilter solr.xml found in ZooKeeper. Loading...
   [junit4]   2> 424406 INFO  (jetty-launcher-2079-thread-3) [     ] o.a.s.s.SolrDispatchFilter solr.xml found in ZooKeeper. Loading...
   [junit4]   2> 424406 INFO  (jetty-launcher-2079-thread-1) [     ] o.a.s.s.SolrDispatchFilter solr.xml found in ZooKeeper. Loading...
   [junit4]   2> 424418 INFO  (zkConnectionManagerCallback-2087-thread-1) [     ] o.a.s.c.c.ConnectionManager zkClient has connected
   [junit4]   2> 424418 INFO  (jetty-launcher-2079-thread-4) [     ] o.a.s.c.c.ConnectionManager Client is connected to ZooKeeper
   [junit4]   2> 424451 INFO  (jetty-launcher-2079-thread-4) [     ] o.a.s.s.SolrDispatchFilter solr.xml found in ZooKeeper. Loading...
   [junit4]   2> 425360 INFO  (jetty-launcher-2079-thread-3) [     ] o.a.s.h.c.HttpShardHandlerFactory Host whitelist initialized: WhitelistHostChecker [whitelistHosts=null, whitelistHostCheckingEnabled=true]
   [junit4]   2> 425415 WARN  (jetty-launcher-2079-thread-3) [     ] o.e.j.u.s.S.config Trusting all certificates configured for Client@525eab3f[provider=null,keyStore=null,trustStore=null]
   [junit4]   2> 425415 WARN  (jetty-launcher-2079-thread-3) [     ] o.e.j.u.s.S.config No Client EndPointIdentificationAlgorithm configured for Client@525eab3f[provider=null,keyStore=null,trustStore=null]
   [junit4]   2> 425418 WARN  (jetty-launcher-2079-thread-3) [     ] o.e.j.u.s.S.config Trusting all certificates configured for Client@7f482069[provider=null,keyStore=null,trustStore=null]
   [junit4]   2> 425418 WARN  (jetty-launcher-2079-thread-3) [     ] o.e.j.u.s.S.config No Client EndPointIdentificationAlgorithm configured for Client@7f482069[provider=null,keyStore=null,trustStore=null]
   [junit4]   2> 425451 INFO  (jetty-launcher-2079-thread-3) [     ] o.a.s.c.ZkContainer Zookeeper client=127.0.0.1:35891/solr
   [junit4]   2> 425468 INFO  (jetty-launcher-2079-thread-3) [     ] o.a.s.c.c.ConnectionManager Waiting for client to connect to ZooKeeper
   [junit4]   2> 425504 INFO  (zkConnectionManagerCallback-2097-thread-1) [     ] o.a.s.c.c.ConnectionManager zkClient has connected
   [junit4]   2> 425504 INFO  (jetty-launcher-2079-thread-3) [     ] o.a.s.c.c.ConnectionManager Client is connected to ZooKeeper
   [junit4]   2> 425650 INFO  (jetty-launcher-2079-thread-3) [n:127.0.0.1:40940_solr     ] o.a.s.c.c.ConnectionManager Waiting for client to connect to ZooKeeper
   [junit4]   2> 425670 INFO  (zkConnectionManagerCallback-2099-thread-1) [     ] o.a.s.c.c.ConnectionManager zkClient has connected
   [junit4]   2> 425670 INFO  (jetty-launcher-2079-thread-3) [n:127.0.0.1:40940_solr     ] o.a.s.c.c.ConnectionManager Client is connected to ZooKeeper
   [junit4]   2> 425808 INFO  (jetty-launcher-2079-thread-4) [     ] o.a.s.h.c.HttpShardHandlerFactory Host whitelist initialized: WhitelistHostChecker [whitelistHosts=null, whitelistHostCheckingEnabled=true]
   [junit4]   2> 425809 WARN  (jetty-launcher-2079-thread-4) [     ] o.e.j.u.s.S.config Trusting all certificates configured for Client@716621aa[provider=null,keyStore=null,trustStore=null]
   [junit4]   2> 425809 WARN  (jetty-launcher-2079-thread-4) [     ] o.e.j.u.s.S.config No Client EndPointIdentificationAlgorithm configured for Client@716621aa[provider=null,keyStore=null,trustStore=null]
   [junit4]   2> 425824 WARN  (jetty-launcher-2079-thread-4) [     ] o.e.j.u.s.S.config Trusting all certificates configured for Client@56b71fe4[provider=null,keyStore=null,trustStore=null]
   [junit4]   2> 425824 WARN  (jetty-launcher-2079-thread-4) [     ] o.e.j.u.s.S.config No Client EndPointIdentificationAlgorithm configured for Client@56b71fe4[provider=null,keyStore=null,trustStore=null]
   [junit4]   2> 425825 INFO  (jetty-launcher-2079-thread-4) [     ] o.a.s.c.ZkContainer Zookeeper client=127.0.0.1:35891/solr
   [junit4]   2> 425826 INFO  (jetty-launcher-2079-thread-4) [     ] o.a.s.c.c.ConnectionManager Waiting for client to connect to ZooKeeper
   [junit4]   2> 425869 INFO  (zkConnectionManagerCallback-2107-thread-1) [     ] o.a.s.c.c.ConnectionManager zkClient has connected
   [junit4]   2> 425881 INFO  (jetty-launcher-2079-thread-4) [     ] o.a.s.c.c.ConnectionManager Client is connected to ZooKeeper
   [junit4]   2> 425923 INFO  (jetty-launcher-2079-thread-1) [     ] o.a.s.h.c.HttpShardHandlerFactory Host whitelist initialized: WhitelistHostChecker [whitelistHosts=null, whitelistHostCheckingEnabled=true]
   [junit4]   2> 425924 WARN  (jetty-launcher-2079-thread-1) [     ] o.e.j.u.s.S.config Trusting all certificates configured for Client@250bfad5[provider=null,keyStore=null,trustStore=null]
   [junit4]   2> 425924 WARN  (jetty-launcher-2079-thread-1) [     ] o.e.j.u.s.S.config No Client EndPointIdentificationAlgorithm configured for Client@250bfad5[provider=null,keyStore=null,trustStore=null]
   [junit4]   2> 425927 WARN  (jetty-launcher-2079-thread-1) [     ] o.e.j.u.s.S.config Trusting all certificates configured for Client@119eadc6[provider=null,keyStore=null,trustStore=null]
   [junit4]   2> 425927 WARN  (jetty-launcher-2079-thread-1) [     ] o.e.j.u.s.S.config No Client EndPointIdentificationAlgorithm configured for Client@119eadc6[provider=null,keyStore=null,trustStore=null]
   [junit4]   2> 425928 INFO  (jetty-launcher-2079-thread-1) [     ] o.a.s.c.ZkContainer Zookeeper client=127.0.0.1:35891/solr
   [junit4]   2> 425929 INFO  (jetty-launcher-2079-thread-1) [     ] o.a.s.c.c.ConnectionManager Waiting for client to connect to ZooKeeper
   [junit4]   2> 426006 INFO  (zkConnectionManagerCallback-2113-thread-1) [     ] o.a.s.c.c.ConnectionManager zkClient has connected
   [junit4]   2> 426006 INFO  (jetty-launcher-2079-thread-1) [     ] o.a.s.c.c.ConnectionManager Client is connected to ZooKeeper
   [junit4]   2> 426082 INFO  (jetty-launcher-2079-thread-4) [n:127.0.0.1:41006_solr     ] o.a.s.c.c.ConnectionManager Waiting for client to connect to ZooKeeper
   [junit4]   2> 426086 INFO  (zkConnectionManagerCallback-2115-thread-1) [     ] o.a.s.c.c.ConnectionManager zkClient has connected
   [junit4]   2> 426087 INFO  (jetty-launcher-2079-thread-4) [n:127.0.0.1:41006_solr     ] o.a.s.c.c.ConnectionManager Client is connected to ZooKeeper
   [junit4]   2> 426136 INFO  (jetty-launcher-2079-thread-1) [n:127.0.0.1:42471_solr     ] o.a.s.c.c.ConnectionManager Waiting for client to connect to ZooKeeper
   [junit4]   2> 426152 DEBUG (jetty-launcher-2079-thread-4) [n:127.0.0.1:41006_solr     ] o.a.s.c.c.ZkStateReader Updating cluster state from ZooKeeper... 
   [junit4]   2> 426157 DEBUG (jetty-launcher-2079-thread-4) [n:127.0.0.1:41006_solr     ] o.a.s.c.c.ZkStateReader Loaded empty cluster properties
   [junit4]   2> 426157 DEBUG (jetty-launcher-2079-thread-4) [n:127.0.0.1:41006_solr     ] o.a.s.c.c.ZkStateReader Updated live nodes from ZooKeeper... [] -> []
   [junit4]   2> 426158 DEBUG (jetty-launcher-2079-thread-4) [n:127.0.0.1:41006_solr     ] o.a.s.c.c.ZkStateReader clusterStateSet: legacy [0] interesting [0] watched [0] lazy [0] total [0]
   [junit4]   2> 426180 INFO  (jetty-launcher-2079-thread-4) [n:127.0.0.1:41006_solr     ] o.a.s.c.OverseerElectionContext I am going to be the leader 127.0.0.1:41006_solr
   [junit4]   2> 426180 INFO  (jetty-launcher-2079-thread-4) [n:127.0.0.1:41006_solr     ] o.a.s.c.Overseer Overseer (id=75217684282081291-127.0.0.1:41006_solr-n_0000000000) starting
   [junit4]   2> 426209 INFO  (zkConnectionManagerCallback-2117-thread-1) [     ] o.a.s.c.c.ConnectionManager zkClient has connected
   [junit4]   2> 426209 INFO  (jetty-launcher-2079-thread-1) [n:127.0.0.1:42471_solr     ] o.a.s.c.c.ConnectionManager Client is connected to ZooKeeper
   [junit4]   2> 426318 INFO  (jetty-launcher-2079-thread-4) [n:127.0.0.1:41006_solr     ] o.a.s.c.c.ConnectionManager Waiting for client to connect to ZooKeeper
   [junit4]   2> 426334 INFO  (zkConnectionManagerCallback-2124-thread-1) [     ] o.a.s.c.c.ConnectionManager zkClient has connected
   [junit4]   2> 426334 INFO  (jetty-launcher-2079-thread-4) [n:127.0.0.1:41006_solr     ] o.a.s.c.c.ConnectionManager Client is connected to ZooKeeper
   [junit4]   2> 426335 DEBUG (jetty-launcher-2079-thread-4) [n:127.0.0.1:41006_solr     ] o.a.s.c.c.ZkStateReader Updating cluster state from ZooKeeper... 
   [junit4]   2> 426344 DEBUG (jetty-launcher-2079-thread-4) [n:127.0.0.1:41006_solr     ] o.a.s.c.c.ZkStateReader Loaded empty cluster properties
   [junit4]   2> 426375 DEBUG (jetty-launcher-2079-thread-4) [n:127.0.0.1:41006_solr     ] o.a.s.c.c.ZkStateReader Updated live nodes from ZooKeeper... [] -> []
   [junit4]   2> 426376 DEBUG (jetty-launcher-2079-thread-1) [n:127.0.0.1:42471_solr     ] o.a.s.c.c.ZkStateReader Updating cluster state from ZooKeeper... 
   [junit4]   2> 426377 DEBUG (jetty-launcher-2079-thread-1) [n:127.0.0.1:42471_solr     ] o.a.s.c.c.ZkStateReader Loaded empty cluster properties
   [junit4]   2> 426379 DEBUG (jetty-launcher-2079-thread-1) [n:127.0.0.1:42471_solr     ] o.a.s.c.c.ZkStateReader Updated live nodes from ZooKeeper... [] -> []
   [junit4]   2> 426411 INFO  (jetty-launcher-2079-thread-2) [     ] o.a.s.h.c.HttpShardHandlerFactory Host whitelist initialized: WhitelistHostChecker [whitelistHosts=null, whitelistHostCheckingEnabled=true]
   [junit4]   2> 426428 DEBUG (jetty-launcher-2079-thread-4) [n:127.0.0.1:41006_solr     ] o.a.s.c.c.ZkStateReader clusterStateSet: legacy [0] interesting [0] watched [0] lazy [0] total [0]
   [junit4]   2> 426428 WARN  (jetty-launcher-2079-thread-2) [     ] o.e.j.u.s.S.config Trusting all certificates configured for Client@3fb65aee[provider=null,keyStore=null,trustStore=null]
   [junit4]   2> 426428 WARN  (jetty-launcher-2079-thread-2) [     ] o.e.j.u.s.S.config No Client EndPointIdentificationAlgorithm configured for Client@3fb65aee[provider=null,keyStore=null,trustStore=null]
   [junit4]   2> 426428 INFO  (jetty-launcher-2079-thread-4) [n:127.0.0.1:41006_solr     ] o.a.s.c.s.i.ZkClientClusterStateProvider Cluster at 127.0.0.1:35891/solr ready
   [junit4]   2> 426429 DEBUG (jetty-launcher-2079-thread-1) [n:127.0.0.1:42471_solr     ] o.a.s.c.c.ZkStateReader clusterStateSet: legacy [0] interesting [0] watched [0] lazy [0] total [0]
   [junit4]   2> 426430 INFO  (OverseerStateUpdate-75217684282081291-127.0.0.1:41006_solr-n_0000000000) [n:127.0.0.1:41006_solr     ] o.a.s.c.Overseer Starting to work on the main queue : 127.0.0.1:41006_solr
   [junit4]   2> 426430 INFO  (jetty-launcher-2079-thread-4) [n:127.0.0.1:41006_solr     ] o.a.s.c.ZkController Register node as live in ZooKeeper:/live_nodes/127.0.0.1:41006_solr
   [junit4]   2> 426431 DEBUG (OverseerStateUpdate-75217684282081291-127.0.0.1:41006_solr-n_0000000000) [n:127.0.0.1:41006_solr     ] o.a.s.c.c.ZkStateReader Updated live nodes from ZooKeeper... [] -> []
   [junit4]   2> 426444 DEBUG (OverseerStateUpdate-75217684282081291-127.0.0.1:41006_solr-n_0000000000) [n:127.0.0.1:41006_solr     ] o.a.s.c.c.ZkStateReader clusterStateSet: legacy [0] interesting [0] watched [0] lazy [0] total [0]
   [junit4]   2> 426477 WARN  (jetty-launcher-2079-thread-2) [     ] o.e.j.u.s.S.config Trusting all certificates configured for Client@16c9c224[provider=null,keyStore=null,trustStore=null]
   [junit4]   2> 426477 WARN  (jetty-launcher-2079-thread-2) [     ] o.e.j.u.s.S.config No Client EndPointIdentificationAlgorithm configured for Client@16c9c224[provider=null,keyStore=null,trustStore=null]
   [junit4]   2> 426482 DEBUG (zkCallback-2116-thread-1) [     ] o.a.s.c.c.ZkStateReader A live node change: [WatchedEvent state:SyncConnected type:NodeChildrenChanged path:/live_nodes], has occurred - updating... (live nodes size: [0])
   [junit4]   2> 426482 DEBUG (zkCallback-2114-thread-1) [     ] o.a.s.c.c.ZkStateReader A live node change: [WatchedEvent state:SyncConnected type:NodeChildrenChanged path:/live_nodes], has occurred - updating... (live nodes size: [0])
   [junit4]   2> 426482 DEBUG (zkCallback-2123-thread-1) [     ] o.a.s.c.c.ZkStateReader A live node change: [WatchedEvent state:SyncConnected type:NodeChildrenChanged path:/live_nodes], has occurred - updating... (live nodes size: [0])
   [junit4]   2> 426493 INFO  (jetty-launcher-2079-thread-2) [     ] o.a.s.c.ZkContainer Zookeeper client=127.0.0.1:35891/solr
   [junit4]   2> 426497 INFO  (zkCallback-2123-thread-1) [     ] o.a.s.c.c.ZkStateReader Updated live nodes from ZooKeeper... (0) -> (1)
   [junit4]   2> 426497 DEBUG (zkCallback-2123-thread-1) [     ] o.a.s.c.c.ZkStateReader Updated live nodes from ZooKeeper... [] -> [127.0.0.1:41006_solr]
   [junit4]   2> 426497 INFO  (zkCallback-2116-thread-1) [     ] o.a.s.c.c.ZkStateReader Updated live nodes from ZooKeeper... (0) -> (1)
   [junit4]   2> 426497 DEBUG (zkCallback-2116-thread-1) [     ] o.a.s.c.c.ZkStateReader Updated live nodes from ZooKeeper... [] -> [127.0.0.1:41006_solr]
   [junit4]   2> 426497 INFO  (zkCallback-2114-thread-1) [     ] o.a.s.c.c.ZkStateReader Updated live nodes from ZooKeeper... (0) -> (1)
   [junit4]   2> 426497 DEBUG (zkCallback-2114-thread-1) [     ] o.a.s.c.c.ZkStateReader Updated live nodes from ZooKeeper... [] -> [127.0.0.1:41006_solr]
   [junit4]   2> 426504 INFO  (jetty-launcher-2079-thread-4) [n:127.0.0.1:41006_solr     ] o.a.s.c.LibListener clusterprops.json changed , version -1
   [junit4]   2> 426515 INFO  (jetty-launcher-2079-thread-1) [n:127.0.0.1:42471_solr     ] o.a.s.c.ZkController Publish node=127.0.0.1:42471_solr as DOWN
   [junit4]   2> 426516 INFO  (jetty-launcher-2079-thread-1) [n:127.0.0.1:42471_solr     ] o.a.s.c.TransientSolrCoreCacheDefault Allocating transient cache for 2147483647 transient cores
   [junit4]   2> 426516 INFO  (jetty-launcher-2079-thread-1) [n:127.0.0.1:42471_solr     ] o.a.s.c.ZkController Register node as live in ZooKeeper:/live_nodes/127.0.0.1:42471_solr
   [junit4]   2> 426521 DEBUG (jetty-launcher-2079-thread-3) [n:127.0.0.1:40940_solr     ] o.a.s.c.c.ZkStateReader Updating cluster state from ZooKeeper... 
   [junit4]   2> 426528 DEBUG (jetty-launcher-2079-thread-3) [n:127.0.0.1:40940_solr     ] o.a.s.c.c.ZkStateReader Loaded empty cluster properties
   [junit4]   2> 426545 INFO  (jetty-launcher-2079-thread-2) [     ] o.a.s.c.c.ConnectionManager Waiting for client to connect to ZooKeeper
   [junit4]   2> 426545 INFO  (jetty-launcher-2079-thread-3) [n:127.0.0.1:40940_solr     ] o.a.s.c.c.ZkStateReader Updated live nodes from ZooKeeper... (0) -> (2)
   [junit4]   2> 426545 DEBUG (jetty-launcher-2079-thread-3) [n:127.0.0.1:40940_solr     ] o.a.s.c.c.ZkStateReader Updated live nodes from ZooKeeper... [] -> [127.0.0.1:41006_solr, 127.0.0.1:42471_solr]
   [junit4]   2> 426546 DEBUG (zkCallback-2116-thread-1) [     ] o.a.s.c.c.ZkStateReader A live node change: [WatchedEvent state:SyncConnected type:NodeChildrenChanged path:/live_nodes], has occurred - updating... (live nodes size: [1])
   [junit4]   2> 426546 DEBUG (zkCallback-2123-thread-1) [     ] o.a.s.c.c.ZkStateReader A live node change: [WatchedEvent state:SyncConnected type:NodeChildrenChanged path:/live_nodes], has occurred - updating... (live nodes size: [1])
   [junit4]   2> 426546 DEBUG (jetty-launcher-2079-thread-3) [n:127.0.0.1:40940_solr     ] o.a.s.c.c.ZkStateReader clusterStateSet: legacy [0] interesting [0] watched [0] lazy [0] total [0]
   [junit4]   2> 426546 INFO  (zkCallback-2123-thread-1) [     ] o.a.s.c.c.ZkStateReader Updated live nodes from ZooKeeper... (1) -> (2)
   [junit4]   2> 426546 DEBUG (zkCallback-2123-thread-1) [     ] o.a.s.c.c.ZkStateReader Updated live nodes from ZooKeeper... [127.0.0.1:41006_solr] -> [127.0.0.1:41006_solr, 127.0.0.1:42471_solr]
   [junit4]   2> 426546 DEBUG (zkCallback-2114-thread-2) [     ] o.a.s.c.c.ZkStateReader A live node change: [WatchedEvent state:SyncConnected type:NodeChildrenChanged path:/live_nodes], has occurred - updating... (live nodes size: [1])
   [junit4]   2> 426546 INFO  (zkCallback-2116-thread-1) [     ] o.a.s.c.c.ZkStateReader Updated live nodes from ZooKeeper... (1) -> (2)
   [junit4]   2> 426546 DEBUG (zkCallback-2116-thread-1) [     ] o.a.s.c.c.ZkStateReader Updated live nodes from ZooKeeper... [127.0.0.1:41006_solr] -> [127.0.0.1:41006_solr, 127.0.0.1:42471_solr]
   [junit4]   2> 426547 INFO  (jetty-launcher-2079-thread-1) [n:127.0.0.1:42471_solr     ] o.a.s.c.c.ConnectionManager Waiting for client to connect to ZooKeeper
   [junit4]   2> 426547 INFO  (zkConnectionManagerCallback-2132-thread-1) [     ] o.a.s.c.c.ConnectionManager zkClient has connected
   [junit4]   2> 426548 INFO  (jetty-launcher-2079-thread-2) [     ] o.a.s.c.c.ConnectionManager Client is connected to ZooKeeper
   [junit4]   2> 426585 INFO  (zkCallback-2114-thread-2) [     ] o.a.s.c.c.ZkStateReader Updated live nodes from ZooKeeper... (1) -> (2)
   [junit4]   2> 426585 DEBUG (zkCallback-2114-thread-2) [     ] o.a.s.c.c.ZkStateReader Updated live nodes from ZooKeeper... [127.0.0.1:41006_solr] -> [127.0.0.1:41006_solr, 127.0.0.1:42471_solr]
   [junit4]   2> 426600 INFO  (zkConnectionManagerCallback-2137-thread-1) [     ] o.a.s.c.c.ConnectionManager zkClient has connected
   [junit4]   2> 426600 INFO  (jetty-launcher-2079-thread-1) [n:127.0.0.1:42471_solr     ] o.a.s.c.c.ConnectionManager Client is connected to ZooKeeper
   [junit4]   2> 426601 DEBUG (jetty-launcher-2079-thread-1) [n:127.0.0.1:42471_solr     ] o.a.s.c.c.ZkStateReader Updating cluster state from ZooKeeper... 
   [junit4]   2> 426618 INFO  (jetty-launcher-2079-thread-4) [n:127.0.0.1:41006_solr     ] o.a.s.h.a.MetricsHistoryHandler No .system collection, keeping metrics history in memory.
   [junit4]   2> 426711 INFO  (jetty-launcher-2079-thread-4) [n:127.0.0.1:41006_solr     ] o.a.s.m.r.SolrJmxReporter JMX monitoring for 'solr_41006.solr.node' (registry 'solr.node') enabled at server: com.sun.jmx.mbeanserver.JmxMBeanServer@1d6dcad3
   [junit4]   2> 426748 INFO  (jetty-launcher-2079-thread-2) [n:127.0.0.1:39523_solr     ] o.a.s.c.c.ConnectionManager Waiting for client to connect to ZooKeeper
   [junit4]   2> 426766 INFO  (jetty-launcher-2079-thread-4) [n:127.0.0.1:41006_solr     ] o.a.s.m.r.SolrJmxReporter JMX monitoring for 'solr_41006.solr.jvm' (registry 'solr.jvm') enabled at server: com.sun.jmx.mbeanserver.JmxMBeanServer@1d6dcad3
   [junit4]   2> 426766 INFO  (jetty-launcher-2079-thread-4) [n:127.0.0.1:41006_solr     ] o.a.s.m.r.SolrJmxReporter JMX monitoring for 'solr_41006.solr.jetty' (registry 'solr.jetty') enabled at server: com.sun.jmx.mbeanserver.JmxMBeanServer@1d6dcad3
   [junit4]   2> 426767 INFO  (jetty-launcher-2079-thread-4) [n:127.0.0.1:41006_solr     ] o.a.s.c.CorePropertiesLocator Found 0 core definitions underneath /home/jenkins/jenkins-slave/workspace/Lucene-Solr-Tests-8.x/solr/build/solr-core/test/J0/temp/solr.handler.TestContainerReqHandler_C05E7BAA7922060F-001/tempDir-001/node4/.
   [junit4]   2> 426768 DEBUG (jetty-launcher-2079-thread-1) [n:127.0.0.1:42471_solr     ] o.a.s.c.c.ZkStateReader Loaded empty cluster properties
   [junit4]   2> 426769 INFO  (jetty-launcher-2079-thread-1) [n:127.0.0.1:42471_solr     ] o.a.s.c.c.ZkStateReader Updated live nodes from ZooKeeper... (0) -> (2)
   [junit4]   2> 426769 DEBUG (jetty-launcher-2079-thread-1) [n:127.0.0.1:42471_solr     ] o.a.s.c.c.ZkStateReader Updated live nodes from ZooKeeper... [] -> [127.0.0.1:41006_solr, 127.0.0.1:42471_solr]
   [junit4]   2> 426769 INFO  (jetty-launcher-2079-thread-3) [n:127.0.0.1:40940_solr     ] o.a.s.c.ZkController Publish node=127.0.0.1:40940_solr as DOWN
   [junit4]   2> 426770 DEBUG (jetty-launcher-2079-thread-1) [n:127.0.0.1:42471_solr     ] o.a.s.c.c.ZkStateReader clusterStateSet: legacy [0] interesting [0] watched [0] lazy [0] total [0]
   [junit4]   2> 426771 INFO  (jetty-launcher-2079-thread-3) [n:127.0.0.1:40940_solr     ] o.a.s.c.TransientSolrCoreCacheDefault Allocating transient cache for 2147483647 transient cores
   [junit4]   2> 426771 INFO  (jetty-launcher-2079-thread-3) [n:127.0.0.1:40940_solr     ] o.a.s.c.ZkController Register node as live in ZooKeeper:/live_nodes/127.0.0.1:40940_solr
   [junit4]   2> 426771 INFO  (jetty-launcher-2079-thread-1) [n:127.0.0.1:42471_solr     ] o.a.s.c.s.i.ZkClientClusterStateProvider Cluster at 127.0.0.1:35891/solr ready
   [junit4]   2> 426771 INFO  (jetty-launcher-2079-thread-1) [n:127.0.0.1:42471_solr     ] o.a.s.c.LibListener clusterprops.json changed , version -1
   [junit4]   2> 426774 DEBUG (zkCallback-2116-thread-1) [     ] o.a.s.c.c.ZkStateReader A live node change: [WatchedEvent state:SyncConnected type:NodeChildrenChanged path:/live_nodes], has occurred - updating... (live nodes size: [2])
   [junit4]   2> 426774 DEBUG (zkCallback-2123-thread-1) [     ] o.a.s.c.c.ZkStateReader A live node change: [WatchedEvent state:SyncConnected type:NodeChildrenChanged path:/live_nodes], has occurred - updating... (live nodes size: [2])
   [junit4]   2> 426775 INFO  (zkCallback-2116-thread-1) [     ] o.a.s.c.c.ZkStateReader Updated live nodes from ZooKeeper... (2) -> (3)
   [junit4]   2> 426775 DEBUG (zkCallback-2116-thread-1) [     ] o.a.s.c.c.ZkStateReader Updated live nodes from ZooKeeper... [127.0.0.1:41006_solr, 127.0.0.1:42471_solr] -> [127.0.0.1:40940_solr, 127.0.0.1:41006_solr, 127.0.0.1:42471_solr]
   [junit4]   2> 426775 INFO  (zkCallback-2123-thread-1) [     ] o.a.s.c.c.ZkStateReader Updated live nodes from ZooKeeper... (2) -> (3)
   [junit4]   2> 426775 DEBUG (zkCallback-2123-thread-1) [     ] o.a.s.c.c.ZkStateReader Updated live nodes from ZooKeeper... [127.0.0.1:41006_solr, 127.0.0.1:42471_solr] -> [127.0.0.1:40940_solr, 127.0.0.1:41006_solr, 127.0.0.1:42471_solr]
   [junit4]   2> 426821 INFO  (zkConnectionManagerCallback-2140-thread-1) [     ] o.a.s.c.c.ConnectionManager zkClient has connected
   [junit4]   2> 426821 INFO  (jetty-launcher-2079-thread-2) [n:127.0.0.1:39523_solr     ] o.a.s.c.c.ConnectionManager Client is connected to ZooKeeper
   [junit4]   2> 426849 DEBUG (zkCallback-2098-thread-1) [     ] o.a.s.c.c.ZkStateReader A live node change: [WatchedEvent state:SyncConnected type:NodeChildrenChanged path:/live_nodes], has occurred - updating... (live nodes size: [2])
   [junit4]   2> 426873 DEBUG (zkCallback-2136-thread-1) [     ] o.a.s.c.c.ZkStateReader A live node change: [WatchedEvent state:SyncConnected type:NodeChildrenChanged path:/live_nodes], has occurred - updating... (live nodes size: [2])
   [junit4]   2> 426893 DEBUG (zkCallback-2114-thread-1) [     ] o.a.s.c.c.ZkStateReader A live node change: [WatchedEvent state:SyncConnected type:NodeChildrenChanged path:/live_nodes], has occurred - updating... (live nodes size: [2])
   [junit4]   2> 426910 INFO  (zkCallback-2136-thread-1) [     ] o.a.s.c.c.ZkStateReader Updated live nodes from ZooKeeper... (2) -> (3)
   [junit4]   2> 426910 DEBUG (zkCallback-2136-thread-1) [     ] o.a.s.c.c.ZkStateReader Updated live nodes from ZooKeeper... [127.0.0.1:41006_solr, 127.0.0.1:42471_solr] -> [127.0.0.1:40940_solr, 127.0.0.1:41006_solr, 127.0.0.1:42471_solr]
   [junit4]   2> 426910 INFO  (zkCallback-2098-thread-1) [     ] o.a.s.c.c.ZkStateReader Updated live nodes from ZooKeeper... (2) -> (3)
   [junit4]   2> 426910 DEBUG (zkCallback-2098-thread-1) [     ] o.a.s.c.c.ZkStateReader Updated live nodes from ZooKeeper... [127.0.0.1:41006_solr, 127.0.0.1:42471_solr] -> [127.0.0.1:40940_solr, 127.0.0.1:41006_solr, 127.0.0.1:42471_solr]
   [junit4]   2> 426910 INFO  (zkCallback-2114-thread-1) [     ] o.a.s.c.c.ZkStateReader Updated live nodes from ZooKeeper... (2) -> (3)
   [junit4]   2> 426910 DEBUG (zkCallback-2114-thread-1) [     ] o.a.s.c.c.ZkStateReader Updated live nodes from ZooKeeper... [127.0.0.1:41006_solr, 127.0.0.1:42471_solr] -> [127.0.0.1:40940_solr, 127.0.0.1:41006_solr, 127.0.0.1:42471_solr]
   [junit4]   2> 426911 INFO  (jetty-launcher-2079-thread-1) [n:127.0.0.1:42471_solr     ] o.a.s.h.a.MetricsHistoryHandler No .system collection, keeping metrics history in memory.
   [junit4]   2> 426930 INFO  (jetty-launcher-2079-thread-3) [n:127.0.0.1:40940_solr     ] o.a.s.c.c.ConnectionManager Waiting for client to connect to ZooKeeper
   [junit4]   2> 426961 DEBUG (jetty-launcher-2079-thread-2) [n:127.0.0.1:39523_solr     ] o.a.s.c.c.ZkStateReader Updating cluster state from ZooKeeper... 
   [junit4]   2> 426961 DEBUG (jetty-launcher-2079-thread-2) [n:127.0.0.1:39523_solr     ] o.a.s.c.c.ZkStateReader Loaded empty cluster properties
   [junit4]   2> 426962 INFO  (jetty-launcher-2079-thread-2) [n:127.0.0.1:39523_solr     ] o.a.s.c.c.ZkStateReader Updated live nodes from ZooKeeper... (0) -> (3)
   [junit4]   2> 426962 DEBUG (jetty-launcher-2079-thread-2) [n:127.0.0.1:39523_solr     ] o.a.s.c.c.ZkStateReader Updated live nodes from ZooKeeper... [] -> [127.0.0.1:40940_solr, 127.0.0.1:41006_solr, 127.0.0.1:42471_solr]
   [junit4]   2> 426975 DEBUG (jetty-launcher-2079-thread-2) [n:127.0.0.1:39523_solr     ] o.a.s.c.c.ZkStateReader clusterStateSet: legacy [0] interesting [0] watched [0] lazy [0] total [0]
   [junit4]   2> 426992 INFO  (jetty-launcher-2079-thread-2) [n:127.0.0.1:39523_solr     ] o.a.s.c.ZkController Publish node=127.0.0.1:39523_solr as DOWN
   [junit4]   2> 426993 INFO  (jetty-launcher-2079-thread-2) [n:127.0.0.1:39523_solr     ] o.a.s.c.TransientSolrCoreCacheDefault Allocating transient cache for 2147483647 transient cores
   [junit4]   2> 426993 INFO  (jetty-launcher-2079-thread-2) [n:127.0.0.1:39523_solr     ] o.a.s.c.ZkController Register node as live in ZooKeeper:/live_nodes/127.0.0.1:39523_solr
   [junit4]   2> 427023 INFO  (zkConnectionManagerCallback-2146-thread-1) [     ] o.a.s.c.c.ConnectionManager zkClient has connected
   [junit4]   2> 427023 INFO  (jetty-launcher-2079-thread-3) [n:127.0.0.1:40940_solr     ] o.a.s.c.c.ConnectionManager Client is connected to ZooKeeper
   [junit4]   2> 427023 DEBUG (jetty-launcher-2079-thread-3) [n:127.0.0.1:40940_solr     ] o.a.s.c.c.ZkStateReader Updating cluster state from ZooKeeper... 
   [junit4]   2> 427024 DEBUG (zkCallback-2123-thread-1) [     ] o.a.s.c.c.ZkStateReader A live node change: [WatchedEvent state:SyncConnected type:NodeChildrenChanged path:/live_nodes], has occurred - updating... (live nodes size: [3])
   [junit4]   2> 427024 DEBUG (zkCallback-2114-thread-1) [     ] o.a.s.c.c.ZkStateReader A live node change: [WatchedEvent state:SyncConnected type:NodeChildrenChanged path:/live_nodes], has occurred - updating... (live nodes size: [3])
   [junit4]   2> 427024 DEBUG (zkCallback-2136-thread-1) [     ] o.a.s.c.c.ZkStateReader A live node change: [WatchedEvent state:SyncConnected type:NodeChildrenChanged path:/live_nodes], has occurred - updating... (live nodes size: [3])
   [junit4]   2> 427024 DEBUG (zkCallback-2116-thread-1) [     ] o.a.s.c.c.ZkStateReader A live node change: [WatchedEvent state:SyncConnected type:NodeChildrenChanged path:/live_nodes], has occurred - updating... (live nodes size: [3])
   [junit4]   2> 427039 DEBUG (zkCallback-2098-thread-1) [     ] o.a.s.c.c.ZkStateReader A live node change: [WatchedEvent state:SyncConnected type:NodeChildrenChanged path:/live_nodes], has occurred - updating... (live nodes size: [3])
   [junit4]   2> 427040 INFO  (zkCallback-2116-thread-1) [     ] o.a.s.c.c.ZkStateReader Updated live nodes from ZooKeeper... (3) -> (4)
   [junit4]   2> 427040 DEBUG (zkCallback-2116-thread-1) [     ] o.a.s.c.c.ZkStateReader Updated live nodes from ZooKeeper... [127.0.0.1:40940_solr, 127.0.0.1:41006_solr, 127.0.0.1:42471_solr] -> [127.0.0.1:39523_solr, 127.0.0.1:40940_solr, 127.0.0.1:41006_solr, 127.0.0.1:42471_solr]
   [junit4]   2> 427040 INFO  (zkCallback-2136-thread-1) [     ] o.a.s.c.c.ZkStateReader Updated live nodes from ZooKeeper... (3) -> (4)
   [junit4]   2> 427040 DEBUG (zkCallback-2136-thread-1) [     ] o.a.s.c.c.ZkStateReader Updated live nodes from ZooKeeper... [127.0.0.1:40940_solr, 127.0.0.1:41006_solr, 127.0.0.1:42471_solr] -> [127.0.0.1:39523_solr, 127.0.0.1:40940_solr, 127.0.0.1:41006_solr, 127.0.0.1:42471_solr]
   [junit4]   2> 427040 INFO  (zkCallback-2114-thread-1) [     ] o.a.s.c.c.ZkStateReader Updated live nodes from ZooKeeper... (3) -> (4)
   [junit4]   2> 427040 DEBUG (zkCallback-2114-thread-1) [     ] o.a.s.c.c.ZkStateReader Updated live nodes from ZooKeeper... [127.0.0.1:40940_solr, 127.0.0.1:41006_solr, 127.0.0.1:42471_solr] -> [127.0.0.1:39523_solr, 127.0.0.1:40940_solr, 127.0.0.1:41006_solr, 127.0.0.1:42471_solr]
   [junit4]   2> 427040 INFO  (zkCallback-2123-thread-1) [     ] o.a.s.c.c.ZkStateReader Updated live nodes from ZooKeeper... (3) -> (4)
   [junit4]   2> 427040 DEBUG (zkCallback-2123-thread-1) [     ] o.a.s.c.c.ZkStateReader Updated live nodes from ZooKeeper... [127.0.0.1:40940_solr, 127.0.0.1:41006_solr, 127.0.0.1:42471_solr] -> [127.0.0.1:39523_solr, 127.0.0.1:40940_solr, 127.0.0.1:41006_solr, 127.0.0.1:42471_solr]
   [junit4]   2> 427040 DEBUG (jetty-launcher-2079-thread-3) [n:127.0.0.1:40940_solr     ] o.a.s.c.c.ZkStateReader Loaded empty cluster properties
   [junit4]   2> 427041 INFO  (jetty-launcher-2079-thread-3) [n:127.0.0.1:40940_solr     ] o.a.s.c.c.ZkStateReader Updated live nodes from ZooKeeper... (0) -> (4)
   [junit4]   2> 427041 DEBUG (jetty-launcher-2079-thread-3) [n:127.0.0.1:40940_solr     ] o.a.s.c.c.ZkStateReader Updated live nodes from ZooKeeper... [] -> [127.0.0.1:39523_solr, 127.0.0.1:40940_solr, 127.0.0.1:41006_solr, 127.0.0.1:42471_solr]
   [junit4]   2> 427042 DEBUG (jetty-launcher-2079-thread-3) [n:127.0.0.1:40940_solr     ] o.a.s.c.c.ZkStateReader clusterStateSet: legacy [0] interesting [0] watched [0] lazy [0] total [0]
   [junit4]   2> 427042 INFO  (jetty-launcher-2079-thread-3) [n:127.0.0.1:40940_solr     ] o.a.s.c.s.i.ZkClientClusterStateProvider Cluster at 127.0.0.1:35891/solr ready
   [junit4]   2> 427042 INFO  (jetty-launcher-2079-thread-3) [n:127.0.0.1:40940_solr     ] o.a.s.c.LibListener clusterprops.json changed , version -1
   [junit4]   2> 427060 DEBUG (zkCallback-2139-thread-1) [     ] o.a.s.c.c.ZkStateReader A live node change: [WatchedEvent state:SyncConnected type:NodeChildrenChanged path:/live_nodes], has occurred - updating... (live nodes size: [3])
   [junit4]   2> 427066 INFO  (jetty-launcher-2079-thread-1) [n:127.0.0.1:42471_solr     ] o.a.s.m.r.SolrJmxReporter JMX monitoring for 'solr_42471.solr.node' (registry 'solr.node') enabled at server: com.sun.jmx.mbeanserver.JmxMBeanServer@1d6dcad3
   [junit4]   2> 427075 INFO  (zkCallback-2098-thread-1) [     ] o.a.s.c.c.ZkStateReader Updated live nodes from ZooKeeper... (3) -> (4)
   [junit4]   2> 427075 DEBUG (zkCallback-2098-thread-1) [     ] o.a.s.c.c.ZkStateReader Updated live nodes from ZooKeeper... [127.0.0.1:40940_solr, 127.0.0.1:41006_solr, 127.0.0.1:42471_solr] -> [127.0.0.1:39523_solr, 127.0.0.1:40940_solr, 127.0.0.1:41006_solr, 127.0.0.1:42471_solr]
   [junit4]   2> 427096 INFO  (zkCallback-2139-thread-1) [     ] o.a.s.c.c.ZkStateReader Updated live nodes from ZooKeeper... (3) -> (4)
   [junit4]   2> 427096 DEBUG (zkCallback-2139-thread-1) [     ] o.a.s.c.c.ZkStateReader Updated live nodes from ZooKeeper... [127.0.0.1:40940_solr, 127.0.0.1:41006_solr, 127.0.0.1:42471_solr] -> [127.0.0.1:39523_solr, 127.0.0.1:40940_solr, 127.0.0.1:41006_solr, 127.0.0.1:42471_solr]
   [junit4]   2> 427100 INFO  (jetty-launcher-2079-thread-2) [n:127.0.0.1:39523_solr     ] o.a.s.c.c.ConnectionManager Waiting for client to connect to ZooKeeper
   [junit4]   2> 427120 INFO  (zkConnectionManagerCallback-2153-thread-1) [     ] o.a.s.c.c.ConnectionManager zkClient has connected
   [junit4]   2> 427120 INFO  (jetty-launcher-2079-thread-2) [n:127.0.0.1:39523_solr     ] o.a.s.c.c.ConnectionManager Client is connected to ZooKeeper
   [junit4]   2> 427121 DEBUG (jetty-launcher-2079-thread-2) [n:127.0.0.1:39523_solr     ] o.a.s.c.c.ZkStateReader Updating cluster state from ZooKeeper... 
   [junit4]   2> 427170 DEBUG (jetty-launcher-2079-thread-2) [n:127.0.0.1:39523_solr     ] o.a.s.c.c.ZkStateReader Loaded empty cluster properties
   [junit4]   2> 427171 INFO  (jetty-launcher-2079-thread-2) [n:127.0.0.1:39523_solr     ] o.a.s.c.c.ZkStateReader Updated live nodes from ZooKeeper... (0) -> (4)
   [junit4]   2> 427171 DEBUG (jetty-launcher-2079-thread-2) [n:127.0.0.1:39523_solr     ] o.a.s.c.c.ZkStateReader Updated live nodes from ZooKeeper... [] -> [127.0.0.1:39523_solr, 127.0.0.1:40940_solr, 127.0.0.1:41006_solr, 127.0.0.1:42471_solr]
   [junit4]   2> 427171 DEBUG (jetty-launcher-2079-thread-2) [n:127.0.0.1:39523_solr     ] o.a.s.c.c.ZkStateReader clusterStateSet: legacy [0] interesting [0] watched [0] lazy [0] total [0]
   [junit4]   2> 427171 INFO  (jetty-launcher-2079-thread-1) [n:127.0.0.1:42471_solr     ] o.a.s.m.r.SolrJmxReporter JMX monitoring for 'solr_42471.solr.jvm' (registry 'solr.jvm') enabled at server: com.sun.jmx.mbeanserver.JmxMBeanServer@1d6dcad3
   [junit4]   2> 427172 INFO  (jetty-launcher-2079-thread-1) [n:127.0.0.1:42471_solr     ] o.a.s.m.r.SolrJmxReporter JMX monitoring for 'solr_42471.solr.jetty' (registry 'solr.jetty') enabled at server: com.sun.jmx.mbeanserver.JmxMBeanServer@1d6dcad3
   [junit4]   2> 427172 INFO  (jetty-launcher-2079-thread-2) [n:127.0.0.1:39523_solr     ] o.a.s.c.s.i.ZkClientClusterStateProvider Cluster at 127.0.0.1:35891/solr ready
   [junit4]   2> 427172 INFO  (jetty-launcher-2079-thread-2) [n:127.0.0.1:39523_solr     ] o.a.s.c.LibListener clusterprops.json changed , version -1
   [junit4]   2> 427189 INFO  (jetty-launcher-2079-thread-1) [n:127.0.0.1:42471_solr     ] o.a.s.c.CorePropertiesLocator Found 0 core definitions underneath /home/jenkins/jenkins-slave/workspace/Lucene-Solr-Tests-8.x/solr/build/solr-core/test/J0/temp/solr.handler.TestContainerReqHandler_C05E7BAA7922060F-001/tempDir-001/node1/.
   [junit4]   2> 427254 INFO  (jetty-launcher-2079-thread-2) [n:127.0.0.1:39523_solr     ] o.a.s.h.a.MetricsHistoryHandler No .system collection, keeping metrics history in memory.
   [junit4]   2> 427254 INFO  (jetty-launcher-2079-thread-3) [n:127.0.0.1:40940_solr     ] o.a.s.h.a.MetricsHistoryHandler No .system collection, keeping metrics history in memory.
   [junit4]   2> 427502 INFO  (jetty-launcher-2079-thread-2) [n:127.0.0.1:39523_solr     ] o.a.s.m.r.SolrJmxReporter JMX monitoring for 'solr_39523.solr.node' (registry 'solr.node') enabled at server: com.sun.jmx.mbeanserver.JmxMBeanServer@1d6dcad3
   [junit4]   2> 427502 INFO  (jetty-launcher-2079-thread-3) [n:127.0.0.1:40940_solr     ] o.a.s.m.r.SolrJmxReporter JMX monitoring for 'solr_40940.solr.node' (registry 'solr.node') enabled at server: com.sun.jmx.mbeanserver.JmxMBeanServer@1d6dcad3
   [junit4]   2> 427535 INFO  (jetty-launcher-2079-thread-3) [n:127.0.0.1:40940_solr     ] o.a.s.m.r.SolrJmxReporter JMX monitoring for 'solr_40940.solr.jvm' (registry 'solr.jvm') enabled at server: com.sun.jmx.mbeanserver.JmxMBeanServer@1d6dcad3
   [junit4]   2> 427535 INFO  (jetty-launcher-2079-thread-3) [n:127.0.0.1:40940_solr     ] o.a.s.m.r.SolrJmxReporter JMX monitoring for 'solr_40940.solr.jetty' (registry 'solr.jetty') enabled at server: com.sun.jmx.mbeanserver.JmxMBeanServer@1d6dcad3
   [junit4]   2> 427536 INFO  (jetty-launcher-2079-thread-3) [n:127.0.0.1:40940_solr     ] o.a.s.c.CorePropertiesLocator Found 0 core definitions underneath /home/jenkins/jenkins-slave/workspace/Lucene-Solr-Tests-8.x/solr/build/solr-core/test/J0/temp/solr.handler.TestContainerReqHandler_C05E7BAA7922060F-001/tempDir-001/node3/.
   [junit4]   2> 427595 INFO  (jetty-launcher-2079-thread-2) [n:127.0.0.1:39523_solr     ] o.a.s.m.r.SolrJmxReporter JMX monitoring for 'solr_39523.solr.jvm' (registry 'solr.jvm') enabled at server: com.sun.jmx.mbeanserver.JmxMBeanServer@1d6dcad3
   [junit4]   2> 427595 INFO  (jetty-launcher-2079-thread-2) [n:127.0.0.1:39523_solr     ] o.a.s.m.r.SolrJmxReporter JMX monitoring for 'solr_39523.solr.jetty' (registry 'solr.jetty') enabled at server: com.sun.jmx.mbeanserver.JmxMBeanServer@1d6dcad3
   [junit4]   2> 427596 INFO  (jetty-launcher-2079-thread-2) [n:127.0.0.1:39523_solr     ] o.a.s.c.CorePropertiesLocator Found 0 core definitions underneath /home/jenkins/jenkins-slave/workspace/Lucene-Solr-Tests-8.x/solr/build/solr-core/test/J0/temp/solr.handler.TestContainerReqHandler_C05E7BAA7922060F-001/tempDir-001/node2/.
   [junit4]   2> 427854 INFO  (TEST-TestContainerReqHandler.testPluginGlobalLoader-seed#[C05E7BAA7922060F]) [     ] o.a.s.c.c.ConnectionManager Waiting for client to connect to ZooKeeper
   [junit4]   2> 427878 INFO  (zkConnectionManagerCallback-2160-thread-1) [     ] o.a.s.c.c.ConnectionManager zkClient has connected
   [junit4]   2> 427878 INFO  (TEST-TestContainerReqHandler.testPluginGlobalLoader-seed#[C05E7BAA7922060F]) [     ] o.a.s.c.c.ConnectionManager Client is connected to ZooKeeper
   [junit4]   2> 427879 DEBUG (TEST-TestContainerReqHandler.testPluginGlobalLoader-seed#[C05E7BAA7922060F]) [     ] o.a.s.c.c.ZkStateReader Updating cluster state from ZooKeeper... 
   [junit4]   2> 427879 DEBUG (TEST-TestContainerReqHandler.testPluginGlobalLoader-seed#[C05E7BAA7922060F]) [     ] o.a.s.c.c.ZkStateReader Loaded empty cluster properties
   [junit4]   2> 427880 INFO  (TEST-TestContainerReqHandler.testPluginGlobalLoader-seed#[C05E7BAA7922060F]) [     ] o.a.s.c.c.ZkStateReader Updated live nodes from ZooKeeper... (0) -> (4)
   [junit4]   2> 427880 DEBUG (TEST-TestContainerReqHandler.testPluginGlobalLoader-seed#[C05E7BAA7922060F]) [     ] o.a.s.c.c.ZkStateReader Updated live nodes from ZooKeeper... [] -> [127.0.0.1:39523_solr, 127.0.0.1:40940_solr, 127.0.0.1:41006_solr, 127.0.0.1:42471_solr]
   [junit4]   2> 427881 DEBUG (TEST-TestContainerReqHandler.testPluginGlobalLoader-seed#[C05E7BAA7922060F]) [     ] o.a.s.c.c.ZkStateReader clusterStateSet: legacy [0] interesting [0] watched [0] lazy [0] total [0]
   [junit4]   2> 427881 INFO  (TEST-TestContainerReqHandler.testPluginGlobalLoader-seed#[C05E7BAA7922060F]) [     ] o.a.s.c.s.i.ZkClientClusterStateProvider Cluster at 127.0.0.1:35891/solr ready
   [junit4]   2> 427886 INFO  (qtp1671657790-5546) [n:127.0.0.1:41006_solr     ] o.a.s.h.a.CollectionsHandler Invoked Collection Action :create with params collection.configName=conf&maxShardsPerNode=100&name=globalLoaderColl&nrtReplicas=1&action=CREATE&numShards=2&wt=javabin&version=2 and sendToOCPQueue=true
   [junit4]   2> 427948 INFO  (OverseerThreadFactory-1142-thread-1-processing-n:127.0.0.1:41006_solr) [n:127.0.0.1:41006_solr     ] o.a.s.c.a.c.CreateCollectionCmd Create collection globalLoaderColl
   [junit4]   2> 427949 DEBUG (zkCallback-2114-thread-1) [     ] o.a.s.c.c.ZkStateReader A collections change: [WatchedEvent state:SyncConnected type:NodeChildrenChanged path:/collections], has occurred - updating...
   [junit4]   2> 427949 DEBUG (zkCallback-2136-thread-1) [     ] o.a.s.c.c.ZkStateReader A collections change: [WatchedEvent state:SyncConnected type:NodeChildrenChanged path:/collections], has occurred - updating...
   [junit4]   2> 427949 DEBUG (zkCallback-2098-thread-1) [     ] o.a.s.c.c.ZkStateReader A collections change: [WatchedEvent state:SyncConnected type:NodeChildrenChanged path:/collections], has occurred - updating...
   [junit4]   2> 427949 DEBUG (zkCallback-2123-thread-1) [     ] o.a.s.c.c.ZkStateReader A collections change: [WatchedEvent state:SyncConnected type:NodeChildrenChanged path:/collections], has occurred - updating...
   [junit4]   2> 427949 DEBUG (zkCallback-2116-thread-1) [     ] o.a.s.c.c.ZkStateReader A collections change: [WatchedEvent state:SyncConnected type:NodeChildrenChanged path:/collections], has occurred - updating...
   [junit4]   2> 427950 DEBUG (zkCallback-2123-thread-1) [     ] o.a.s.c.c.ZkStateReader clusterStateSet: legacy [0] interesting [0] watched [0] lazy [1] total [1]
   [junit4]   2> 427950 DEBUG (zkCallback-2098-thread-1) [     ] o.a.s.c.c.ZkStateReader clusterStateSet: legacy [0] interesting [0] watched [0] lazy [1] total [1]
   [junit4]   2> 427950 DEBUG (zkCallback-2114-thread-1) [     ] o.a.s.c.c.ZkStateReader clusterStateSet: legacy [0] interesting [0] watched [0] lazy [1] total [1]
   [junit4]   2> 427950 DEBUG (zkCallback-2136-thread-1) [     ] o.a.s.c.c.ZkStateReader clusterStateSet: legacy [0] interesting [0] watched [0] lazy [1] total [1]
   [junit4]   2> 427950 DEBUG (zkCallback-2116-thread-1) [     ] o.a.s.c.c.ZkStateReader clusterStateSet: legacy [0] interesting [0] watched [0] lazy [1] total [1]
   [junit4]   2> 427950 DEBUG (zkCallback-2139-thread-1) [     ] o.a.s.c.c.ZkStateReader A collections change: [WatchedEvent state:SyncConnected type:NodeChildrenChanged path:/collections], has occurred - updating...
   [junit4]   2> 427950 DEBUG (zkCallback-2145-thread-1) [     ] o.a.s.c.c.ZkStateReader A collections change: [WatchedEvent state:SyncConnected type:NodeChildrenChanged path:/collections], has occurred - updating...
   [junit4]   2> 427950 DEBUG (zkCallback-2139-thread-1) [     ] o.a.s.c.c.ZkStateReader clusterStateSet: legacy [0] interesting [0] watched [0] lazy [1] total [1]
   [junit4]   2> 427950 DEBUG (zkCallback-2159-thread-1) [     ] o.a.s.c.c.ZkStateReader A collections change: [WatchedEvent state:SyncConnected type:NodeChildrenChanged path:/collections], has occurred - updating...
   [junit4]   2> 427951 DEBUG (zkCallback-2159-thread-1) [     ] o.a.s.c.c.ZkStateReader clusterStateSet: legacy [0] interesting [0] watched [0] lazy [1] total [1]
   [junit4]   2> 427963 DEBUG (zkCallback-2152-thread-1) [     ] o.a.s.c.c.ZkStateReader A collections change: [WatchedEvent state:SyncConnected type:NodeChildrenChanged path:/collections], has occurred - updating...
   [junit4]   2> 428101 DEBUG (zkCallback-2152-thread-1) [     ] o.a.s.c.c.ZkStateReader clusterStateSet: legacy [0] interesting [0] watched [0] lazy [1] total [1]
   [junit4]   2> 428106 DEBUG (zkCallback-2145-thread-1) [     ] o.a.s.c.c.ZkStateReader clusterStateSet: legacy [0] interesting [0] watched [0] lazy [1] total [1]
   [junit4]   2> 428114 INFO  (OverseerStateUpdate-75217684282081291-127.0.0.1:41006_solr-n_0000000000) [n:127.0.0.1:41006_solr     ] o.a.s.c.o.SliceMutator createReplica() {
   [junit4]   2>   "operation":"ADDREPLICA",
   [junit4]   2>   "collection":"globalLoaderColl",
   [junit4]   2>   "shard":"shard1",
   [junit4]   2>   "core":"globalLoaderColl_shard1_replica_n1",
   [junit4]   2>   "state":"down",
   [junit4]   2>   "base_url":"http://127.0.0.1:40940/solr",
   [junit4]   2>   "type":"NRT",
   [junit4]   2>   "waitForFinalState":"false"} 
   [junit4]   2> 428116 INFO  (OverseerStateUpdate-75217684282081291-127.0.0.1:41006_solr-n_0000000000) [n:127.0.0.1:41006_solr     ] o.a.s.c.o.SliceMutator createReplica() {
   [junit4]   2>   "operation":"ADDREPLICA",
   [junit4]   2>   "collection":"globalLoaderColl",
   [junit4]   2>   "shard":"shard2",
   [junit4]   2>   "core":"globalLoaderColl_shard2_replica_n2",
   [junit4]   2>   "state":"down",
   [junit4]   2>   "base_url":"http://127.0.0.1:42471/solr",
   [junit4]   2>   "type":"NRT",
   [junit4]   2>   "waitForFinalState":"false"} 
   [junit4]   2> 428331 INFO  (qtp2132997662-5543) [n:127.0.0.1:40940_solr    x:globalLoaderColl_shard1_replica_n1 ] o.a.s.h.a.CoreAdminOperation core create command qt=/admin/cores&coreNodeName=core_node3&collection.configName=conf&newCollection=true&name=globalLoaderColl_shard1_replica_n1&action=CREATE&numShards=2&collection=globalLoaderColl&shard=shard1&wt=javabin&version=2&replicaType=NRT
   [junit4]   2> 428340 DEBUG (qtp2132997662-5543) [n:127.0.0.1:40940_solr c:globalLoaderColl s:shard1 r:core_node3 x:globalLoaderColl_shard1_replica_n1 ] o.a.s.c.c.ZkStateReader Add data for [globalLoaderColl] ver [1]
   [junit4]   2> 428340 DEBUG (qtp2132997662-5543) [n:127.0.0.1:40940_solr c:globalLoaderColl s:shard1 r:core_node3 x:globalLoaderColl_shard1_replica_n1 ] o.a.s.c.c.ZkStateReader clusterStateSet: legacy [0] interesting [1] watched [1] lazy [1] total [1]
   [junit4]   2> 428340 DEBUG (qtp2132997662-5543) [n:127.0.0.1:40940_solr c:globalLoaderColl s:shard1 r:core_node3 x:globalLoaderColl_shard1_replica_n1 ] o.a.s.c.c.ZkStateReader clusterStateSet: legacy [0] interesting [0] watched [0] lazy [1] total [1]
   [junit4]   2> 428348 INFO  (qtp64819885-5544) [n:127.0.0.1:42471_solr    x:globalLoaderColl_shard2_replica_n2 ] o.a.s.h.a.CoreAdminOperation core create command qt=/admin/cores&coreNodeName=core_node4&collection.configName=conf&newCollection=true&name=globalLoaderColl_shard2_replica_n2&action=CREATE&numShards=2&collection=globalLoaderColl&shard=shard2&wt=javabin&version=2&replicaType=NRT
   [junit4]   2> 428350 DEBUG (qtp64819885-5544) [n:127.0.0.1:42471_solr c:globalLoaderColl s:shard2 r:core_node4 x:globalLoaderColl_shard2_replica_n2 ] o.a.s.c.c.ZkStateReader Add data for [globalLoaderColl] ver [1]
   [junit4]   2> 428350 DEBUG (qtp64819885-5544) [n:127.0.0.1:42471_solr c:globalLoaderColl s:shard2 r:core_node4 x:globalLoaderColl_shard2_replica_n2 ] o.a.s.c.c.ZkStateReader clusterStateSet: legacy [0] interesting [1] watched [1] lazy [1] total [1]
   [junit4]   2> 428350 DEBUG (qtp64819885-5544) [n:127.0.0.1:42471_solr c:globalLoaderColl s:shard2 r:core_node4 x:globalLoaderColl_shard2_replica_n2 ] o.a.s.c.c.ZkStateReader clusterStateSet: legacy [0] interesting [0] watched [0] lazy [1] total [1]
   [junit4]   2> 428455 DEBUG (zkCallback-2116-thread-1) [     ] o.a.s.c.c.ZkStateReader Uninteresting collection globalLoaderColl
   [junit4]   2> 428455 DEBUG (zkCallback-2098-thread-1) [     ] o.a.s.c.c.ZkStateReader Uninteresting collection globalLoaderColl
   [junit4]   2> 429343 DEBUG (qtp2132997662-5543) [n:127.0.0.1:40940_solr c:globalLoaderColl s:shard1 r:core_node3 x:globalLoaderColl_shard1_replica_n1 ] o.a.s.c.c.ZkStateReader Loading collection config from: [/collections/globalLoaderColl]
   [junit4]   2> 429343 DEBUG (qtp2132997662-5543) [n:127.0.0.1:40940_solr c:globalLoaderColl s:shard1 r:core_node3 x:globalLoaderColl_shard1_replica_n1 ] o.a.s.c.c.ZkStateReader path=[/configs/conf] [configName]=[conf] specified config exists in ZooKeeper
   [junit4]   2> 429357 DEBUG (qtp64819885-5544) [n:127.0.0.1:42471_solr c:globalLoaderColl s:shard2 r:core_node4 x:globalLoaderColl_shard2_replica_n2 ] o.a.s.c.c.ZkStateReader Loading collection config from: [/collections/globalLoaderColl]
   [junit4]   2> 429357 DEBUG (qtp64819885-5544) [n:127.0.0.1:42471_solr c:globalLoaderColl s:shard2 r:core_node4 x:globalLoaderColl_shard2_replica_n2 ] o.a.s.c.c.ZkStateReader path=[/configs/conf] [configName]=[conf] specified config exists in ZooKeeper
   [junit4]   2> 429359 INFO  (qtp2132997662-5543) [n:127.0.0.1:40940_solr c:globalLoaderColl s:shard1 r:core_node3 x:globalLoaderColl_shard1_replica_n1 ] o.a.s.c.SolrConfig Using Lucene MatchVersion: 8.3.0
   [junit4]   2> 429374 INFO  (qtp64819885-5544) [n:127.0.0.1:42471_solr c:globalLoaderColl s:shard2 r:core_node4 x:globalLoaderColl_shard2_replica_n2 ] o.a.s.c.SolrConfig Using Lucene MatchVersion: 8.3.0
   [junit4]   2> 429411 INFO  (qtp2132997662-5543) [n:127.0.0.1:40940_solr c:globalLoaderColl s:shard1 r:core_node3 x:globalLoaderColl_shard1_replica_n1 ] o.a.s.s.IndexSchema [globalLoaderColl_shard1_replica_n1] Schema name=minimal
   [junit4]   2> 429411 INFO  (qtp64819885-5544) [n:127.0.0.1:42471_solr c:globalLoaderColl s:shard2 r:core_node4 x:globalLoaderColl_shard2_replica_n2 ] o.a.s.s.IndexSchema [globalLoaderColl_shard2_replica_n2] Schema name=minimal
   [junit4]   2> 429430 INFO  (qtp64819885-5544) [n:127.0.0.1:42471_solr c:globalLoaderColl s:shard2 r:core_node4 x:globalLoaderColl_shard2_replica_n2 ] o.a.s.s.IndexSchema Loaded schema minimal/1.1 with uniqueid field id
   [junit4]   2> 429430 INFO  (qtp64819885-5544) [n:127.0.0.1:42471_solr c:globalLoaderColl s:shard2 r:core_node4 x:globalLoaderColl_shard2_replica_n2 ] o.a.s.c.CoreContainer Creating SolrCore 'globalLoaderColl_shard2_replica_n2' using configuration from collection globalLoaderColl, trusted=true
   [junit4]   2> 429431 INFO  (qtp64819885-5544) [n:127.0.0.1:42471_solr c:globalLoaderColl s:shard2 r:core_node4 x:globalLoaderColl_shard2_replica_n2 ] o.a.s.m.r.SolrJmxReporter JMX monitoring for 'solr_42471.solr.core.globalLoaderColl.shard2.replica_n2' (registry 'solr.core.globalLoaderColl.shard2.replica_n2') enabled at server: com.sun.jmx.mbeanserver.JmxMBeanServer@1d6dcad3
   [junit4]   2> 429431 INFO  (qtp64819885-5544) [n:127.0.0.1:42471_solr c:globalLoaderColl s:shard2 r:core_node4 x:globalLoaderColl_shard2_replica_n2 ] o.a.s.c.SolrCore [[globalLoaderColl_shard2_replica_n2] ] Opening new SolrCore at [/home/jenkins/jenkins-slave/workspace/Lucene-Solr-Tests-8.x/solr/build/solr-core/test/J0/temp/solr.handler.TestContainerReqHandler_C05E7BAA7922060F-001/tempDir-001/node1/globalLoaderColl_shard2_replica_n2], dataDir=[/home/jenkins/jenkins-slave/workspace/Lucene-Solr-Tests-8.x/solr/build/solr-core/test/J0/temp/solr.handler.TestContainerReqHandler_C05E7BAA7922060F-001/tempDir-001/node1/./globalLoaderColl_shard2_replica_n2/data/]
   [junit4]   2> 429446 INFO  (qtp2132997662-5543) [n:127.0.0.1:40940_solr c:globalLoaderColl s:shard1 r:core_node3 x:globalLoaderColl_shard1_replica_n1 ] o.a.s.s.IndexSchema Loaded schema minimal/1.1 with uniqueid field id
   [junit4]   2> 429446 INFO  (qtp2132997662-5543) [n:127.0.0.1:40940_solr c:globalLoaderColl s:shard1 r:core_node3 x:globalLoaderColl_shard1_replica_n1 ] o.a.s.c.CoreContainer Creating SolrCore 'globalLoaderColl_shard1_replica_n1' using configuration from collection globalLoaderColl, trusted=true
   [junit4]   2> 429446 INFO  (qtp2132997662-5543) [n:127.0.0.1:40940_solr c:globalLoaderColl s:shard1 r:core_node3 x:globalLoaderColl_shard1_replica_n1 ] o.a.s.m.r.SolrJmxReporter JMX monitoring for 'solr_40940.solr.core.globalLoaderColl.shard1.replica_n1' (registry 'solr.core.globalLoaderColl.shard1.replica_n1') enabled at server: com.sun.jmx.mbeanserver.JmxMBeanServer@1d6dcad3
   [junit4]   2> 429446 INFO  (qtp2132997662-5543) [n:127.0.0.1:40940_solr c:globalLoaderColl s:shard1 r:core_node3 x:globalLoaderColl_shard1_replica_n1 ] o.a.s.c.SolrCore [[globalLoaderColl_shard1_replica_n1] ] Opening new SolrCore at [/home/jenkins/jenkins-slave/workspace/Lucene-Solr-Tests-8.x/solr/build/solr-core/test/J0/temp/solr.handler.TestContainerReqHandler_C05E7BAA7922060F-001/tempDir-001/node3/globalLoaderColl_shard1_replica_n1], dataDir=[/home/jenkins/jenkins-slave/workspace/Lucene-Solr-Tests-8.x/solr/build/solr-core/test/J0/temp/solr.handler.TestContainerReqHandler_C05E7BAA7922060F-001/tempDir-001/node3/./globalLoaderColl_shard1_replica_n1/data/]
   [junit4]   2> 429716 INFO  (qtp2132997662-5543) [n:127.0.0.1:40940_solr c:globalLoaderColl s:shard1 r:core_node3 x:globalLoaderColl_shard1_replica_n1 ] o.a.s.u.UpdateHandler Using UpdateLog implementation: org.apache.solr.update.UpdateLog
   [junit4]   2> 429716 INFO  (qtp2132997662-5543) [n:127.0.0.1:40940_solr c:globalLoaderColl s:shard1 r:core_node3 x:globalLoaderColl_shard1_replica_n1 ] o.a.s.u.UpdateLog Initializing UpdateLog: dataDir=null defaultSyncLevel=FLUSH numRecordsToKeep=100 maxNumLogsToKeep=10 numVersionBuckets=65536
   [junit4]   2> 429738 INFO  (qtp2132997662-5543) [n:127.0.0.1:40940_solr c:globalLoaderColl s:shard1 r:core_node3 x:globalLoaderColl_shard1_replica_n1 ] o.a.s.u.CommitTracker Hard AutoCommit: disabled
   [junit4]   2> 429738 INFO  (qtp2132997662-5543) [n:127.0.0.1:40940_solr c:globalLoaderColl s:shard1 r:core_node3 x:globalLoaderColl_shard1_replica_n1 ] o.a.s.u.CommitTracker Soft AutoCommit: disabled
   [junit4]   2> 429739 INFO  (qtp64819885-5544) [n:127.0.0.1:42471_solr c:globalLoaderColl s:shard2 r:core_node4 x:globalLoaderColl_shard2_replica_n2 ] o.a.s.u.UpdateHandler Using UpdateLog implementation: org.apache.solr.update.UpdateLog
   [junit4]   2> 429739 INFO  (qtp64819885-5544) [n:127.0.0.1:42471_solr c:globalLoaderColl s:shard2 r:core_node4 x:globalLoaderColl_shard2_replica_n2 ] o.a.s.u.UpdateLog Initializing UpdateLog: dataDir=null defaultSyncLevel=FLUSH numRecordsToKeep=100 maxNumLogsToKeep=10 numVersionBuckets=65536
   [junit4]   2> 429740 INFO  (qtp2132997662-5543) [n:127.0.0.1:40940_solr c:globalLoaderColl s:shard1 r:core_node3 x:globalLoaderColl_shard1_replica_n1 ] o.a.s.s.SolrIndexSearcher Opening [Searcher@58c99621[globalLoaderColl_shard1_replica_n1] main]
   [junit4]   2> 429740 DEBUG (qtp2132997662-5543) [n:127.0.0.1:40940_solr c:globalLoaderColl s:shard1 r:core_node3 x:globalLoaderColl_shard1_replica_n1 ] o.a.s.c.c.ZkStateReader Loading collection config from: [/collections/globalLoaderColl]
   [junit4]   2> 429740 INFO  (qtp64819885-5544) [n:127.0.0.1:42471_solr c:globalLoaderColl s:shard2 r:core_node4 x:globalLoaderColl_shard2_replica_n2 ] o.a.s.u.CommitTracker Hard AutoCommit: disabled
   [junit4]   2> 429740 INFO  (qtp64819885-5544) [n:127.0.0.1:42471_solr c:globalLoaderColl s:shard2 r:core_node4 x:globalLoaderColl_shard2_replica_n2 ] o.a.s.u.CommitTracker Soft AutoCommit: disabled
   [junit4]   2> 429741 DEBUG (qtp2132997662-5543) [n:127.0.0.1:40940_solr c:globalLoaderColl s:shard1 r:core_node3 x:globalLoaderColl_shard1_replica_n1 ] o.a.s.c.c.ZkStateReader path=[/configs/conf] [configName]=[conf] specified config exists in ZooKeeper
   [junit4]   2> 429741 INFO  (qtp2132997662-5543) [n:127.0.0.1:40940_solr c:globalLoaderColl s:shard1 r:core_node3 x:globalLoaderColl_shard1_replica_n1 ] o.a.s.r.ManagedResourceStorage Configured ZooKeeperStorageIO with znodeBase: /configs/conf
   [junit4]   2> 429742 INFO  (qtp2132997662-5543) [n:127.0.0.1:40940_solr c:globalLoaderColl s:shard1 r:core_node3 x:globalLoaderColl_shard1_replica_n1 ] o.a.s.r.ManagedResourceStorage Loaded null at path _rest_managed.json using ZooKeeperStorageIO:path=/configs/conf
   [junit4]   2> 429742 INFO  (qtp2132997662-5543) [n:127.0.0.1:40940_solr c:globalLoaderColl s:shard1 r:core_node3 x:globalLoaderColl_shard1_replica_n1 ] o.a.s.h.ReplicationHandler Commits will be reserved for 10000ms.
   [junit4]   2> 429742 INFO  (qtp2132997662-5543) [n:127.0.0.1:40940_solr c:globalLoaderColl s:shard1 r:core_node3 x:globalLoaderColl_shard1_replica_n1 ] o.a.s.u.UpdateLog Could not find max version in index or recent updates, using new clock 1641946027222106112
   [junit4]   2> 429814 INFO  (qtp64819885-5544) [n:127.0.0.1:42471_solr c:globalLoaderColl s:shard2 r:core_node4 x:globalLoaderColl_shard2_replica_n2 ] o.a.s.s.SolrIndexSearcher Opening [Searcher@781183d6[globalLoaderColl_shard2_replica_n2] main]
   [junit4]   2> 429815 DEBUG (qtp64819885-5544) [n:127.0.0.1:42471_solr c:globalLoaderColl s:shard2 r:core_node4 x:globalLoaderColl_shard2_replica_n2 ] o.a.s.c.c.ZkStateReader Loading collection config from: [/collections/globalLoaderColl]
   [junit4]   2> 429834 DEBUG (qtp2132997662-5543) [n:127.0.0.1:40940_solr c:globalLoaderColl s:shard1 r:core_node3 x:globalLoaderColl_shard1_replica_n1 ] o.a.s.c.c.ZkStateReader Add data for [globalLoaderColl] ver [2]
   [junit4]   2> 429834 DEBUG (qtp2132997662-5543) [n:127.0.0.1:40940_solr c:globalLoaderColl s:shard1 r:core_node3 x:globalLoaderColl_shard1_replica_n1 ] o.a.s.c.c.ZkStateReader clusterStateSet: legacy [0] interesting [1] watched [1] lazy [1] total [1]
   [junit4]   2> 429834 DEBUG (qtp2132997662-5543) [n:127.0.0.1:40940_solr c:globalLoaderColl s:shard1 r:core_node3 x:globalLoaderColl_shard1_replica_n1 ] o.a.s.c.c.ZkStateReader clusterStateSet: legacy [0] interesting [0] watched [0] lazy [1] total [1]
   [junit4]   2> 429835 DEBUG (qtp64819885-5544) [n:127.0.0.1:42471_solr c:globalLoaderColl s:shard2 r:core_node4 x:globalLoaderColl_shard2_replica_n2 ] o.a.s.c.c.ZkStateReader path=[/configs/conf] [configName]=[conf] specified config exists in ZooKeeper
   [junit4]   2> 429835 INFO  (qtp64819885-5544) [n:127.0.0.1:42471_solr c:globalLoaderColl s:shard2 r:core_node4 x:globalLoaderColl_shard2_replica_n2 ] o.a.s.r.ManagedResourceStorage Configured ZooKeeperStorageIO with znodeBase: /configs/conf
   [junit4]   2> 429835 INFO  (qtp64819885-5544) [n:127.0.0.1:42471_solr c:globalLoaderColl s:shard2 r:core_node4 x:globalLoaderColl_shard2_replica_n2 ] o.a.s.r.ManagedResourceStorage Loaded null at path _rest_managed.json using ZooKeeperStorageIO:path=/configs/conf
   [junit4]   2> 429836 INFO  (qtp64819885-5544) [n:127.0.0.1:42471_solr c:globalLoaderColl s:shard2 r:core_node4 x:globalLoaderColl_shard2_replica_n2 ] o.a.s.h.ReplicationHandler Commits will be reserved for 10000ms.
   [junit4]   2> 429836 INFO  (qtp64819885-5544) [n:127.0.0.1:42471_solr c:globalLoaderColl s:shard2 r:core_node4 x:globalLoaderColl_shard2_replica_n2 ] o.a.s.u.UpdateLog Could not find max version in index or recent updates, using new clock 1641946027320672256
   [junit4]   2> 429932 INFO  (searcherExecutor-1160-thread-1-processing-n:127.0.0.1:40940_solr x:globalLoaderColl_shard1_replica_n1 c:globalLoaderColl s:shard1 r:core_node3) [n:127.0.0.1:40940_solr c:globalLoaderColl s:shard1 r:core_node3 x:globalLoaderColl_shard1_replica_n1 ] o.a.s.c.SolrCore [globalLoaderColl_shard1_replica_n1] Registered new searcher Searcher@58c99621[globalLoaderColl_shard1_replica_n1] main{ExitableDirectoryReader(UninvertingDirectoryReader())}
   [junit4]   2> 429948 INFO  (searcherExecutor-1159-thread-1-processing-n:127.0.0.1:42471_solr x:globalLoaderColl_shard2_replica_n2 c:globalLoaderColl s:shard2 r:core_node4) [n:127.0.0.1:42471_solr c:globalLoaderColl s:shard2 r:core_node4 x:globalLoaderColl_shard2_replica_n2 ] o.a.s.c.SolrCore [globalLoaderColl_shard2_replica_n2] Registered new searcher Searcher@781183d6[globalLoaderColl_shard2_replica_n2] main{ExitableDirectoryReader(UninvertingDirectoryReader())}
   [junit4]   2> 429949 DEBUG (qtp64819885-5544) [n:127.0.0.1:42471_solr c:globalLoaderColl s:shard2 r:core_node4 x:globalLoaderColl_shard2_replica_n2 ] o.a.s.c.c.ZkStateReader Add data for [globalLoaderColl] ver [2]
   [junit4]   2> 429949 DEBUG (qtp64819885-5544) [n:127.0.0.1:42471_solr c:globalLoaderColl s:shard2 r:core_node4 x:globalLoaderColl_shard2_replica_n2 ] o.a.s.c.c.ZkStateReader clusterStateSet: legacy [0] interesting [1] watched [1] lazy [1] total [1]
   [junit4]   2> 429949 DEBUG (qtp64819885-5544) [n:127.0.0.1:42471_solr c:globalLoaderColl s:shard2 r:core_node4 x:globalLoaderColl_shard2_replica_n2 ] o.a.s.c.c.ZkStateReader clusterStateSet: legacy [0] interesting [0] watched [0] lazy [1] total [1]
   [junit4]   2> 429952 INFO  (qtp2132997662-5543) [n:127.0.0.1:40940_solr c:globalLoaderColl s:shard1 r:core_node3 x:globalLoaderColl_shard1_replica_n1 ] o.a.s.c.ZkShardTerms Successful update of terms at /collections/globalLoaderColl/terms/shard1 to Terms{values={core_node3=0}, version=0}
   [junit4]   2> 429969 INFO  (qtp64819885-5544) [n:127.0.0.1:42471_solr c:globalLoaderColl s:shard2 r:core_node4 x:globalLoaderColl_shard2_replica_n2 ] o.a.s.c.ZkShardTerms Successful update of terms at /collections/globalLoaderColl/terms/shard2 to Terms{values={core_node4=0}, version=0}
   [junit4]   2> 429969 INFO  (qtp64819885-5544) [n:127.0.0.1:42471_solr c:globalLoaderColl s:shard2 r:core_node4 x:globalLoaderColl_shard2_replica_n2 ] o.a.s.c.ShardLeaderElectionContextBase make sure parent is created /collections/globalLoaderColl/leaders/shard2
   [junit4]   2> 429980 INFO  (qtp64819885-5544) [n:127.0.0.1:42471_solr c:globalLoaderColl s:shard2 r:core_node4 x:globalLoaderColl_shard2_replica_n2 ] o.a.s.c.ShardLeaderElectionContext Enough replicas found to continue.
   [junit4]   2> 429980 INFO  (qtp64819885-5544) [n:127.0.0.1:42471_solr c:globalLoaderColl s:shard2 r:core_node4 x:globalLoaderColl_shard2_replica_n2 ] o.a.s.c.ShardLeaderElectionContext I may be the new leader - try and sync
   [junit4]   2> 429980 INFO  (qtp64819885-5544) [n:127.0.0.1:42471_solr c:globalLoaderColl s:shard2 r:core_node4 x:globalLoaderColl_shard2_replica_n2 ] o.a.s.c.SyncStrategy Sync replicas to http://127.0.0.1:42471/solr/globalLoaderColl_shard2_replica_n2/
   [junit4]   2> 429982 INFO  (qtp64819885-5544) [n:127.0.0.1:42471_solr c:globalLoaderColl s:shard2 r:core_node4 x:globalLoaderColl_shard2_replica_n2 ] o.a.s.c.SyncStrategy Sync Success - now sync replicas to me
   [junit4]   2> 429982 INFO  (qtp64819885-5544) [n:127.0.0.1:42471_solr c:globalLoaderColl s:shard2 r:core_node4 x:globalLoaderColl_shard2_replica_n2 ] o.a.s.c.SyncStrategy http://127.0.0.1:42471/solr/globalLoaderColl_shard2_replica_n2/ has no replicas
   [junit4]   2> 429982 INFO  (qtp64819885-5544) [n:127.0.0.1:42471_solr c:globalLoaderColl s:shard2 r:core_node4 x:globalLoaderColl_shard2_replica_n2 ] o.a.s.c.ShardLeaderElectionContextBase Creating leader registration node /collections/globalLoaderColl/leaders/shard2/leader after winning as /collections/globalLoaderColl/leader_elect/shard2/election/75217684282081292-core_node4-n_0000000000
   [junit4]   2> 429984 INFO  (qtp64819885-5544) [n:127.0.0.1:42471_solr c:globalLoaderColl s:shard2 r:core_node4 x:globalLoaderColl_shard2_replica_n2 ] o.a.s.c.ShardLeaderElectionContext I am the new leader: http://127.0.0.1:42471/solr/globalLoaderColl_shard2_replica_n2/ shard2
   [junit4]   2> 429984 DEBUG (qtp64819885-5544) [n:127.0.0.1:42471_solr c:globalLoaderColl s:shard2 r:core_node4 x:globalLoaderColl_shard2_replica_n2 ] o.a.s.c.c.ZkStateReader Add data for [globalLoaderColl] ver [2]
   [junit4]   2> 429984 DEBUG (qtp64819885-5544) [n:127.0.0.1:42471_solr c:globalLoaderColl s:shard2 r:core_node4 x:globalLoaderColl_shard2_replica_n2 ] o.a.s.c.c.ZkStateReader clusterStateSet: legacy [0] interesting [1] watched [1] lazy [1] total [1]
   [junit4]   2> 429997 INFO  (qtp2132997662-5543) [n:127.0.0.1:40940_solr c:globalLoaderColl s:shard1 r:core_node3 x:globalLoaderColl_shard1_replica_n1 ] o.a.s.c.ShardLeaderElectionContextBase make sure parent is created /collections/globalLoaderColl/leaders/shard1
   [junit4]   2> 430000 INFO  (qtp2132997662-5543) [n:127.0.0.1:40940_solr c:globalLoaderColl s:shard1 r:core_node3 x:globalLoaderColl_shard1_replica_n1 ] o.a.s.c.ShardLeaderElectionContext Enough replicas found to continue.
   [junit4]   2> 430000 INFO  (qtp2132997662-5543) [n:127.0.0.1:40940_solr c:globalLoaderColl s:shard1 r:core_node3 x:globalLoaderColl_shard1_replica_n1 ] o.a.s.c.ShardLeaderElectionContext I may be the new leader - try and sync
   [junit4]   2> 430000 INFO  (qtp2132997662-5543) [n:127.0.0.1:40940_solr c:globalLoaderColl s:shard1 r:core_node3 x:globalLoaderColl_shard1_replica_n1 ] o.a.s.c.SyncStrategy Sync replicas to http://127.0.0.1:40940/solr/globalLoaderColl_shard1_replica_n1/
   [junit4]   2> 430013 INFO  (qtp2132997662-5543) [n:127.0.0.1:40940_solr c:globalLoaderColl s:shard1 r:core_node3 x:globalLoaderColl_shard1_replica_n1 ] o.a.s.c.SyncStrategy Sync Success - now sync replicas to me
   [junit4]   2> 430013 INFO  (qtp2132997662-5543) [n:127.0.0.1:40940_solr c:globalLoaderColl s:shard1 r:core_node3 x:globalLoaderColl_shard1_replica_n1 ] o.a.s.c.SyncStrategy http://127.0.0.1:40940/solr/globalLoaderColl_shard1_replica_n1/ has no replicas
   [junit4]   2> 430013 INFO  (qtp2132997662-5543) [n:127.0.0.1:40940_solr c:globalLoaderColl s:shard1 r:core_node3 x:globalLoaderColl_shard1_replica_n1 ] o.a.s.c.ShardLeaderElectionContextBase Creating leader registration node /collections/globalLoaderColl/leaders/shard1/leader after winning as /collections/globalLoaderColl/leader_elect/shard1/election/75217684282081288-core_node3-n_0000000000
   [junit4]   2> 430015 INFO  (qtp2132997662-5543) [n:127.0.0.1:40940_solr c:globalLoaderColl s:shard1 r:core_node3 x:globalLoaderColl_shard1_replica_n1 ] o.a.s.c.ShardLeaderElectionContext I am the new leader: http://127.0.0.1:40940/solr/globalLoaderColl_shard1_replica_n1/ shard1
   [junit4]   2> 430015 DEBUG (qtp2132997662-5543) [n:127.0.0.1:40940_solr c:globalLoaderColl s:shard1 r:core_node3 x:globalLoaderColl_shard1_replica_n1 ] o.a.s.c.c.ZkStateReader Add data for [globalLoaderColl] ver [2]
   [junit4]   2> 430015 DEBUG (qtp2132997662-5543) [n:127.0.0.1:40940_solr c:globalLoaderColl s:shard1 r:core_node3 x:globalLoaderColl_shard1_replica_n1 ] o.a.s.c.c.ZkStateReader clusterStateSet: legacy [0] interesting [1] watched [1] lazy [1] total [1]
   [junit4]   2> 430164 INFO  (zkCallback-2098-thread-2) [     ] o.a.s.c.c.ZkStateReader A cluster state change: [WatchedEvent state:SyncConnected type:NodeDataChanged path:/collections/globalLoaderColl/state.json] for collection [globalLoaderColl] has occurred - updating... (live nodes size: [4])
   [junit4]   2> 430166 DEBUG (zkCallback-2098-thread-2) [     ] o.a.s.c.c.ZkStateReader Updating data for [globalLoaderColl] from [2] to [3]
   [junit4]   2> 430166 DEBUG (zkCallback-2098-thread-2) [     ] o.a.s.c.c.ZkStateReader clusterStateSet: legacy [0] interesting [1] watched [1] lazy [1] total [1]
   [junit4]   2> 430166 INFO  (qtp2132997662-5543) [n:127.0.0.1:40940_solr c:globalLoaderColl s:shard1 r:core_node3 x:globalLoaderColl_shard1_replica_n1 ] o.a.s.c.ZkController I am the leader, no recovery necessary
   [junit4]   2> 430166 DEBUG (watches-2100-thread-1) [     ] o.a.s.c.c.ZkStateReader clusterStateSet: legacy [0] interesting [0] watched [0] lazy [1] total [1]
   [junit4]   2> 430166 DEBUG (qtp2132997662-5543) [n:127.0.0.1:40940_solr c:globalLoaderColl s:shard1 r:core_node3 x:globalLoaderColl_shard1_replica_n1 ] o.a.s.c.c.ZkStateReader Refreshing lazily-loaded state for collection globalLoaderColl
   [junit4]   2> 430179 DEBUG (zkCallback-2098-thread-1) [     ] o.a.s.c.c.ZkStateReader Uninteresting collection globalLoaderColl
   [junit4]   2> 430179 INFO  (zkCallback-2116-thread-1) [     ] o.a.s.c.c.ZkStateReader A cluster state change: [WatchedEvent state:SyncConnected type:NodeDataChanged path:/collections/globalLoaderColl/state.json] for collection [globalLoaderColl] has occurred - updating... (live nodes size: [4])
   [junit4]   2> 430179 INFO  (zkCallback-2116-thread-2) [     ] o.a.s.c.c.ZkStateReader A cluster state change: [WatchedEvent state:SyncConnected type:NodeDataChanged path:/collections/globalLoaderColl/state.json] for collection [globalLoaderColl] has occurred - updating... (live nodes size: [4])
   [junit4]   2> 430179 DEBUG (qtp2132997662-5543) [n:127.0.0.1:40940_solr c:globalLoaderColl s:shard1 r:core_node3 x:globalLoaderColl_shard1_replica_n1 ] o.a.s.c.c.ZkStateReader Add data for [globalLoaderColl] ver [3]
   [junit4]   2> 430179 DEBUG (qtp2132997662-5543) [n:127.0.0.1:40940_solr c:globalLoaderColl s:shard1 r:core_node3 x:globalLoaderColl_shard1_replica_n1 ] o.a.s.c.c.ZkStateReader clusterStateSet: legacy [0] interesting [1] watched [1] lazy [1] total [1]
   [junit4]   2> 430179 DEBUG (zkCallback-2116-thread-1) [     ] o.a.s.c.c.ZkStateReader Updating data for [globalLoaderColl] from [2] to [3]
   [junit4]   2> 430179 DEBUG (zkCallback-2116-thread-1) [     ] o.a.s.c.c.ZkStateReader clusterStateSet: legacy [0] interesting [1] watched [1] lazy [1] total [1]
   [junit4]   2> 430179 DEBUG (watches-2125-thread-1) [     ] o.a.s.c.c.ZkStateReader clusterStateSet: legacy [0] interesting [0] watched [0] lazy [1] total [1]
   [junit4]   2> 430180 INFO  (qtp2132997662-5543) [n:127.0.0.1:40940_solr c:globalLoaderColl s:shard1 r:core_node3 x:globalLoaderColl_shard1_replica_n1 ] o.a.s.s.HttpSolrCall [admin] webapp=null path=/admin/cores params={qt=/admin/cores&coreNodeName=core_node3&collection.configName=conf&newCollection=true&name=globalLoaderColl_shard1_replica_n1&action=CREATE&numShards=2&collection=globalLoaderColl&shard=shard1&wt=javabin&version=2&replicaType=NRT} status=0 QTime=1849
   [junit4]   2> 430230 DEBUG (zkCallback-2116-thread-2) [     ] o.a.s.c.c.ZkStateReader Removing uninteresting collection [globalLoaderColl]
   [junit4]   2> 430230 DEBUG (zkCallback-2116-thread-2) [     ] o.a.s.c.c.ZkStateReader clusterStateSet: legacy [0] interesting [0] watched [0] lazy [1] total [1]
   [junit4]   2> 430231 INFO  (qtp64819885-5544) [n:127.0.0.1:42471_solr c:globalLoaderColl s:shard2 r:core_node4 x:globalLoaderColl_shard2_replica_n2 ] o.a.s.c.ZkController I am the leader, no recovery necessary
   [junit4]   2> 430244 DEBUG (qtp64819885-5544) [n:127.0.0.1:42471_solr c:globalLoaderColl s:shard2 r:core_node4 x:globalLoaderColl_shard2_replica_n2 ] o.a.s.c.c.ZkStateReader Refreshing lazily-loaded state for collection globalLoaderColl
   [junit4]   2> 430245 DEBUG (qtp64819885-5544) [n:127.0.0.1:42471_solr c:globalLoaderColl s:shard2 r:core_node4 x:globalLoaderColl_shard2_replica_n2 ] o.a.s.c.c.ZkStateReader Add data for [globalLoaderColl] ver [3]
   [junit4]   2> 430245 DEBUG (qtp64819885-5544) [

[...truncated too long message...]

gs :: file = /home/jenkins/jenkins-slave/workspace/Lucene-Solr-Tests-8.x/lucene/top-level-ivy-settings.xml

resolve:

ivy-availability-check:
[loadresource] Do not set property disallowed.ivy.jars.list as its length is 0.

-ivy-fail-disallowed-ivy-version:

ivy-fail:

ivy-configure:
[ivy:configure] :: loading settings :: file = /home/jenkins/jenkins-slave/workspace/Lucene-Solr-Tests-8.x/lucene/top-level-ivy-settings.xml

resolve:

ivy-availability-check:
[loadresource] Do not set property disallowed.ivy.jars.list as its length is 0.

-ivy-fail-disallowed-ivy-version:

ivy-fail:

ivy-fail:

ivy-configure:
[ivy:configure] :: loading settings :: file = /home/jenkins/jenkins-slave/workspace/Lucene-Solr-Tests-8.x/lucene/top-level-ivy-settings.xml

resolve:

ivy-availability-check:
[loadresource] Do not set property disallowed.ivy.jars.list as its length is 0.

-ivy-fail-disallowed-ivy-version:

ivy-fail:

ivy-configure:
[ivy:configure] :: loading settings :: file = /home/jenkins/jenkins-slave/workspace/Lucene-Solr-Tests-8.x/lucene/top-level-ivy-settings.xml

resolve:

ivy-availability-check:
[loadresource] Do not set property disallowed.ivy.jars.list as its length is 0.

-ivy-fail-disallowed-ivy-version:

ivy-fail:

ivy-fail:

ivy-configure:
[ivy:configure] :: loading settings :: file = /home/jenkins/jenkins-slave/workspace/Lucene-Solr-Tests-8.x/lucene/top-level-ivy-settings.xml

resolve:

ivy-availability-check:
[loadresource] Do not set property disallowed.ivy.jars.list as its length is 0.

-ivy-fail-disallowed-ivy-version:

ivy-fail:

ivy-fail:

ivy-configure:
[ivy:configure] :: loading settings :: file = /home/jenkins/jenkins-slave/workspace/Lucene-Solr-Tests-8.x/lucene/top-level-ivy-settings.xml

resolve:

ivy-availability-check:
[loadresource] Do not set property disallowed.ivy.jars.list as its length is 0.

-ivy-fail-disallowed-ivy-version:

ivy-fail:

ivy-fail:

ivy-configure:
[ivy:configure] :: loading settings :: file = /home/jenkins/jenkins-slave/workspace/Lucene-Solr-Tests-8.x/lucene/top-level-ivy-settings.xml

resolve:

ivy-availability-check:
[loadresource] Do not set property disallowed.ivy.jars.list as its length is 0.

-ivy-fail-disallowed-ivy-version:

ivy-fail:

ivy-fail:

ivy-configure:
[ivy:configure] :: loading settings :: file = /home/jenkins/jenkins-slave/workspace/Lucene-Solr-Tests-8.x/lucene/top-level-ivy-settings.xml

resolve:

ivy-availability-check:
[loadresource] Do not set property disallowed.ivy.jars.list as its length is 0.

-ivy-fail-disallowed-ivy-version:

ivy-fail:

ivy-fail:

ivy-configure:
[ivy:configure] :: loading settings :: file = /home/jenkins/jenkins-slave/workspace/Lucene-Solr-Tests-8.x/lucene/top-level-ivy-settings.xml

resolve:

ivy-availability-check:
[loadresource] Do not set property disallowed.ivy.jars.list as its length is 0.

-ivy-fail-disallowed-ivy-version:

ivy-fail:

ivy-fail:

ivy-configure:
[ivy:configure] :: loading settings :: file = /home/jenkins/jenkins-slave/workspace/Lucene-Solr-Tests-8.x/lucene/top-level-ivy-settings.xml

resolve:

ivy-availability-check:
[loadresource] Do not set property disallowed.ivy.jars.list as its length is 0.

-ivy-fail-disallowed-ivy-version:

ivy-fail:

ivy-fail:

ivy-configure:
[ivy:configure] :: loading settings :: file = /home/jenkins/jenkins-slave/workspace/Lucene-Solr-Tests-8.x/lucene/top-level-ivy-settings.xml

resolve:

ivy-availability-check:
[loadresource] Do not set property disallowed.ivy.jars.list as its length is 0.

-ivy-fail-disallowed-ivy-version:

ivy-fail:

ivy-fail:

ivy-configure:
[ivy:configure] :: loading settings :: file = /home/jenkins/jenkins-slave/workspace/Lucene-Solr-Tests-8.x/lucene/top-level-ivy-settings.xml

resolve:

ivy-availability-check:
[loadresource] Do not set property disallowed.ivy.jars.list as its length is 0.

-ivy-fail-disallowed-ivy-version:

ivy-fail:

ivy-fail:

ivy-configure:
[ivy:configure] :: loading settings :: file = /home/jenkins/jenkins-slave/workspace/Lucene-Solr-Tests-8.x/lucene/top-level-ivy-settings.xml

resolve:

ivy-availability-check:
[loadresource] Do not set property disallowed.ivy.jars.list as its length is 0.

-ivy-fail-disallowed-ivy-version:

ivy-fail:

ivy-fail:

ivy-configure:
[ivy:configure] :: loading settings :: file = /home/jenkins/jenkins-slave/workspace/Lucene-Solr-Tests-8.x/lucene/top-level-ivy-settings.xml

resolve:

ivy-availability-check:
[loadresource] Do not set property disallowed.ivy.jars.list as its length is 0.

-ivy-fail-disallowed-ivy-version:

ivy-fail:

ivy-fail:

ivy-configure:
[ivy:configure] :: loading settings :: file = /home/jenkins/jenkins-slave/workspace/Lucene-Solr-Tests-8.x/lucene/top-level-ivy-settings.xml

resolve:

jar-checksums:
    [mkdir] Created dir: /home/jenkins/jenkins-slave/workspace/Lucene-Solr-Tests-8.x/solr/null1891563746
     [copy] Copying 249 files to /home/jenkins/jenkins-slave/workspace/Lucene-Solr-Tests-8.x/solr/null1891563746
   [delete] Deleting directory /home/jenkins/jenkins-slave/workspace/Lucene-Solr-Tests-8.x/solr/null1891563746

check-working-copy:
[ivy:cachepath] :: resolving dependencies :: #;working@lucene2-us-west.apache.org
[ivy:cachepath] 	confs: [default]
[ivy:cachepath] 	found org.eclipse.jgit#org.eclipse.jgit;5.3.0.201903130848-r in public
[ivy:cachepath] 	found com.jcraft#jsch;0.1.54 in public
[ivy:cachepath] 	found com.jcraft#jzlib;1.1.1 in public
[ivy:cachepath] 	found com.googlecode.javaewah#JavaEWAH;1.1.6 in public
[ivy:cachepath] 	found org.slf4j#slf4j-api;1.7.2 in public
[ivy:cachepath] 	found org.bouncycastle#bcpg-jdk15on;1.60 in public
[ivy:cachepath] 	found org.bouncycastle#bcprov-jdk15on;1.60 in public
[ivy:cachepath] 	found org.bouncycastle#bcpkix-jdk15on;1.60 in public
[ivy:cachepath] 	found org.slf4j#slf4j-nop;1.7.2 in public
[ivy:cachepath] :: resolution report :: resolve 20ms :: artifacts dl 1ms
	---------------------------------------------------------------------
	|                  |            modules            ||   artifacts   |
	|       conf       | number| search|dwnlded|evicted|| number|dwnlded|
	---------------------------------------------------------------------
	|      default     |   9   |   0   |   0   |   0   ||   9   |   0   |
	---------------------------------------------------------------------
[wc-checker] Initializing working copy...
[wc-checker] Checking working copy status...

-jenkins-base:

BUILD SUCCESSFUL
Total time: 191 minutes 50 seconds
Archiving artifacts
java.lang.InterruptedException: no matches found within 10000
	at hudson.FilePath$ValidateAntFileMask.hasMatch(FilePath.java:2847)
	at hudson.FilePath$ValidateAntFileMask.invoke(FilePath.java:2726)
	at hudson.FilePath$ValidateAntFileMask.invoke(FilePath.java:2707)
	at hudson.FilePath$FileCallableWrapper.call(FilePath.java:3086)
Also:   hudson.remoting.Channel$CallSiteStackTrace: Remote call to lucene2
		at hudson.remoting.Channel.attachCallSiteStackTrace(Channel.java:1741)
		at hudson.remoting.UserRequest$ExceptionResponse.retrieve(UserRequest.java:357)
		at hudson.remoting.Channel.call(Channel.java:955)
		at hudson.FilePath.act(FilePath.java:1072)
		at hudson.FilePath.act(FilePath.java:1061)
		at hudson.FilePath.validateAntFileMask(FilePath.java:2705)
		at hudson.tasks.ArtifactArchiver.perform(ArtifactArchiver.java:243)
		at hudson.tasks.BuildStepCompatibilityLayer.perform(BuildStepCompatibilityLayer.java:81)
		at hudson.tasks.BuildStepMonitor$1.perform(BuildStepMonitor.java:20)
		at hudson.model.AbstractBuild$AbstractBuildExecution.perform(AbstractBuild.java:744)
		at hudson.model.AbstractBuild$AbstractBuildExecution.performAllBuildSteps(AbstractBuild.java:690)
		at hudson.model.Build$BuildExecution.post2(Build.java:186)
		at hudson.model.AbstractBuild$AbstractBuildExecution.post(AbstractBuild.java:635)
		at hudson.model.Run.execute(Run.java:1835)
		at hudson.model.FreeStyleBuild.run(FreeStyleBuild.java:43)
		at hudson.model.ResourceController.execute(ResourceController.java:97)
		at hudson.model.Executor.run(Executor.java:429)
Caused: hudson.FilePath$TunneledInterruptedException
	at hudson.FilePath$FileCallableWrapper.call(FilePath.java:3088)
	at hudson.remoting.UserRequest.perform(UserRequest.java:212)
	at hudson.remoting.UserRequest.perform(UserRequest.java:54)
	at hudson.remoting.Request$2.run(Request.java:369)
	at hudson.remoting.InterceptingExecutorService$1.call(InterceptingExecutorService.java:72)
	at java.util.concurrent.FutureTask.run(FutureTask.java:266)
	at java.util.concurrent.ThreadPoolExecutor.runWorker(ThreadPoolExecutor.java:1142)
	at java.util.concurrent.ThreadPoolExecutor$Worker.run(ThreadPoolExecutor.java:617)
	at java.lang.Thread.run(Thread.java:748)
Caused: java.lang.InterruptedException: java.lang.InterruptedException: no matches found within 10000
	at hudson.FilePath.act(FilePath.java:1074)
	at hudson.FilePath.act(FilePath.java:1061)
	at hudson.FilePath.validateAntFileMask(FilePath.java:2705)
	at hudson.tasks.ArtifactArchiver.perform(ArtifactArchiver.java:243)
	at hudson.tasks.BuildStepCompatibilityLayer.perform(BuildStepCompatibilityLayer.java:81)
	at hudson.tasks.BuildStepMonitor$1.perform(BuildStepMonitor.java:20)
	at hudson.model.AbstractBuild$AbstractBuildExecution.perform(AbstractBuild.java:744)
	at hudson.model.AbstractBuild$AbstractBuildExecution.performAllBuildSteps(AbstractBuild.java:690)
	at hudson.model.Build$BuildExecution.post2(Build.java:186)
	at hudson.model.AbstractBuild$AbstractBuildExecution.post(AbstractBuild.java:635)
	at hudson.model.Run.execute(Run.java:1835)
	at hudson.model.FreeStyleBuild.run(FreeStyleBuild.java:43)
	at hudson.model.ResourceController.execute(ResourceController.java:97)
	at hudson.model.Executor.run(Executor.java:429)
No artifacts found that match the file pattern "**/*.events,heapdumps/**,**/hs_err_pid*". Configuration error?
Recording test results
Build step 'Publish JUnit test result report' changed build result to UNSTABLE
Email was triggered for: Unstable (Test Failures)
Sending email for trigger: Unstable (Test Failures)