You are viewing a plain text version of this content. The canonical link for it is here.
Posted to commits@cayenne.apache.org by Apache Jenkins Server <je...@builds.apache.org> on 2014/05/26 04:37:17 UTC
Build failed in Jenkins: cayenne-master » derby,jdk-1.8.0,Ubuntu #8
See <https://builds.apache.org/job/cayenne-master/cayenneTestConnection=derby,jdk=jdk-1.8.0,label=Ubuntu/8/>
------------------------------------------
[...truncated 65357 lines...]
May 26, 2014 2:37:13 AM org.apache.cayenne.configuration.XMLDataChannelDescriptorLoader$DataChannelChildrenHandler createChildTagHandler
INFO: Loading XML DataMap resource from <https://builds.apache.org/job/cayenne-master/cayenneTestConnection=derby,jdk=jdk-1.8.0,label=Ubuntu/ws/cayenne-server/target/test-classes/tstmap.map.xml>
May 26, 2014 2:37:13 AM org.apache.cayenne.map.EntityResolver applyDBLayerDefaults
INFO: added runtime complimentary DbRelationship from ARTIST to PAINTING1
Tests run: 2, Failures: 0, Errors: 0, Skipped: 0, Time elapsed: 0.019 sec
Running org.apache.cayenne.access.DataContextObjectIdQueryTest
May 26, 2014 2:37:13 AM org.apache.cayenne.configuration.XMLDataChannelDescriptorLoader load
INFO: Loading XML configuration resource from <https://builds.apache.org/job/cayenne-master/cayenneTestConnection=derby,jdk=jdk-1.8.0,label=Ubuntu/ws/cayenne-server/target/test-classes/cayenne-testmap.xml>
May 26, 2014 2:37:13 AM org.apache.cayenne.configuration.XMLDataChannelDescriptorLoader$DataChannelChildrenHandler createChildTagHandler
INFO: Loading XML DataMap resource from <https://builds.apache.org/job/cayenne-master/cayenneTestConnection=derby,jdk=jdk-1.8.0,label=Ubuntu/ws/cayenne-server/target/test-classes/tstmap.map.xml>
May 26, 2014 2:37:13 AM org.apache.cayenne.map.EntityResolver applyDBLayerDefaults
INFO: added runtime complimentary DbRelationship from ARTIST to PAINTING1
May 26, 2014 2:37:13 AM org.apache.cayenne.test.jdbc.UtilityLogger log
INFO: delete from PAINTING_INFO
May 26, 2014 2:37:13 AM org.apache.cayenne.test.jdbc.UtilityLogger log
INFO: delete from PAINTING
May 26, 2014 2:37:13 AM org.apache.cayenne.test.jdbc.UtilityLogger log
INFO: delete from PAINTING1
May 26, 2014 2:37:13 AM org.apache.cayenne.test.jdbc.UtilityLogger log
INFO: delete from ARTIST_EXHIBIT
May 26, 2014 2:37:13 AM org.apache.cayenne.test.jdbc.UtilityLogger log
INFO: delete from ARTIST_GROUP
May 26, 2014 2:37:13 AM org.apache.cayenne.test.jdbc.UtilityLogger log
INFO: delete from ARTIST
May 26, 2014 2:37:13 AM org.apache.cayenne.log.CommonsJdbcEventLogger logBeginTransaction
INFO: --- transaction started.
May 26, 2014 2:37:13 AM org.apache.cayenne.log.CommonsJdbcEventLogger logQuery
INFO: INSERT INTO ARTIST (ARTIST_ID, ARTIST_NAME, DATE_OF_BIRTH) VALUES (44, 'X', ?) [bind: 1:'2014-05-26 02:37:13.996']
May 26, 2014 2:37:14 AM org.apache.cayenne.log.CommonsJdbcEventLogger logUpdateCount
INFO: === updated 1 row.
May 26, 2014 2:37:14 AM org.apache.cayenne.log.CommonsJdbcEventLogger logCommitTransaction
INFO: +++ transaction committed.
May 26, 2014 2:37:14 AM org.apache.cayenne.log.CommonsJdbcEventLogger logBeginTransaction
INFO: --- transaction started.
May 26, 2014 2:37:14 AM org.apache.cayenne.log.CommonsJdbcEventLogger logQuery
INFO: SELECT t0.ARTIST_NAME, t0.DATE_OF_BIRTH, t0.ARTIST_ID FROM ARTIST t0 WHERE t0.ARTIST_ID = ? [bind: 1->ARTIST_ID:44]
May 26, 2014 2:37:14 AM org.apache.cayenne.log.CommonsJdbcEventLogger logSelectCount
INFO: === returned 1 row. - took 4 ms.
May 26, 2014 2:37:14 AM org.apache.cayenne.log.CommonsJdbcEventLogger logCommitTransaction
INFO: +++ transaction committed.
May 26, 2014 2:37:14 AM org.apache.cayenne.log.CommonsJdbcEventLogger logBeginTransaction
INFO: --- transaction started.
May 26, 2014 2:37:14 AM org.apache.cayenne.log.CommonsJdbcEventLogger logQuery
INFO: UPDATE ARTIST SET DATE_OF_BIRTH = NULL
May 26, 2014 2:37:14 AM org.apache.cayenne.log.CommonsJdbcEventLogger logUpdateCount
INFO: === updated 1 row.
May 26, 2014 2:37:14 AM org.apache.cayenne.log.CommonsJdbcEventLogger logCommitTransaction
INFO: +++ transaction committed.
May 26, 2014 2:37:14 AM org.apache.cayenne.log.CommonsJdbcEventLogger logBeginTransaction
INFO: --- transaction started.
May 26, 2014 2:37:14 AM org.apache.cayenne.log.CommonsJdbcEventLogger logQuery
INFO: SELECT t0.ARTIST_NAME, t0.DATE_OF_BIRTH, t0.ARTIST_ID FROM ARTIST t0 WHERE t0.ARTIST_ID = ? [bind: 1->ARTIST_ID:44]
May 26, 2014 2:37:14 AM org.apache.cayenne.log.CommonsJdbcEventLogger logSelectCount
INFO: === returned 1 row. - took 1 ms.
May 26, 2014 2:37:14 AM org.apache.cayenne.log.CommonsJdbcEventLogger logCommitTransaction
INFO: +++ transaction committed.
May 26, 2014 2:37:14 AM org.apache.cayenne.configuration.XMLDataChannelDescriptorLoader load
INFO: Loading XML configuration resource from <https://builds.apache.org/job/cayenne-master/cayenneTestConnection=derby,jdk=jdk-1.8.0,label=Ubuntu/ws/cayenne-server/target/test-classes/cayenne-testmap.xml>
May 26, 2014 2:37:14 AM org.apache.cayenne.configuration.XMLDataChannelDescriptorLoader$DataChannelChildrenHandler createChildTagHandler
INFO: Loading XML DataMap resource from <https://builds.apache.org/job/cayenne-master/cayenneTestConnection=derby,jdk=jdk-1.8.0,label=Ubuntu/ws/cayenne-server/target/test-classes/tstmap.map.xml>
May 26, 2014 2:37:14 AM org.apache.cayenne.map.EntityResolver applyDBLayerDefaults
INFO: added runtime complimentary DbRelationship from ARTIST to PAINTING1
May 26, 2014 2:37:14 AM org.apache.cayenne.test.jdbc.UtilityLogger log
INFO: delete from PAINTING_INFO
May 26, 2014 2:37:14 AM org.apache.cayenne.test.jdbc.UtilityLogger log
INFO: delete from PAINTING
May 26, 2014 2:37:14 AM org.apache.cayenne.test.jdbc.UtilityLogger log
INFO: delete from PAINTING1
May 26, 2014 2:37:14 AM org.apache.cayenne.test.jdbc.UtilityLogger log
INFO: delete from ARTIST_EXHIBIT
May 26, 2014 2:37:14 AM org.apache.cayenne.test.jdbc.UtilityLogger log
INFO: delete from ARTIST_GROUP
May 26, 2014 2:37:14 AM org.apache.cayenne.test.jdbc.UtilityLogger log
INFO: delete from ARTIST
May 26, 2014 2:37:14 AM org.apache.cayenne.log.CommonsJdbcEventLogger logBeginTransaction
INFO: --- transaction started.
May 26, 2014 2:37:14 AM org.apache.cayenne.log.CommonsJdbcEventLogger logQuery
INFO: INSERT INTO ARTIST (ARTIST_ID, ARTIST_NAME, DATE_OF_BIRTH) VALUES (?, ?, ?)
May 26, 2014 2:37:14 AM org.apache.cayenne.log.CommonsJdbcEventLogger logQueryParameters
INFO: [batch bind: 1->ARTIST_ID:271, 2->ARTIST_NAME:'X', 3->DATE_OF_BIRTH:'2014-05-26 02:37:14.435']
May 26, 2014 2:37:14 AM org.apache.cayenne.log.CommonsJdbcEventLogger logUpdateCount
INFO: === updated 1 row.
May 26, 2014 2:37:14 AM org.apache.cayenne.log.CommonsJdbcEventLogger logCommitTransaction
INFO: +++ transaction committed.
May 26, 2014 2:37:14 AM org.apache.cayenne.log.CommonsJdbcEventLogger logBeginTransaction
INFO: --- transaction started.
May 26, 2014 2:37:14 AM org.apache.cayenne.log.CommonsJdbcEventLogger logQuery
INFO: UPDATE ARTIST SET DATE_OF_BIRTH = NULL
May 26, 2014 2:37:14 AM org.apache.cayenne.log.CommonsJdbcEventLogger logUpdateCount
INFO: === updated 1 row.
May 26, 2014 2:37:14 AM org.apache.cayenne.log.CommonsJdbcEventLogger logCommitTransaction
INFO: +++ transaction committed.
May 26, 2014 2:37:14 AM org.apache.cayenne.log.CommonsJdbcEventLogger logBeginTransaction
INFO: --- transaction started.
May 26, 2014 2:37:14 AM org.apache.cayenne.log.CommonsJdbcEventLogger logQuery
INFO: SELECT t0.ARTIST_NAME, t0.DATE_OF_BIRTH, t0.ARTIST_ID FROM ARTIST t0 WHERE t0.ARTIST_ID = ? [bind: 1->ARTIST_ID:271]
May 26, 2014 2:37:14 AM org.apache.cayenne.log.CommonsJdbcEventLogger logSelectCount
INFO: === returned 1 row. - took 1 ms.
May 26, 2014 2:37:14 AM org.apache.cayenne.log.CommonsJdbcEventLogger logCommitTransaction
INFO: +++ transaction committed.
May 26, 2014 2:37:14 AM org.apache.cayenne.configuration.XMLDataChannelDescriptorLoader load
INFO: Loading XML configuration resource from <https://builds.apache.org/job/cayenne-master/cayenneTestConnection=derby,jdk=jdk-1.8.0,label=Ubuntu/ws/cayenne-server/target/test-classes/cayenne-testmap.xml>
May 26, 2014 2:37:14 AM org.apache.cayenne.configuration.XMLDataChannelDescriptorLoader$DataChannelChildrenHandler createChildTagHandler
INFO: Loading XML DataMap resource from <https://builds.apache.org/job/cayenne-master/cayenneTestConnection=derby,jdk=jdk-1.8.0,label=Ubuntu/ws/cayenne-server/target/test-classes/tstmap.map.xml>
May 26, 2014 2:37:14 AM org.apache.cayenne.map.EntityResolver applyDBLayerDefaults
INFO: added runtime complimentary DbRelationship from ARTIST to PAINTING1
May 26, 2014 2:37:14 AM org.apache.cayenne.test.jdbc.UtilityLogger log
INFO: delete from PAINTING_INFO
May 26, 2014 2:37:14 AM org.apache.cayenne.test.jdbc.UtilityLogger log
INFO: delete from PAINTING
May 26, 2014 2:37:14 AM org.apache.cayenne.test.jdbc.UtilityLogger log
INFO: delete from PAINTING1
May 26, 2014 2:37:14 AM org.apache.cayenne.test.jdbc.UtilityLogger log
INFO: delete from ARTIST_EXHIBIT
May 26, 2014 2:37:14 AM org.apache.cayenne.test.jdbc.UtilityLogger log
INFO: delete from ARTIST_GROUP
May 26, 2014 2:37:14 AM org.apache.cayenne.test.jdbc.UtilityLogger log
INFO: delete from ARTIST
May 26, 2014 2:37:14 AM org.apache.cayenne.log.CommonsJdbcEventLogger logBeginTransaction
INFO: --- transaction started.
May 26, 2014 2:37:14 AM org.apache.cayenne.log.CommonsJdbcEventLogger logQuery
INFO: INSERT INTO ARTIST (ARTIST_ID, ARTIST_NAME, DATE_OF_BIRTH) VALUES (?, ?, ?)
May 26, 2014 2:37:14 AM org.apache.cayenne.log.CommonsJdbcEventLogger logQueryParameters
INFO: [batch bind: 1->ARTIST_ID:272, 2->ARTIST_NAME:'X', 3->DATE_OF_BIRTH:NULL]
May 26, 2014 2:37:14 AM org.apache.cayenne.log.CommonsJdbcEventLogger logUpdateCount
INFO: === updated 1 row.
May 26, 2014 2:37:14 AM org.apache.cayenne.log.CommonsJdbcEventLogger logCommitTransaction
INFO: +++ transaction committed.
May 26, 2014 2:37:14 AM org.apache.cayenne.log.CommonsJdbcEventLogger logBeginTransaction
INFO: --- transaction started.
May 26, 2014 2:37:14 AM org.apache.cayenne.log.CommonsJdbcEventLogger logQuery
INFO: UPDATE ARTIST SET ARTIST_NAME = 'Y'
May 26, 2014 2:37:14 AM org.apache.cayenne.log.CommonsJdbcEventLogger logUpdateCount
INFO: === updated 1 row.
May 26, 2014 2:37:14 AM org.apache.cayenne.log.CommonsJdbcEventLogger logCommitTransaction
INFO: +++ transaction committed.
Tests run: 3, Failures: 0, Errors: 0, Skipped: 0, Time elapsed: 0.957 sec
Running org.apache.cayenne.cache.MapQueryCacheTest
Tests run: 1, Failures: 0, Errors: 0, Skipped: 0, Time elapsed: 0.004 sec
Running org.apache.cayenne.reflect.PropertyUtilsTest
Tests run: 10, Failures: 0, Errors: 0, Skipped: 0, Time elapsed: 0.014 sec
Results :
Tests in error:
testNullifyToOne(org.apache.cayenne.access.DataContextDeleteRulesTest)
testDenyToMany(org.apache.cayenne.access.DataContextDeleteRulesTest)
testCascadeToManyFlattened(org.apache.cayenne.access.DataContextDeleteRulesTest)
testNullifyToMany(org.apache.cayenne.access.DataContextDeleteRulesTest)
testNullifyToManyFlattened(org.apache.cayenne.access.DataContextDeleteRulesTest)
testCascadeToMany(org.apache.cayenne.access.DataContextDeleteRulesTest)
testCascadeToOne(org.apache.cayenne.access.DataContextDeleteRulesTest)
testSelectWithOuterJoinFromString(org.apache.cayenne.access.DataContextOuterJoinsTest)
testSelectWithOuterJoinFlattened(org.apache.cayenne.access.DataContextOuterJoinsTest)
testSelectWithOuterOrdering(org.apache.cayenne.access.DataContextOuterJoinsTest)
testSelectWithOuterJoin(org.apache.cayenne.access.DataContextOuterJoinsTest)
testNullClob(org.apache.cayenne.access.DataContextClobTest)
testEmptyClob(org.apache.cayenne.access.DataContextClobTest)
test5KByteClob(org.apache.cayenne.access.DataContextClobTest)
test5ByteClob(org.apache.cayenne.access.DataContextClobTest)
test1MBClob(org.apache.cayenne.access.DataContextClobTest)
testReadRelationship(org.apache.cayenne.CDOOneToManyFKTest)
Tests run: 2053, Failures: 0, Errors: 17, Skipped: 0
[INFO] ------------------------------------------------------------------------
[INFO] Reactor Summary:
[INFO]
[INFO] Cayenne ........................................... SUCCESS [0.325s]
[INFO] Cayenne Build Tools Parent ........................ SUCCESS [0.010s]
[INFO] Cayenne License and Notice Bundle ................. SUCCESS [1.292s]
[INFO] Common Unit Test Utilities ........................ SUCCESS [1.067s]
[INFO] Cayenne Dependency Injection Container ............ SUCCESS [3.359s]
[INFO] Cayenne Server .................................... FAILURE [11:28.149s]
[INFO] Cayenne ROP Client ................................ SKIPPED
[INFO] Cayenne Project ................................... SKIPPED
[INFO] Cayenne Tools ..................................... SKIPPED
[INFO] Cayenne Lifecycle Utilities ....................... SKIPPED
[INFO] Cayenne Maven Plugins ............................. SKIPPED
[INFO] Cayenne Maven Plugin .............................. SKIPPED
[INFO] Cayenne Cryptography Extensions ................... SKIPPED
[INFO] Cayenne Integration Tests Parent .................. SKIPPED
[INFO] Integration Tests - Cayenne Tools ................. SKIPPED
[INFO] Cayenne Modeler Parent ............................ SKIPPED
[INFO] Cayenne WebObjects Compatibility Library .......... SKIPPED
[INFO] Cayenne Modeler ................................... SKIPPED
[INFO] Cayenne Modeler Maven Plugin ...................... SKIPPED
[INFO] Cayenne Tutorial .................................. SKIPPED
[INFO] Cayenne ROP Server Tutorial ....................... SKIPPED
[INFO] Cayenne ROP Client Tutorial ....................... SKIPPED
[INFO] Cayenne Tutorials ................................. SKIPPED
[INFO] Cayenne Documenation Parent ....................... SKIPPED
[INFO] Cayenne Documentation ............................. SKIPPED
[INFO] Cayenne Docbook Documentation ..................... SKIPPED
[INFO] Docbook: Cayenne Stylesheets ...................... SKIPPED
[INFO] Docbook: Cayenne Guide ............................ SKIPPED
[INFO] Docbook: Getting Started with Cayenne ............. SKIPPED
[INFO] Docbook: Getting Started with Cayenne ROP ......... SKIPPED
[INFO] Docbook: Cayenne New Features and Upgrade Guide ... SKIPPED
[INFO] ------------------------------------------------------------------------
[INFO] BUILD FAILURE
[INFO] ------------------------------------------------------------------------
[INFO] Total time: 11:34.831s
[INFO] Finished at: Mon May 26 02:37:15 UTC 2014
[INFO] Final Memory: 50M/219M
[INFO] ------------------------------------------------------------------------
[ERROR] Failed to execute goal org.apache.maven.plugins:maven-surefire-plugin:2.5:test (default-test) on project cayenne-server: There are test failures.
[ERROR]
[ERROR] Please refer to <https://builds.apache.org/job/cayenne-master/cayenneTestConnection=derby,jdk=jdk-1.8.0,label=Ubuntu/ws/cayenne-server/target/surefire-reports> for the individual test results.
[ERROR] -> [Help 1]
org.apache.maven.lifecycle.LifecycleExecutionException: Failed to execute goal org.apache.maven.plugins:maven-surefire-plugin:2.5:test (default-test) on project cayenne-server: There are test failures.
Please refer to <https://builds.apache.org/job/cayenne-master/cayenneTestConnection=derby,jdk=jdk-1.8.0,label=Ubuntu/ws/cayenne-server/target/surefire-reports> for the individual test results.
at org.apache.maven.lifecycle.internal.MojoExecutor.execute(MojoExecutor.java:213)
at org.apache.maven.lifecycle.internal.MojoExecutor.execute(MojoExecutor.java:153)
at org.apache.maven.lifecycle.internal.MojoExecutor.execute(MojoExecutor.java:145)
at org.apache.maven.lifecycle.internal.LifecycleModuleBuilder.buildProject(LifecycleModuleBuilder.java:84)
at org.apache.maven.lifecycle.internal.LifecycleModuleBuilder.buildProject(LifecycleModuleBuilder.java:59)
at org.apache.maven.lifecycle.internal.LifecycleStarter.singleThreadedBuild(LifecycleStarter.java:183)
at org.apache.maven.lifecycle.internal.LifecycleStarter.execute(LifecycleStarter.java:161)
at org.apache.maven.DefaultMaven.doExecute(DefaultMaven.java:320)
at org.apache.maven.DefaultMaven.execute(DefaultMaven.java:156)
at org.apache.maven.cli.MavenCli.execute(MavenCli.java:537)
at org.apache.maven.cli.MavenCli.doMain(MavenCli.java:196)
at org.apache.maven.cli.MavenCli.main(MavenCli.java:141)
at sun.reflect.NativeMethodAccessorImpl.invoke0(Native Method)
at sun.reflect.NativeMethodAccessorImpl.invoke(NativeMethodAccessorImpl.java:62)
at sun.reflect.DelegatingMethodAccessorImpl.invoke(DelegatingMethodAccessorImpl.java:43)
at java.lang.reflect.Method.invoke(Method.java:483)
at org.codehaus.plexus.classworlds.launcher.Launcher.launchEnhanced(Launcher.java:290)
at org.codehaus.plexus.classworlds.launcher.Launcher.launch(Launcher.java:230)
at org.codehaus.plexus.classworlds.launcher.Launcher.mainWithExitCode(Launcher.java:409)
at org.codehaus.plexus.classworlds.launcher.Launcher.main(Launcher.java:352)
Caused by: org.apache.maven.plugin.MojoFailureException: There are test failures.
Please refer to <https://builds.apache.org/job/cayenne-master/cayenneTestConnection=derby,jdk=jdk-1.8.0,label=Ubuntu/ws/cayenne-server/target/surefire-reports> for the individual test results.
at org.apache.maven.plugin.surefire.SurefirePlugin.execute(SurefirePlugin.java:629)
at org.apache.maven.plugin.DefaultBuildPluginManager.executeMojo(DefaultBuildPluginManager.java:101)
at org.apache.maven.lifecycle.internal.MojoExecutor.execute(MojoExecutor.java:209)
... 19 more
[ERROR]
[ERROR] Re-run Maven using the -X switch to enable full debug logging.
[ERROR]
[ERROR] For more information about the errors and possible solutions, please read the following articles:
[ERROR] [Help 1] http://cwiki.apache.org/confluence/display/MAVEN/MojoFailureException
[ERROR]
[ERROR] After correcting the problems, you can resume the build with the command
[ERROR] mvn <goals> -rf :cayenne-server
Build step 'Invoke top-level Maven targets' marked build as failure