You are viewing a plain text version of this content. The canonical link for it is here.
Posted to builds@beam.apache.org by Apache Jenkins Server <je...@builds.apache.org> on 2023/06/02 21:07:09 UTC
Build failed in Jenkins: beam_PostCommit_Java_ValidatesRunner_Spark #11843
See <https://ci-beam.apache.org/job/beam_PostCommit_Java_ValidatesRunner_Spark/11843/display/redirect>
Changes:
------------------------------------------
[...truncated 123.23 KB...]
java.lang.StackOverflowError at JDK14LoggerAdapter.java:595
org.apache.beam.sdk.transforms.ParDoSchemaTest > testSimpleSchemaPipeline FAILED
java.lang.StackOverflowError at JDK14LoggerAdapter.java:581
org.apache.beam.sdk.transforms.windowing.WindowingTest > testMergingWindowing FAILED
java.lang.StackOverflowError at JDK14LoggerAdapter.java:595
org.apache.beam.sdk.transforms.join.CoGroupByKeyTest > testCoGroupByKeyWithWindowing FAILED
java.lang.StackOverflowError at JDK14LoggerAdapter.java:595
org.apache.beam.sdk.transforms.ReshuffleTest > testReshuffleAfterSessionsAndGroupByKey FAILED
java.lang.StackOverflowError at Throwable.java:825
org.apache.beam.sdk.transforms.ParDoSchemaTest > testSchemaConversionPipeline FAILED
java.lang.StackOverflowError at JDK14LoggerAdapter.java:581
org.apache.beam.sdk.transforms.windowing.WindowingTest > testWindowPreservation FAILED
java.lang.StackOverflowError at JDK14LoggerAdapter.java:581
org.apache.beam.sdk.values.PCollectionRowTupleTest > testComposePCollectionRowTuple FAILED
java.lang.StackOverflowError at JDK14LoggerAdapter.java:595
org.apache.beam.sdk.transforms.ReshuffleTest > testReshuffleAfterFixedWindows FAILED
java.lang.StackOverflowError at Throwable.java:825
org.apache.beam.sdk.transforms.ParDoSchemaTest > testReadAndWriteWithSchemaRegistry FAILED
java.lang.StackOverflowError at JDK14LoggerAdapter.java:581
org.apache.beam.sdk.transforms.windowing.WindowingTest > testNonPartitioningWindowing FAILED
java.lang.StackOverflowError at JDK14LoggerAdapter.java:595
org.apache.beam.sdk.transforms.ReshuffleTest > testReshuffleAfterFixedWindowsAndGroupByKey FAILED
java.lang.StackOverflowError at Throwable.java:825
org.apache.beam.sdk.transforms.ParDoSchemaTest > testReadAndWriteMultiOutput FAILED
java.lang.StackOverflowError at JDK14LoggerAdapter.java:595
org.apache.beam.sdk.transforms.windowing.WindowingTest > testPartitioningWindowing FAILED
java.lang.StackOverflowError at JDK14LoggerAdapter.java:595
org.apache.beam.sdk.transforms.ReshuffleTest > testReshuffleAfterSlidingWindows FAILED
java.lang.StackOverflowError at Throwable.java:825
org.apache.beam.sdk.transforms.ParDoSchemaTest > testNestedSchema FAILED
java.lang.StackOverflowError at JDK14LoggerAdapter.java:581
org.apache.beam.sdk.transforms.ReshuffleTest > testReshufflePreservesTimestamps FAILED
java.lang.StackOverflowError at Throwable.java:825
org.apache.beam.sdk.transforms.ReshuffleTest > testReshuffleAfterSlidingWindowsAndGroupByKey FAILED
java.lang.StackOverflowError at Throwable.java:825
org.apache.beam.sdk.transforms.ReshuffleTest > testJustReshuffle FAILED
java.lang.StackOverflowError at Throwable.java:825
org.apache.beam.sdk.transforms.ViewTest > testEmptySingletonSideInput FAILED
java.lang.AssertionError at MatcherAssert.java:18
org.apache.beam.sdk.transforms.ViewTest > testMapAsEntrySetSideInput FAILED
java.lang.StackOverflowError at JDK14LoggerAdapter.java:581
org.apache.beam.sdk.transforms.ViewTest > testNonSingletonSideInput FAILED
java.lang.AssertionError at MatcherAssert.java:18
org.apache.beam.sdk.transforms.ViewTest > testMultimapSideInput FAILED
java.lang.StackOverflowError at JDK14LoggerAdapter.java:581
org.apache.beam.sdk.transforms.ViewTest > testEmptyIterableSideInput FAILED
java.lang.StackOverflowError at JDK14LoggerAdapter.java:581
org.apache.beam.sdk.transforms.ViewTest > testMapSideInputWithNullValuesCatchesDuplicates FAILED
java.lang.AssertionError at MatcherAssert.java:18
org.apache.beam.sdk.transforms.ViewTest > testSideInputWithNestedIterables FAILED
java.lang.StackOverflowError at JDK14LoggerAdapter.java:581
org.apache.beam.sdk.transforms.ViewTest > testListSideInput FAILED
java.lang.StackOverflowError at JDK14LoggerAdapter.java:581
org.apache.beam.sdk.transforms.ViewTest > testMapSideInput FAILED
java.lang.StackOverflowError at JDK14LoggerAdapter.java:581
org.apache.beam.sdk.transforms.ViewTest > testWindowedSideInputFixedToFixedWithDefault FAILED
java.lang.StackOverflowError at JDK14LoggerAdapter.java:581
org.apache.beam.sdk.transforms.ViewTest > testWindowedIterableSideInput FAILED
java.lang.StackOverflowError at JDK14LoggerAdapter.java:581
org.apache.beam.sdk.transforms.ViewTest > testWindowedMapSideInputWithNonDeterministicKeyCoder FAILED
java.lang.StackOverflowError at JDK14LoggerAdapter.java:581
org.apache.beam.sdk.transforms.ViewTest > testWindowedSideInputFixedToGlobal FAILED
java.lang.StackOverflowError at JDK14LoggerAdapter.java:581
org.apache.beam.sdk.transforms.ViewTest > testMultimapSideInputWithNonDeterministicKeyCoder FAILED
java.lang.StackOverflowError at JDK14LoggerAdapter.java:581
org.apache.beam.sdk.transforms.ViewTest > testEmptyMultimapSideInput FAILED
java.lang.StackOverflowError at JDK14LoggerAdapter.java:581
org.apache.beam.sdk.transforms.ViewTest > testDiscardingNonSingletonSideInput FAILED
java.lang.AssertionError at MatcherAssert.java:18
org.apache.beam.sdk.transforms.ViewTest > testCombinedMapSideInput FAILED
java.lang.StackOverflowError at JDK14LoggerAdapter.java:581
org.apache.beam.sdk.transforms.ViewTest > testMultimapSideInputIsImmutable FAILED
java.lang.StackOverflowError at JDK14LoggerAdapter.java:581
org.apache.beam.sdk.transforms.ViewTest > testWindowedMultimapAsEntrySetSideInput FAILED
java.lang.StackOverflowError at JDK14LoggerAdapter.java:581
org.apache.beam.sdk.transforms.ViewTest > testWindowedMultimapSideInputWithNonDeterministicKeyCoder FAILED
java.lang.StackOverflowError at JDK14LoggerAdapter.java:581
org.apache.beam.sdk.transforms.ViewTest > testMapSideInputWithNonDeterministicKeyCoder FAILED
java.lang.StackOverflowError at JDK14LoggerAdapter.java:581
org.apache.beam.sdk.transforms.ViewTest > testWindowedSingletonSideInput FAILED
java.lang.StackOverflowError at JDK14LoggerAdapter.java:581
org.apache.beam.sdk.transforms.ViewTest > testWindowedMultimapSideInput FAILED
java.lang.StackOverflowError at JDK14LoggerAdapter.java:581
org.apache.beam.sdk.transforms.ViewTest > testSideInputWithNullDefault FAILED
java.lang.StackOverflowError at JDK14LoggerAdapter.java:581
org.apache.beam.sdk.transforms.ViewTest > testWindowedListSideInput FAILED
java.lang.StackOverflowError at JDK14LoggerAdapter.java:581
org.apache.beam.sdk.transforms.ViewTest > testWindowedMapSideInput FAILED
java.lang.StackOverflowError at JDK14LoggerAdapter.java:581
org.apache.beam.sdk.transforms.ViewTest > testIterableSideInputIsImmutable FAILED
java.lang.StackOverflowError at JDK14LoggerAdapter.java:581
org.apache.beam.sdk.transforms.ViewTest > testListSideInputIsImmutable FAILED
java.lang.StackOverflowError at JDK14LoggerAdapter.java:581
org.apache.beam.sdk.transforms.ViewTest > testEmptyListSideInput FAILED
java.lang.StackOverflowError at JDK14LoggerAdapter.java:581
org.apache.beam.sdk.transforms.ViewTest > testWindowedSideInputFixedToFixed FAILED
java.lang.StackOverflowError at JDK14LoggerAdapter.java:581
org.apache.beam.sdk.transforms.ViewTest > testIterableSideInput FAILED
java.lang.StackOverflowError at JDK14LoggerAdapter.java:581
org.apache.beam.sdk.transforms.ViewTest > testEmptyMultimapSideInputWithNonDeterministicKeyCoder FAILED
java.lang.StackOverflowError at JDK14LoggerAdapter.java:581
org.apache.beam.sdk.transforms.ViewTest > testEmptyMapSideInput FAILED
java.lang.StackOverflowError at JDK14LoggerAdapter.java:581
org.apache.beam.sdk.transforms.ViewTest > testMapSideInputIsImmutable FAILED
java.lang.StackOverflowError at JDK14LoggerAdapter.java:581
org.apache.beam.sdk.transforms.ViewTest > testWindowedMapAsEntrySetSideInput FAILED
java.lang.StackOverflowError at JDK14LoggerAdapter.java:581
org.apache.beam.sdk.transforms.ViewTest > testEmptyMapSideInputWithNonDeterministicKeyCoder FAILED
java.lang.StackOverflowError at JDK14LoggerAdapter.java:581
org.apache.beam.sdk.transforms.ViewTest > testMultimapAsEntrySetSideInput FAILED
java.lang.StackOverflowError at JDK14LoggerAdapter.java:581
org.apache.beam.sdk.transforms.ViewTest > testSingletonSideInput FAILED
java.lang.StackOverflowError at JDK14LoggerAdapter.java:581
org.apache.beam.sdk.transforms.windowing.WindowTest > testTimestampCombinerEndOfWindow FAILED
java.lang.StackOverflowError at JDK14LoggerAdapter.java:595
org.apache.beam.sdk.transforms.windowing.WindowTest > testTimestampCombinerDefault FAILED
java.lang.StackOverflowError at JDK14LoggerAdapter.java:595
org.apache.beam.sdk.transforms.windowing.WindowTest > testMergingCustomWindows FAILED
java.lang.StackOverflowError at JDK14LoggerAdapter.java:581
org.apache.beam.sdk.transforms.windowing.WindowTest > testNoWindowFnDoesNotReassignWindows FAILED
java.lang.StackOverflowError at JDK14LoggerAdapter.java:595
org.apache.beam.sdk.transforms.windowing.WindowTest > testMergingCustomWindowsWithoutCustomWindowTypes FAILED
java.lang.StackOverflowError at JDK14LoggerAdapter.java:581
org.apache.beam.sdk.transforms.windowing.WindowTest > testMergingCustomWindowsKeyedCollection FAILED
java.lang.StackOverflowError at JDK14LoggerAdapter.java:581
org.apache.beam.sdk.values.PCollectionTupleTest > testComposePCollectionTuple FAILED
java.lang.StackOverflowError at JDK14LoggerAdapter.java:595
org.apache.beam.runners.core.metrics.MetricsPusherTest > pushesUserMetrics FAILED
java.lang.StackOverflowError at LoggerFactory.java:362
227 tests completed, 219 failed, 1 skipped
> Task :runners:spark:3:validatesRunnerStreaming FAILED
FAILURE: Build completed with 3 failures.
1: Task failed with an exception.
-----------
* What went wrong:
Execution failed for task ':runners:spark:3:validatesRunnerBatch'.
> There were failing tests. See the report at: file://<https://ci-beam.apache.org/job/beam_PostCommit_Java_ValidatesRunner_Spark/ws/src/runners/spark/3/build/reports/tests/validatesRunnerBatch/index.html>
* Try:
> Run with --stacktrace option to get the stack trace.
> Run with --info or --debug option to get more log output.
==============================================================================
2: Task failed with an exception.
-----------
* What went wrong:
Execution failed for task ':runners:spark:3:validatesRunnerBatchWithBoundedSDFExperiment'.
> There were failing tests. See the report at: file://<https://ci-beam.apache.org/job/beam_PostCommit_Java_ValidatesRunner_Spark/ws/src/runners/spark/3/build/reports/tests/validatesRunnerBatchWithBoundedSDFExperiment/index.html>
* Try:
> Run with --stacktrace option to get the stack trace.
> Run with --info or --debug option to get more log output.
==============================================================================
3: Task failed with an exception.
-----------
* What went wrong:
Execution failed for task ':runners:spark:3:validatesRunnerStreaming'.
> There were failing tests. See the report at: file://<https://ci-beam.apache.org/job/beam_PostCommit_Java_ValidatesRunner_Spark/ws/src/runners/spark/3/build/reports/tests/validatesRunnerStreaming/index.html>
* Try:
> Run with --stacktrace option to get the stack trace.
> Run with --info or --debug option to get more log output.
==============================================================================
* Get more help at https://help.gradle.org
Deprecated Gradle features were used in this build, making it incompatible with Gradle 8.0.
You can use '--warning-mode all' to show the individual deprecation warnings and determine if they come from your own scripts or plugins.
See https://docs.gradle.org/7.5.1/userguide/command_line_interface.html#sec:command_line_warnings
BUILD FAILED in 13m 43s
143 actionable tasks: 87 executed, 54 from cache, 2 up-to-date
Publishing build scan...
https://ge.apache.org/s/e6hp2dkt2sjbk
Build step 'Invoke Gradle script' changed build result to FAILURE
Build step 'Invoke Gradle script' marked build as failure
---------------------------------------------------------------------
To unsubscribe, e-mail: builds-unsubscribe@beam.apache.org
For additional commands, e-mail: builds-help@beam.apache.org
Jenkins build is back to normal : beam_PostCommit_Java_ValidatesRunner_Spark #11854
Posted by Apache Jenkins Server <je...@builds.apache.org>.
See <https://ci-beam.apache.org/job/beam_PostCommit_Java_ValidatesRunner_Spark/11854/display/redirect?page=changes>
---------------------------------------------------------------------
To unsubscribe, e-mail: builds-unsubscribe@beam.apache.org
For additional commands, e-mail: builds-help@beam.apache.org
Build failed in Jenkins: beam_PostCommit_Java_ValidatesRunner_Spark #11853
Posted by Apache Jenkins Server <je...@builds.apache.org>.
See <https://ci-beam.apache.org/job/beam_PostCommit_Java_ValidatesRunner_Spark/11853/display/redirect>
Changes:
------------------------------------------
[...truncated 123.21 KB...]
java.lang.StackOverflowError at JDK14LoggerAdapter.java:595
org.apache.beam.sdk.transforms.ParDoSchemaTest > testSimpleSchemaPipeline FAILED
java.lang.StackOverflowError at JDK14LoggerAdapter.java:581
org.apache.beam.sdk.transforms.windowing.WindowingTest > testMergingWindowing FAILED
java.lang.StackOverflowError at JDK14LoggerAdapter.java:595
org.apache.beam.sdk.transforms.ReshuffleTest > testReshuffleAfterSessionsAndGroupByKey FAILED
java.lang.StackOverflowError at Throwable.java:825
org.apache.beam.sdk.transforms.join.CoGroupByKeyTest > testCoGroupByKeyWithWindowing FAILED
java.lang.StackOverflowError at JDK14LoggerAdapter.java:595
org.apache.beam.sdk.transforms.ParDoSchemaTest > testSchemaConversionPipeline FAILED
java.lang.StackOverflowError at JDK14LoggerAdapter.java:581
org.apache.beam.sdk.transforms.windowing.WindowingTest > testWindowPreservation FAILED
java.lang.StackOverflowError at JDK14LoggerAdapter.java:581
org.apache.beam.sdk.transforms.ReshuffleTest > testReshuffleAfterFixedWindows FAILED
java.lang.StackOverflowError at Throwable.java:825
org.apache.beam.sdk.values.PCollectionRowTupleTest > testComposePCollectionRowTuple FAILED
java.lang.StackOverflowError at JDK14LoggerAdapter.java:595
org.apache.beam.sdk.transforms.ParDoSchemaTest > testReadAndWriteWithSchemaRegistry FAILED
java.lang.StackOverflowError at JDK14LoggerAdapter.java:581
org.apache.beam.sdk.transforms.windowing.WindowingTest > testNonPartitioningWindowing FAILED
java.lang.StackOverflowError at JDK14LoggerAdapter.java:595
org.apache.beam.sdk.transforms.ReshuffleTest > testReshuffleAfterFixedWindowsAndGroupByKey FAILED
java.lang.StackOverflowError at Throwable.java:825
org.apache.beam.sdk.transforms.ParDoSchemaTest > testReadAndWriteMultiOutput FAILED
java.lang.StackOverflowError at JDK14LoggerAdapter.java:595
org.apache.beam.sdk.transforms.ReshuffleTest > testReshuffleAfterSlidingWindows FAILED
java.lang.StackOverflowError at Throwable.java:825
org.apache.beam.sdk.transforms.windowing.WindowingTest > testPartitioningWindowing FAILED
java.lang.StackOverflowError at JDK14LoggerAdapter.java:595
org.apache.beam.sdk.transforms.ParDoSchemaTest > testNestedSchema FAILED
java.lang.StackOverflowError at JDK14LoggerAdapter.java:581
org.apache.beam.sdk.transforms.ReshuffleTest > testReshufflePreservesTimestamps FAILED
java.lang.StackOverflowError at Throwable.java:825
org.apache.beam.sdk.transforms.ReshuffleTest > testReshuffleAfterSlidingWindowsAndGroupByKey FAILED
java.lang.StackOverflowError at Throwable.java:825
org.apache.beam.sdk.transforms.ReshuffleTest > testJustReshuffle FAILED
java.lang.StackOverflowError at Throwable.java:825
org.apache.beam.sdk.transforms.ViewTest > testEmptySingletonSideInput FAILED
java.lang.AssertionError at MatcherAssert.java:18
org.apache.beam.sdk.transforms.ViewTest > testMapAsEntrySetSideInput FAILED
java.lang.StackOverflowError at JDK14LoggerAdapter.java:581
org.apache.beam.sdk.transforms.ViewTest > testNonSingletonSideInput FAILED
java.lang.AssertionError at MatcherAssert.java:18
org.apache.beam.sdk.transforms.ViewTest > testMultimapSideInput FAILED
java.lang.StackOverflowError at JDK14LoggerAdapter.java:581
org.apache.beam.sdk.transforms.ViewTest > testEmptyIterableSideInput FAILED
java.lang.StackOverflowError at JDK14LoggerAdapter.java:581
org.apache.beam.sdk.transforms.ViewTest > testMapSideInputWithNullValuesCatchesDuplicates FAILED
java.lang.AssertionError at MatcherAssert.java:18
org.apache.beam.sdk.transforms.ViewTest > testSideInputWithNestedIterables FAILED
java.lang.StackOverflowError at JDK14LoggerAdapter.java:581
org.apache.beam.sdk.transforms.ViewTest > testListSideInput FAILED
java.lang.StackOverflowError at JDK14LoggerAdapter.java:581
org.apache.beam.sdk.transforms.ViewTest > testMapSideInput FAILED
java.lang.StackOverflowError at JDK14LoggerAdapter.java:581
org.apache.beam.sdk.transforms.ViewTest > testWindowedSideInputFixedToFixedWithDefault FAILED
java.lang.StackOverflowError at JDK14LoggerAdapter.java:581
org.apache.beam.sdk.transforms.ViewTest > testWindowedIterableSideInput FAILED
java.lang.StackOverflowError at JDK14LoggerAdapter.java:581
org.apache.beam.sdk.transforms.ViewTest > testWindowedMapSideInputWithNonDeterministicKeyCoder FAILED
java.lang.StackOverflowError at JDK14LoggerAdapter.java:581
org.apache.beam.sdk.transforms.ViewTest > testWindowedSideInputFixedToGlobal FAILED
java.lang.StackOverflowError at JDK14LoggerAdapter.java:581
org.apache.beam.sdk.transforms.ViewTest > testMultimapSideInputWithNonDeterministicKeyCoder FAILED
java.lang.StackOverflowError at JDK14LoggerAdapter.java:581
org.apache.beam.sdk.transforms.ViewTest > testEmptyMultimapSideInput FAILED
java.lang.StackOverflowError at JDK14LoggerAdapter.java:581
org.apache.beam.sdk.transforms.ViewTest > testDiscardingNonSingletonSideInput FAILED
java.lang.AssertionError at MatcherAssert.java:18
org.apache.beam.sdk.transforms.ViewTest > testCombinedMapSideInput FAILED
java.lang.StackOverflowError at JDK14LoggerAdapter.java:581
org.apache.beam.sdk.transforms.ViewTest > testMultimapSideInputIsImmutable FAILED
java.lang.StackOverflowError at JDK14LoggerAdapter.java:581
org.apache.beam.sdk.transforms.ViewTest > testWindowedMultimapAsEntrySetSideInput FAILED
java.lang.StackOverflowError at JDK14LoggerAdapter.java:581
org.apache.beam.sdk.transforms.ViewTest > testWindowedMultimapSideInputWithNonDeterministicKeyCoder FAILED
java.lang.StackOverflowError at JDK14LoggerAdapter.java:581
org.apache.beam.sdk.transforms.ViewTest > testMapSideInputWithNonDeterministicKeyCoder FAILED
java.lang.StackOverflowError at JDK14LoggerAdapter.java:581
org.apache.beam.sdk.transforms.ViewTest > testWindowedSingletonSideInput FAILED
java.lang.StackOverflowError at JDK14LoggerAdapter.java:581
org.apache.beam.sdk.transforms.ViewTest > testWindowedMultimapSideInput FAILED
java.lang.StackOverflowError at JDK14LoggerAdapter.java:581
org.apache.beam.sdk.transforms.ViewTest > testSideInputWithNullDefault FAILED
java.lang.StackOverflowError at JDK14LoggerAdapter.java:581
org.apache.beam.sdk.transforms.ViewTest > testWindowedListSideInput FAILED
java.lang.StackOverflowError at JDK14LoggerAdapter.java:581
org.apache.beam.sdk.transforms.ViewTest > testWindowedMapSideInput FAILED
java.lang.StackOverflowError at JDK14LoggerAdapter.java:581
org.apache.beam.sdk.transforms.ViewTest > testIterableSideInputIsImmutable FAILED
java.lang.StackOverflowError at JDK14LoggerAdapter.java:581
org.apache.beam.sdk.transforms.ViewTest > testListSideInputIsImmutable FAILED
java.lang.StackOverflowError at JDK14LoggerAdapter.java:581
org.apache.beam.sdk.transforms.ViewTest > testEmptyListSideInput FAILED
java.lang.StackOverflowError at JDK14LoggerAdapter.java:581
org.apache.beam.sdk.transforms.ViewTest > testWindowedSideInputFixedToFixed FAILED
java.lang.StackOverflowError at JDK14LoggerAdapter.java:581
org.apache.beam.sdk.transforms.ViewTest > testIterableSideInput FAILED
java.lang.StackOverflowError at JDK14LoggerAdapter.java:581
org.apache.beam.sdk.transforms.ViewTest > testEmptyMultimapSideInputWithNonDeterministicKeyCoder FAILED
java.lang.StackOverflowError at JDK14LoggerAdapter.java:581
org.apache.beam.sdk.transforms.ViewTest > testEmptyMapSideInput FAILED
java.lang.StackOverflowError at JDK14LoggerAdapter.java:581
org.apache.beam.sdk.transforms.ViewTest > testMapSideInputIsImmutable FAILED
java.lang.StackOverflowError at JDK14LoggerAdapter.java:581
org.apache.beam.sdk.transforms.ViewTest > testWindowedMapAsEntrySetSideInput FAILED
java.lang.StackOverflowError at JDK14LoggerAdapter.java:581
org.apache.beam.sdk.transforms.ViewTest > testEmptyMapSideInputWithNonDeterministicKeyCoder FAILED
java.lang.StackOverflowError at JDK14LoggerAdapter.java:581
org.apache.beam.sdk.transforms.ViewTest > testMultimapAsEntrySetSideInput FAILED
java.lang.StackOverflowError at JDK14LoggerAdapter.java:581
org.apache.beam.sdk.transforms.ViewTest > testSingletonSideInput FAILED
java.lang.StackOverflowError at JDK14LoggerAdapter.java:581
org.apache.beam.sdk.transforms.windowing.WindowTest > testTimestampCombinerEndOfWindow FAILED
java.lang.StackOverflowError at JDK14LoggerAdapter.java:595
org.apache.beam.sdk.transforms.windowing.WindowTest > testTimestampCombinerDefault FAILED
java.lang.StackOverflowError at JDK14LoggerAdapter.java:595
org.apache.beam.sdk.transforms.windowing.WindowTest > testMergingCustomWindows FAILED
java.lang.StackOverflowError at JDK14LoggerAdapter.java:581
org.apache.beam.sdk.transforms.windowing.WindowTest > testNoWindowFnDoesNotReassignWindows FAILED
java.lang.StackOverflowError at JDK14LoggerAdapter.java:595
org.apache.beam.sdk.transforms.windowing.WindowTest > testMergingCustomWindowsWithoutCustomWindowTypes FAILED
java.lang.StackOverflowError at JDK14LoggerAdapter.java:581
org.apache.beam.sdk.transforms.windowing.WindowTest > testMergingCustomWindowsKeyedCollection FAILED
java.lang.StackOverflowError at JDK14LoggerAdapter.java:581
org.apache.beam.sdk.values.PCollectionTupleTest > testComposePCollectionTuple FAILED
java.lang.StackOverflowError at JDK14LoggerAdapter.java:595
org.apache.beam.runners.core.metrics.MetricsPusherTest > pushesUserMetrics FAILED
java.lang.StackOverflowError at JDK14LoggerAdapter.java:595
227 tests completed, 219 failed, 1 skipped
> Task :runners:spark:3:validatesRunnerStreaming FAILED
FAILURE: Build completed with 3 failures.
1: Task failed with an exception.
-----------
* What went wrong:
Execution failed for task ':runners:spark:3:validatesRunnerBatch'.
> There were failing tests. See the report at: file://<https://ci-beam.apache.org/job/beam_PostCommit_Java_ValidatesRunner_Spark/ws/src/runners/spark/3/build/reports/tests/validatesRunnerBatch/index.html>
* Try:
> Run with --stacktrace option to get the stack trace.
> Run with --info or --debug option to get more log output.
==============================================================================
2: Task failed with an exception.
-----------
* What went wrong:
Execution failed for task ':runners:spark:3:validatesRunnerBatchWithBoundedSDFExperiment'.
> There were failing tests. See the report at: file://<https://ci-beam.apache.org/job/beam_PostCommit_Java_ValidatesRunner_Spark/ws/src/runners/spark/3/build/reports/tests/validatesRunnerBatchWithBoundedSDFExperiment/index.html>
* Try:
> Run with --stacktrace option to get the stack trace.
> Run with --info or --debug option to get more log output.
==============================================================================
3: Task failed with an exception.
-----------
* What went wrong:
Execution failed for task ':runners:spark:3:validatesRunnerStreaming'.
> There were failing tests. See the report at: file://<https://ci-beam.apache.org/job/beam_PostCommit_Java_ValidatesRunner_Spark/ws/src/runners/spark/3/build/reports/tests/validatesRunnerStreaming/index.html>
* Try:
> Run with --stacktrace option to get the stack trace.
> Run with --info or --debug option to get more log output.
==============================================================================
* Get more help at https://help.gradle.org
Deprecated Gradle features were used in this build, making it incompatible with Gradle 8.0.
You can use '--warning-mode all' to show the individual deprecation warnings and determine if they come from your own scripts or plugins.
See https://docs.gradle.org/7.5.1/userguide/command_line_interface.html#sec:command_line_warnings
BUILD FAILED in 14m 7s
143 actionable tasks: 87 executed, 54 from cache, 2 up-to-date
Publishing build scan...
https://ge.apache.org/s/ropv5gzy77cqs
Build step 'Invoke Gradle script' changed build result to FAILURE
Build step 'Invoke Gradle script' marked build as failure
---------------------------------------------------------------------
To unsubscribe, e-mail: builds-unsubscribe@beam.apache.org
For additional commands, e-mail: builds-help@beam.apache.org
Build failed in Jenkins: beam_PostCommit_Java_ValidatesRunner_Spark #11852
Posted by Apache Jenkins Server <je...@builds.apache.org>.
See <https://ci-beam.apache.org/job/beam_PostCommit_Java_ValidatesRunner_Spark/11852/display/redirect>
Changes:
------------------------------------------
[...truncated 123.24 KB...]
java.lang.StackOverflowError at JDK14LoggerAdapter.java:595
org.apache.beam.sdk.transforms.ParDoSchemaTest > testSimpleSchemaPipeline FAILED
java.lang.StackOverflowError at JDK14LoggerAdapter.java:581
org.apache.beam.sdk.transforms.windowing.WindowingTest > testMergingWindowing FAILED
java.lang.StackOverflowError at JDK14LoggerAdapter.java:595
org.apache.beam.sdk.transforms.ReshuffleTest > testReshuffleAfterSessionsAndGroupByKey FAILED
java.lang.StackOverflowError at Throwable.java:825
org.apache.beam.sdk.transforms.join.CoGroupByKeyTest > testCoGroupByKeyWithWindowing FAILED
java.lang.StackOverflowError at JDK14LoggerAdapter.java:595
org.apache.beam.sdk.transforms.ParDoSchemaTest > testSchemaConversionPipeline FAILED
java.lang.StackOverflowError at JDK14LoggerAdapter.java:581
org.apache.beam.sdk.transforms.windowing.WindowingTest > testWindowPreservation FAILED
java.lang.StackOverflowError at JDK14LoggerAdapter.java:581
org.apache.beam.sdk.transforms.ReshuffleTest > testReshuffleAfterFixedWindows FAILED
java.lang.StackOverflowError at Throwable.java:825
org.apache.beam.sdk.values.PCollectionRowTupleTest > testComposePCollectionRowTuple FAILED
java.lang.StackOverflowError at JDK14LoggerAdapter.java:595
org.apache.beam.sdk.transforms.windowing.WindowingTest > testNonPartitioningWindowing FAILED
java.lang.StackOverflowError at JDK14LoggerAdapter.java:595
org.apache.beam.sdk.transforms.ParDoSchemaTest > testReadAndWriteWithSchemaRegistry FAILED
java.lang.StackOverflowError at JDK14LoggerAdapter.java:581
org.apache.beam.sdk.transforms.ReshuffleTest > testReshuffleAfterFixedWindowsAndGroupByKey FAILED
java.lang.StackOverflowError at Throwable.java:825
org.apache.beam.sdk.transforms.windowing.WindowingTest > testPartitioningWindowing FAILED
java.lang.StackOverflowError at JDK14LoggerAdapter.java:595
org.apache.beam.sdk.transforms.ParDoSchemaTest > testReadAndWriteMultiOutput FAILED
java.lang.StackOverflowError at JDK14LoggerAdapter.java:595
org.apache.beam.sdk.transforms.ReshuffleTest > testReshuffleAfterSlidingWindows FAILED
java.lang.StackOverflowError at Throwable.java:825
org.apache.beam.sdk.transforms.ParDoSchemaTest > testNestedSchema FAILED
java.lang.StackOverflowError at JDK14LoggerAdapter.java:581
org.apache.beam.sdk.transforms.ReshuffleTest > testReshufflePreservesTimestamps FAILED
java.lang.StackOverflowError at Throwable.java:825
org.apache.beam.sdk.transforms.ReshuffleTest > testReshuffleAfterSlidingWindowsAndGroupByKey FAILED
java.lang.StackOverflowError at Throwable.java:825
org.apache.beam.sdk.transforms.ReshuffleTest > testJustReshuffle FAILED
java.lang.StackOverflowError at Throwable.java:825
org.apache.beam.sdk.transforms.ViewTest > testEmptySingletonSideInput FAILED
java.lang.AssertionError at MatcherAssert.java:18
org.apache.beam.sdk.transforms.ViewTest > testMapAsEntrySetSideInput FAILED
java.lang.StackOverflowError at JDK14LoggerAdapter.java:581
org.apache.beam.sdk.transforms.ViewTest > testNonSingletonSideInput FAILED
java.lang.AssertionError at MatcherAssert.java:18
org.apache.beam.sdk.transforms.ViewTest > testMultimapSideInput FAILED
java.lang.StackOverflowError at JDK14LoggerAdapter.java:581
org.apache.beam.sdk.transforms.ViewTest > testEmptyIterableSideInput FAILED
java.lang.StackOverflowError at JDK14LoggerAdapter.java:581
org.apache.beam.sdk.transforms.ViewTest > testMapSideInputWithNullValuesCatchesDuplicates FAILED
java.lang.AssertionError at MatcherAssert.java:18
org.apache.beam.sdk.transforms.ViewTest > testSideInputWithNestedIterables FAILED
java.lang.StackOverflowError at JDK14LoggerAdapter.java:581
org.apache.beam.sdk.transforms.ViewTest > testListSideInput FAILED
java.lang.StackOverflowError at JDK14LoggerAdapter.java:581
org.apache.beam.sdk.transforms.ViewTest > testMapSideInput FAILED
java.lang.StackOverflowError at JDK14LoggerAdapter.java:581
org.apache.beam.sdk.transforms.ViewTest > testWindowedSideInputFixedToFixedWithDefault FAILED
java.lang.StackOverflowError at JDK14LoggerAdapter.java:581
org.apache.beam.sdk.transforms.ViewTest > testWindowedIterableSideInput FAILED
java.lang.StackOverflowError at JDK14LoggerAdapter.java:581
org.apache.beam.sdk.transforms.ViewTest > testWindowedMapSideInputWithNonDeterministicKeyCoder FAILED
java.lang.StackOverflowError at JDK14LoggerAdapter.java:581
org.apache.beam.sdk.transforms.ViewTest > testWindowedSideInputFixedToGlobal FAILED
java.lang.StackOverflowError at JDK14LoggerAdapter.java:581
org.apache.beam.sdk.transforms.ViewTest > testMultimapSideInputWithNonDeterministicKeyCoder FAILED
java.lang.StackOverflowError at JDK14LoggerAdapter.java:581
org.apache.beam.sdk.transforms.ViewTest > testEmptyMultimapSideInput FAILED
java.lang.StackOverflowError at JDK14LoggerAdapter.java:581
org.apache.beam.sdk.transforms.ViewTest > testDiscardingNonSingletonSideInput FAILED
java.lang.AssertionError at MatcherAssert.java:18
org.apache.beam.sdk.transforms.ViewTest > testCombinedMapSideInput FAILED
java.lang.StackOverflowError at JDK14LoggerAdapter.java:581
org.apache.beam.sdk.transforms.ViewTest > testMultimapSideInputIsImmutable FAILED
java.lang.StackOverflowError at JDK14LoggerAdapter.java:581
org.apache.beam.sdk.transforms.ViewTest > testWindowedMultimapAsEntrySetSideInput FAILED
java.lang.StackOverflowError at JDK14LoggerAdapter.java:581
org.apache.beam.sdk.transforms.ViewTest > testWindowedMultimapSideInputWithNonDeterministicKeyCoder FAILED
java.lang.StackOverflowError at JDK14LoggerAdapter.java:581
org.apache.beam.sdk.transforms.ViewTest > testMapSideInputWithNonDeterministicKeyCoder FAILED
java.lang.StackOverflowError at JDK14LoggerAdapter.java:581
org.apache.beam.sdk.transforms.ViewTest > testWindowedSingletonSideInput FAILED
java.lang.StackOverflowError at JDK14LoggerAdapter.java:581
org.apache.beam.sdk.transforms.ViewTest > testWindowedMultimapSideInput FAILED
java.lang.StackOverflowError at JDK14LoggerAdapter.java:581
org.apache.beam.sdk.transforms.ViewTest > testSideInputWithNullDefault FAILED
java.lang.StackOverflowError at JDK14LoggerAdapter.java:581
org.apache.beam.sdk.transforms.ViewTest > testWindowedListSideInput FAILED
java.lang.StackOverflowError at JDK14LoggerAdapter.java:581
org.apache.beam.sdk.transforms.ViewTest > testWindowedMapSideInput FAILED
java.lang.StackOverflowError at JDK14LoggerAdapter.java:581
org.apache.beam.sdk.transforms.ViewTest > testIterableSideInputIsImmutable FAILED
java.lang.StackOverflowError at JDK14LoggerAdapter.java:581
org.apache.beam.sdk.transforms.ViewTest > testListSideInputIsImmutable FAILED
java.lang.StackOverflowError at JDK14LoggerAdapter.java:581
org.apache.beam.sdk.transforms.ViewTest > testEmptyListSideInput FAILED
java.lang.StackOverflowError at JDK14LoggerAdapter.java:581
org.apache.beam.sdk.transforms.ViewTest > testWindowedSideInputFixedToFixed FAILED
java.lang.StackOverflowError at JDK14LoggerAdapter.java:581
org.apache.beam.sdk.transforms.ViewTest > testIterableSideInput FAILED
java.lang.StackOverflowError at JDK14LoggerAdapter.java:581
org.apache.beam.sdk.transforms.ViewTest > testEmptyMultimapSideInputWithNonDeterministicKeyCoder FAILED
java.lang.StackOverflowError at JDK14LoggerAdapter.java:581
org.apache.beam.sdk.transforms.ViewTest > testEmptyMapSideInput FAILED
java.lang.StackOverflowError at JDK14LoggerAdapter.java:581
org.apache.beam.sdk.transforms.ViewTest > testMapSideInputIsImmutable FAILED
java.lang.StackOverflowError at JDK14LoggerAdapter.java:581
org.apache.beam.sdk.transforms.ViewTest > testWindowedMapAsEntrySetSideInput FAILED
java.lang.StackOverflowError at JDK14LoggerAdapter.java:581
org.apache.beam.sdk.transforms.ViewTest > testEmptyMapSideInputWithNonDeterministicKeyCoder FAILED
java.lang.StackOverflowError at JDK14LoggerAdapter.java:581
org.apache.beam.sdk.transforms.ViewTest > testMultimapAsEntrySetSideInput FAILED
java.lang.StackOverflowError at JDK14LoggerAdapter.java:581
org.apache.beam.sdk.transforms.ViewTest > testSingletonSideInput FAILED
java.lang.StackOverflowError at JDK14LoggerAdapter.java:581
org.apache.beam.sdk.transforms.windowing.WindowTest > testTimestampCombinerEndOfWindow FAILED
java.lang.StackOverflowError at JDK14LoggerAdapter.java:595
org.apache.beam.sdk.transforms.windowing.WindowTest > testTimestampCombinerDefault FAILED
java.lang.StackOverflowError at JDK14LoggerAdapter.java:595
org.apache.beam.sdk.transforms.windowing.WindowTest > testMergingCustomWindows FAILED
java.lang.StackOverflowError at JDK14LoggerAdapter.java:581
org.apache.beam.sdk.transforms.windowing.WindowTest > testNoWindowFnDoesNotReassignWindows FAILED
java.lang.StackOverflowError at JDK14LoggerAdapter.java:595
org.apache.beam.sdk.transforms.windowing.WindowTest > testMergingCustomWindowsWithoutCustomWindowTypes FAILED
java.lang.StackOverflowError at JDK14LoggerAdapter.java:581
org.apache.beam.sdk.transforms.windowing.WindowTest > testMergingCustomWindowsKeyedCollection FAILED
java.lang.StackOverflowError at JDK14LoggerAdapter.java:581
org.apache.beam.sdk.values.PCollectionTupleTest > testComposePCollectionTuple FAILED
java.lang.StackOverflowError at JDK14LoggerAdapter.java:595
org.apache.beam.runners.core.metrics.MetricsPusherTest > pushesUserMetrics FAILED
java.lang.StackOverflowError at SLF4JBridgeHandler.java:220
227 tests completed, 219 failed, 1 skipped
> Task :runners:spark:3:validatesRunnerStreaming FAILED
FAILURE: Build completed with 3 failures.
1: Task failed with an exception.
-----------
* What went wrong:
Execution failed for task ':runners:spark:3:validatesRunnerBatch'.
> There were failing tests. See the report at: file://<https://ci-beam.apache.org/job/beam_PostCommit_Java_ValidatesRunner_Spark/ws/src/runners/spark/3/build/reports/tests/validatesRunnerBatch/index.html>
* Try:
> Run with --stacktrace option to get the stack trace.
> Run with --info or --debug option to get more log output.
==============================================================================
2: Task failed with an exception.
-----------
* What went wrong:
Execution failed for task ':runners:spark:3:validatesRunnerBatchWithBoundedSDFExperiment'.
> There were failing tests. See the report at: file://<https://ci-beam.apache.org/job/beam_PostCommit_Java_ValidatesRunner_Spark/ws/src/runners/spark/3/build/reports/tests/validatesRunnerBatchWithBoundedSDFExperiment/index.html>
* Try:
> Run with --stacktrace option to get the stack trace.
> Run with --info or --debug option to get more log output.
==============================================================================
3: Task failed with an exception.
-----------
* What went wrong:
Execution failed for task ':runners:spark:3:validatesRunnerStreaming'.
> There were failing tests. See the report at: file://<https://ci-beam.apache.org/job/beam_PostCommit_Java_ValidatesRunner_Spark/ws/src/runners/spark/3/build/reports/tests/validatesRunnerStreaming/index.html>
* Try:
> Run with --stacktrace option to get the stack trace.
> Run with --info or --debug option to get more log output.
==============================================================================
* Get more help at https://help.gradle.org
Deprecated Gradle features were used in this build, making it incompatible with Gradle 8.0.
You can use '--warning-mode all' to show the individual deprecation warnings and determine if they come from your own scripts or plugins.
See https://docs.gradle.org/7.5.1/userguide/command_line_interface.html#sec:command_line_warnings
BUILD FAILED in 14m 21s
143 actionable tasks: 87 executed, 54 from cache, 2 up-to-date
Publishing build scan...
https://ge.apache.org/s/cgz5hl4jz6yoe
Build step 'Invoke Gradle script' changed build result to FAILURE
Build step 'Invoke Gradle script' marked build as failure
---------------------------------------------------------------------
To unsubscribe, e-mail: builds-unsubscribe@beam.apache.org
For additional commands, e-mail: builds-help@beam.apache.org
Build failed in Jenkins: beam_PostCommit_Java_ValidatesRunner_Spark #11851
Posted by Apache Jenkins Server <je...@builds.apache.org>.
See <https://ci-beam.apache.org/job/beam_PostCommit_Java_ValidatesRunner_Spark/11851/display/redirect>
Changes:
------------------------------------------
[...truncated 123.20 KB...]
java.lang.StackOverflowError at JDK14LoggerAdapter.java:581
org.apache.beam.sdk.transforms.join.CoGroupByKeyTest > testCoGroupByKeyHandleResults FAILED
java.lang.StackOverflowError at JDK14LoggerAdapter.java:595
org.apache.beam.sdk.transforms.windowing.WindowingTest > testMergingWindowing FAILED
java.lang.StackOverflowError at JDK14LoggerAdapter.java:595
org.apache.beam.sdk.transforms.ReshuffleTest > testReshuffleAfterSessionsAndGroupByKey FAILED
java.lang.StackOverflowError at Throwable.java:825
org.apache.beam.sdk.transforms.ParDoSchemaTest > testSchemaConversionPipeline FAILED
java.lang.StackOverflowError at JDK14LoggerAdapter.java:581
org.apache.beam.sdk.transforms.join.CoGroupByKeyTest > testCoGroupByKeyWithWindowing FAILED
java.lang.StackOverflowError at JDK14LoggerAdapter.java:595
org.apache.beam.sdk.transforms.windowing.WindowingTest > testWindowPreservation FAILED
java.lang.StackOverflowError at JDK14LoggerAdapter.java:581
org.apache.beam.sdk.transforms.ReshuffleTest > testReshuffleAfterFixedWindows FAILED
java.lang.StackOverflowError at Throwable.java:825
org.apache.beam.sdk.transforms.ParDoSchemaTest > testReadAndWriteWithSchemaRegistry FAILED
java.lang.StackOverflowError at JDK14LoggerAdapter.java:581
org.apache.beam.sdk.values.PCollectionRowTupleTest > testComposePCollectionRowTuple FAILED
java.lang.StackOverflowError at JDK14LoggerAdapter.java:595
org.apache.beam.sdk.transforms.windowing.WindowingTest > testNonPartitioningWindowing FAILED
java.lang.StackOverflowError at JDK14LoggerAdapter.java:595
org.apache.beam.sdk.transforms.ReshuffleTest > testReshuffleAfterFixedWindowsAndGroupByKey FAILED
java.lang.StackOverflowError at Throwable.java:825
org.apache.beam.sdk.transforms.ParDoSchemaTest > testReadAndWriteMultiOutput FAILED
java.lang.StackOverflowError at JDK14LoggerAdapter.java:595
org.apache.beam.sdk.transforms.windowing.WindowingTest > testPartitioningWindowing FAILED
java.lang.StackOverflowError at JDK14LoggerAdapter.java:595
org.apache.beam.sdk.transforms.ReshuffleTest > testReshuffleAfterSlidingWindows FAILED
java.lang.StackOverflowError at Throwable.java:825
org.apache.beam.sdk.transforms.ParDoSchemaTest > testNestedSchema FAILED
java.lang.StackOverflowError at JDK14LoggerAdapter.java:581
org.apache.beam.sdk.transforms.ReshuffleTest > testReshufflePreservesTimestamps FAILED
java.lang.StackOverflowError at Throwable.java:825
org.apache.beam.sdk.transforms.ReshuffleTest > testReshuffleAfterSlidingWindowsAndGroupByKey FAILED
java.lang.StackOverflowError at Throwable.java:825
org.apache.beam.sdk.transforms.ReshuffleTest > testJustReshuffle FAILED
java.lang.StackOverflowError at Throwable.java:825
org.apache.beam.sdk.transforms.ViewTest > testEmptySingletonSideInput FAILED
java.lang.AssertionError at MatcherAssert.java:18
org.apache.beam.sdk.transforms.ViewTest > testMapAsEntrySetSideInput FAILED
java.lang.StackOverflowError at JDK14LoggerAdapter.java:581
org.apache.beam.sdk.transforms.ViewTest > testNonSingletonSideInput FAILED
java.lang.AssertionError at MatcherAssert.java:18
org.apache.beam.sdk.transforms.ViewTest > testMultimapSideInput FAILED
java.lang.StackOverflowError at JDK14LoggerAdapter.java:581
org.apache.beam.sdk.transforms.ViewTest > testEmptyIterableSideInput FAILED
java.lang.StackOverflowError at JDK14LoggerAdapter.java:581
org.apache.beam.sdk.transforms.ViewTest > testMapSideInputWithNullValuesCatchesDuplicates FAILED
java.lang.AssertionError at MatcherAssert.java:18
org.apache.beam.sdk.transforms.ViewTest > testSideInputWithNestedIterables FAILED
java.lang.StackOverflowError at JDK14LoggerAdapter.java:581
org.apache.beam.sdk.transforms.ViewTest > testListSideInput FAILED
java.lang.StackOverflowError at JDK14LoggerAdapter.java:581
org.apache.beam.sdk.transforms.ViewTest > testMapSideInput FAILED
java.lang.StackOverflowError at JDK14LoggerAdapter.java:581
org.apache.beam.sdk.transforms.ViewTest > testWindowedSideInputFixedToFixedWithDefault FAILED
java.lang.StackOverflowError at JDK14LoggerAdapter.java:581
org.apache.beam.sdk.transforms.ViewTest > testWindowedIterableSideInput FAILED
java.lang.StackOverflowError at JDK14LoggerAdapter.java:581
org.apache.beam.sdk.transforms.ViewTest > testWindowedMapSideInputWithNonDeterministicKeyCoder FAILED
java.lang.StackOverflowError at JDK14LoggerAdapter.java:581
org.apache.beam.sdk.transforms.ViewTest > testWindowedSideInputFixedToGlobal FAILED
java.lang.StackOverflowError at JDK14LoggerAdapter.java:581
org.apache.beam.sdk.transforms.ViewTest > testMultimapSideInputWithNonDeterministicKeyCoder FAILED
java.lang.StackOverflowError at JDK14LoggerAdapter.java:581
org.apache.beam.sdk.transforms.ViewTest > testEmptyMultimapSideInput FAILED
java.lang.StackOverflowError at JDK14LoggerAdapter.java:581
org.apache.beam.sdk.transforms.ViewTest > testDiscardingNonSingletonSideInput FAILED
java.lang.AssertionError at MatcherAssert.java:18
org.apache.beam.sdk.transforms.ViewTest > testCombinedMapSideInput FAILED
java.lang.StackOverflowError at JDK14LoggerAdapter.java:581
org.apache.beam.sdk.transforms.ViewTest > testMultimapSideInputIsImmutable FAILED
java.lang.StackOverflowError at JDK14LoggerAdapter.java:581
org.apache.beam.sdk.transforms.ViewTest > testWindowedMultimapAsEntrySetSideInput FAILED
java.lang.StackOverflowError at JDK14LoggerAdapter.java:581
org.apache.beam.sdk.transforms.ViewTest > testWindowedMultimapSideInputWithNonDeterministicKeyCoder FAILED
java.lang.StackOverflowError at JDK14LoggerAdapter.java:581
org.apache.beam.sdk.transforms.ViewTest > testMapSideInputWithNonDeterministicKeyCoder FAILED
java.lang.StackOverflowError at JDK14LoggerAdapter.java:581
org.apache.beam.sdk.transforms.ViewTest > testWindowedSingletonSideInput FAILED
java.lang.StackOverflowError at JDK14LoggerAdapter.java:581
org.apache.beam.sdk.transforms.ViewTest > testWindowedMultimapSideInput FAILED
java.lang.StackOverflowError at JDK14LoggerAdapter.java:581
org.apache.beam.sdk.transforms.ViewTest > testSideInputWithNullDefault FAILED
java.lang.StackOverflowError at JDK14LoggerAdapter.java:581
org.apache.beam.sdk.transforms.ViewTest > testWindowedListSideInput FAILED
java.lang.StackOverflowError at JDK14LoggerAdapter.java:581
org.apache.beam.sdk.transforms.ViewTest > testWindowedMapSideInput FAILED
java.lang.StackOverflowError at JDK14LoggerAdapter.java:581
org.apache.beam.sdk.transforms.ViewTest > testIterableSideInputIsImmutable FAILED
java.lang.StackOverflowError at JDK14LoggerAdapter.java:581
org.apache.beam.sdk.transforms.ViewTest > testListSideInputIsImmutable FAILED
java.lang.StackOverflowError at JDK14LoggerAdapter.java:581
org.apache.beam.sdk.transforms.ViewTest > testEmptyListSideInput FAILED
java.lang.StackOverflowError at JDK14LoggerAdapter.java:581
org.apache.beam.sdk.transforms.ViewTest > testWindowedSideInputFixedToFixed FAILED
java.lang.StackOverflowError at JDK14LoggerAdapter.java:581
org.apache.beam.sdk.transforms.ViewTest > testIterableSideInput FAILED
java.lang.StackOverflowError at JDK14LoggerAdapter.java:581
org.apache.beam.sdk.transforms.ViewTest > testEmptyMultimapSideInputWithNonDeterministicKeyCoder FAILED
java.lang.StackOverflowError at JDK14LoggerAdapter.java:581
org.apache.beam.sdk.transforms.ViewTest > testEmptyMapSideInput FAILED
java.lang.StackOverflowError at JDK14LoggerAdapter.java:581
org.apache.beam.sdk.transforms.ViewTest > testMapSideInputIsImmutable FAILED
java.lang.StackOverflowError at JDK14LoggerAdapter.java:581
org.apache.beam.sdk.transforms.ViewTest > testWindowedMapAsEntrySetSideInput FAILED
java.lang.StackOverflowError at JDK14LoggerAdapter.java:581
org.apache.beam.sdk.transforms.ViewTest > testEmptyMapSideInputWithNonDeterministicKeyCoder FAILED
java.lang.StackOverflowError at JDK14LoggerAdapter.java:581
org.apache.beam.sdk.transforms.ViewTest > testMultimapAsEntrySetSideInput FAILED
java.lang.StackOverflowError at JDK14LoggerAdapter.java:581
org.apache.beam.sdk.transforms.ViewTest > testSingletonSideInput FAILED
java.lang.StackOverflowError at JDK14LoggerAdapter.java:581
org.apache.beam.sdk.transforms.windowing.WindowTest > testTimestampCombinerEndOfWindow FAILED
java.lang.StackOverflowError at JDK14LoggerAdapter.java:595
org.apache.beam.sdk.transforms.windowing.WindowTest > testTimestampCombinerDefault FAILED
java.lang.StackOverflowError at JDK14LoggerAdapter.java:595
org.apache.beam.sdk.transforms.windowing.WindowTest > testMergingCustomWindows FAILED
java.lang.StackOverflowError at JDK14LoggerAdapter.java:581
org.apache.beam.sdk.transforms.windowing.WindowTest > testNoWindowFnDoesNotReassignWindows FAILED
java.lang.StackOverflowError at JDK14LoggerAdapter.java:595
org.apache.beam.sdk.transforms.windowing.WindowTest > testMergingCustomWindowsWithoutCustomWindowTypes FAILED
java.lang.StackOverflowError at JDK14LoggerAdapter.java:581
org.apache.beam.sdk.transforms.windowing.WindowTest > testMergingCustomWindowsKeyedCollection FAILED
java.lang.StackOverflowError at JDK14LoggerAdapter.java:581
org.apache.beam.sdk.values.PCollectionTupleTest > testComposePCollectionTuple FAILED
java.lang.StackOverflowError at JDK14LoggerAdapter.java:595
org.apache.beam.runners.core.metrics.MetricsPusherTest > pushesUserMetrics FAILED
java.lang.StackOverflowError at LoggerFactory.java:362
227 tests completed, 219 failed, 1 skipped
> Task :runners:spark:3:validatesRunnerStreaming FAILED
FAILURE: Build completed with 3 failures.
1: Task failed with an exception.
-----------
* What went wrong:
Execution failed for task ':runners:spark:3:validatesRunnerBatch'.
> There were failing tests. See the report at: file://<https://ci-beam.apache.org/job/beam_PostCommit_Java_ValidatesRunner_Spark/ws/src/runners/spark/3/build/reports/tests/validatesRunnerBatch/index.html>
* Try:
> Run with --stacktrace option to get the stack trace.
> Run with --info or --debug option to get more log output.
==============================================================================
2: Task failed with an exception.
-----------
* What went wrong:
Execution failed for task ':runners:spark:3:validatesRunnerBatchWithBoundedSDFExperiment'.
> There were failing tests. See the report at: file://<https://ci-beam.apache.org/job/beam_PostCommit_Java_ValidatesRunner_Spark/ws/src/runners/spark/3/build/reports/tests/validatesRunnerBatchWithBoundedSDFExperiment/index.html>
* Try:
> Run with --stacktrace option to get the stack trace.
> Run with --info or --debug option to get more log output.
==============================================================================
3: Task failed with an exception.
-----------
* What went wrong:
Execution failed for task ':runners:spark:3:validatesRunnerStreaming'.
> There were failing tests. See the report at: file://<https://ci-beam.apache.org/job/beam_PostCommit_Java_ValidatesRunner_Spark/ws/src/runners/spark/3/build/reports/tests/validatesRunnerStreaming/index.html>
* Try:
> Run with --stacktrace option to get the stack trace.
> Run with --info or --debug option to get more log output.
==============================================================================
* Get more help at https://help.gradle.org
Deprecated Gradle features were used in this build, making it incompatible with Gradle 8.0.
You can use '--warning-mode all' to show the individual deprecation warnings and determine if they come from your own scripts or plugins.
See https://docs.gradle.org/7.5.1/userguide/command_line_interface.html#sec:command_line_warnings
BUILD FAILED in 13m 55s
143 actionable tasks: 87 executed, 54 from cache, 2 up-to-date
Publishing build scan...
https://ge.apache.org/s/ekjanofsiu4rc
Build step 'Invoke Gradle script' changed build result to FAILURE
Build step 'Invoke Gradle script' marked build as failure
---------------------------------------------------------------------
To unsubscribe, e-mail: builds-unsubscribe@beam.apache.org
For additional commands, e-mail: builds-help@beam.apache.org
Build failed in Jenkins: beam_PostCommit_Java_ValidatesRunner_Spark #11850
Posted by Apache Jenkins Server <je...@builds.apache.org>.
See <https://ci-beam.apache.org/job/beam_PostCommit_Java_ValidatesRunner_Spark/11850/display/redirect>
Changes:
------------------------------------------
[...truncated 123.23 KB...]
java.lang.StackOverflowError at JDK14LoggerAdapter.java:595
org.apache.beam.sdk.transforms.ParDoSchemaTest > testSimpleSchemaPipeline FAILED
java.lang.StackOverflowError at JDK14LoggerAdapter.java:581
org.apache.beam.sdk.transforms.ReshuffleTest > testReshuffleAfterSessionsAndGroupByKey FAILED
java.lang.StackOverflowError at Throwable.java:825
org.apache.beam.sdk.transforms.windowing.WindowingTest > testMergingWindowing FAILED
java.lang.StackOverflowError at JDK14LoggerAdapter.java:595
org.apache.beam.sdk.transforms.join.CoGroupByKeyTest > testCoGroupByKeyWithWindowing FAILED
java.lang.StackOverflowError at JDK14LoggerAdapter.java:595
org.apache.beam.sdk.transforms.ParDoSchemaTest > testSchemaConversionPipeline FAILED
java.lang.StackOverflowError at JDK14LoggerAdapter.java:581
org.apache.beam.sdk.transforms.ReshuffleTest > testReshuffleAfterFixedWindows FAILED
java.lang.StackOverflowError at Throwable.java:825
org.apache.beam.sdk.transforms.windowing.WindowingTest > testWindowPreservation FAILED
java.lang.StackOverflowError at JDK14LoggerAdapter.java:581
org.apache.beam.sdk.values.PCollectionRowTupleTest > testComposePCollectionRowTuple FAILED
java.lang.StackOverflowError at JDK14LoggerAdapter.java:595
org.apache.beam.sdk.transforms.ParDoSchemaTest > testReadAndWriteWithSchemaRegistry FAILED
java.lang.StackOverflowError at JDK14LoggerAdapter.java:581
org.apache.beam.sdk.transforms.ReshuffleTest > testReshuffleAfterFixedWindowsAndGroupByKey FAILED
java.lang.StackOverflowError at Throwable.java:825
org.apache.beam.sdk.transforms.windowing.WindowingTest > testNonPartitioningWindowing FAILED
java.lang.StackOverflowError at JDK14LoggerAdapter.java:595
org.apache.beam.sdk.transforms.ParDoSchemaTest > testReadAndWriteMultiOutput FAILED
java.lang.StackOverflowError at JDK14LoggerAdapter.java:595
org.apache.beam.sdk.transforms.ReshuffleTest > testReshuffleAfterSlidingWindows FAILED
java.lang.StackOverflowError at Throwable.java:825
org.apache.beam.sdk.transforms.windowing.WindowingTest > testPartitioningWindowing FAILED
java.lang.StackOverflowError at JDK14LoggerAdapter.java:595
org.apache.beam.sdk.transforms.ParDoSchemaTest > testNestedSchema FAILED
java.lang.StackOverflowError at JDK14LoggerAdapter.java:581
org.apache.beam.sdk.transforms.ReshuffleTest > testReshufflePreservesTimestamps FAILED
java.lang.StackOverflowError at Throwable.java:825
org.apache.beam.sdk.transforms.ReshuffleTest > testReshuffleAfterSlidingWindowsAndGroupByKey FAILED
java.lang.StackOverflowError at Throwable.java:825
org.apache.beam.sdk.transforms.ReshuffleTest > testJustReshuffle FAILED
java.lang.StackOverflowError at Throwable.java:825
org.apache.beam.sdk.transforms.ViewTest > testEmptySingletonSideInput FAILED
java.lang.AssertionError at MatcherAssert.java:18
org.apache.beam.sdk.transforms.ViewTest > testMapAsEntrySetSideInput FAILED
java.lang.StackOverflowError at JDK14LoggerAdapter.java:581
org.apache.beam.sdk.transforms.ViewTest > testNonSingletonSideInput FAILED
java.lang.AssertionError at MatcherAssert.java:18
org.apache.beam.sdk.transforms.ViewTest > testMultimapSideInput FAILED
java.lang.StackOverflowError at JDK14LoggerAdapter.java:581
org.apache.beam.sdk.transforms.ViewTest > testEmptyIterableSideInput FAILED
java.lang.StackOverflowError at JDK14LoggerAdapter.java:581
org.apache.beam.sdk.transforms.ViewTest > testMapSideInputWithNullValuesCatchesDuplicates FAILED
java.lang.AssertionError at MatcherAssert.java:18
org.apache.beam.sdk.transforms.ViewTest > testSideInputWithNestedIterables FAILED
java.lang.StackOverflowError at JDK14LoggerAdapter.java:581
org.apache.beam.sdk.transforms.ViewTest > testListSideInput FAILED
java.lang.StackOverflowError at JDK14LoggerAdapter.java:581
org.apache.beam.sdk.transforms.ViewTest > testMapSideInput FAILED
java.lang.StackOverflowError at JDK14LoggerAdapter.java:581
org.apache.beam.sdk.transforms.ViewTest > testWindowedSideInputFixedToFixedWithDefault FAILED
java.lang.StackOverflowError at JDK14LoggerAdapter.java:581
org.apache.beam.sdk.transforms.ViewTest > testWindowedIterableSideInput FAILED
java.lang.StackOverflowError at JDK14LoggerAdapter.java:581
org.apache.beam.sdk.transforms.ViewTest > testWindowedMapSideInputWithNonDeterministicKeyCoder FAILED
java.lang.StackOverflowError at JDK14LoggerAdapter.java:581
org.apache.beam.sdk.transforms.ViewTest > testWindowedSideInputFixedToGlobal FAILED
java.lang.StackOverflowError at JDK14LoggerAdapter.java:581
org.apache.beam.sdk.transforms.ViewTest > testMultimapSideInputWithNonDeterministicKeyCoder FAILED
java.lang.StackOverflowError at JDK14LoggerAdapter.java:581
org.apache.beam.sdk.transforms.ViewTest > testEmptyMultimapSideInput FAILED
java.lang.StackOverflowError at JDK14LoggerAdapter.java:581
org.apache.beam.sdk.transforms.ViewTest > testDiscardingNonSingletonSideInput FAILED
java.lang.AssertionError at MatcherAssert.java:18
org.apache.beam.sdk.transforms.ViewTest > testCombinedMapSideInput FAILED
java.lang.StackOverflowError at JDK14LoggerAdapter.java:581
org.apache.beam.sdk.transforms.ViewTest > testMultimapSideInputIsImmutable FAILED
java.lang.StackOverflowError at JDK14LoggerAdapter.java:581
org.apache.beam.sdk.transforms.ViewTest > testWindowedMultimapAsEntrySetSideInput FAILED
java.lang.StackOverflowError at JDK14LoggerAdapter.java:581
org.apache.beam.sdk.transforms.ViewTest > testWindowedMultimapSideInputWithNonDeterministicKeyCoder FAILED
java.lang.StackOverflowError at JDK14LoggerAdapter.java:581
org.apache.beam.sdk.transforms.ViewTest > testMapSideInputWithNonDeterministicKeyCoder FAILED
java.lang.StackOverflowError at JDK14LoggerAdapter.java:581
org.apache.beam.sdk.transforms.ViewTest > testWindowedSingletonSideInput FAILED
java.lang.StackOverflowError at JDK14LoggerAdapter.java:581
org.apache.beam.sdk.transforms.ViewTest > testWindowedMultimapSideInput FAILED
java.lang.StackOverflowError at JDK14LoggerAdapter.java:581
org.apache.beam.sdk.transforms.ViewTest > testSideInputWithNullDefault FAILED
java.lang.StackOverflowError at JDK14LoggerAdapter.java:581
org.apache.beam.sdk.transforms.ViewTest > testWindowedListSideInput FAILED
java.lang.StackOverflowError at JDK14LoggerAdapter.java:581
org.apache.beam.sdk.transforms.ViewTest > testWindowedMapSideInput FAILED
java.lang.StackOverflowError at JDK14LoggerAdapter.java:581
org.apache.beam.sdk.transforms.ViewTest > testIterableSideInputIsImmutable FAILED
java.lang.StackOverflowError at JDK14LoggerAdapter.java:581
org.apache.beam.sdk.transforms.ViewTest > testListSideInputIsImmutable FAILED
java.lang.StackOverflowError at JDK14LoggerAdapter.java:581
org.apache.beam.sdk.transforms.ViewTest > testEmptyListSideInput FAILED
java.lang.StackOverflowError at JDK14LoggerAdapter.java:581
org.apache.beam.sdk.transforms.ViewTest > testWindowedSideInputFixedToFixed FAILED
java.lang.StackOverflowError at JDK14LoggerAdapter.java:581
org.apache.beam.sdk.transforms.ViewTest > testIterableSideInput FAILED
java.lang.StackOverflowError at JDK14LoggerAdapter.java:581
org.apache.beam.sdk.transforms.ViewTest > testEmptyMultimapSideInputWithNonDeterministicKeyCoder FAILED
java.lang.StackOverflowError at JDK14LoggerAdapter.java:581
org.apache.beam.sdk.transforms.ViewTest > testEmptyMapSideInput FAILED
java.lang.StackOverflowError at JDK14LoggerAdapter.java:581
org.apache.beam.sdk.transforms.ViewTest > testMapSideInputIsImmutable FAILED
java.lang.StackOverflowError at JDK14LoggerAdapter.java:581
org.apache.beam.sdk.transforms.ViewTest > testWindowedMapAsEntrySetSideInput FAILED
java.lang.StackOverflowError at JDK14LoggerAdapter.java:581
org.apache.beam.sdk.transforms.ViewTest > testEmptyMapSideInputWithNonDeterministicKeyCoder FAILED
java.lang.StackOverflowError at JDK14LoggerAdapter.java:581
org.apache.beam.sdk.transforms.ViewTest > testMultimapAsEntrySetSideInput FAILED
java.lang.StackOverflowError at JDK14LoggerAdapter.java:581
org.apache.beam.sdk.transforms.ViewTest > testSingletonSideInput FAILED
java.lang.StackOverflowError at JDK14LoggerAdapter.java:581
org.apache.beam.sdk.transforms.windowing.WindowTest > testTimestampCombinerEndOfWindow FAILED
java.lang.StackOverflowError at JDK14LoggerAdapter.java:595
org.apache.beam.sdk.transforms.windowing.WindowTest > testTimestampCombinerDefault FAILED
java.lang.StackOverflowError at JDK14LoggerAdapter.java:595
org.apache.beam.sdk.transforms.windowing.WindowTest > testMergingCustomWindows FAILED
java.lang.StackOverflowError at JDK14LoggerAdapter.java:581
org.apache.beam.sdk.transforms.windowing.WindowTest > testNoWindowFnDoesNotReassignWindows FAILED
java.lang.StackOverflowError at JDK14LoggerAdapter.java:595
org.apache.beam.sdk.transforms.windowing.WindowTest > testMergingCustomWindowsWithoutCustomWindowTypes FAILED
java.lang.StackOverflowError at JDK14LoggerAdapter.java:581
org.apache.beam.sdk.transforms.windowing.WindowTest > testMergingCustomWindowsKeyedCollection FAILED
java.lang.StackOverflowError at JDK14LoggerAdapter.java:581
org.apache.beam.sdk.values.PCollectionTupleTest > testComposePCollectionTuple FAILED
java.lang.StackOverflowError at JDK14LoggerAdapter.java:595
org.apache.beam.runners.core.metrics.MetricsPusherTest > pushesUserMetrics FAILED
java.lang.StackOverflowError at SLF4JBridgeHandler.java:220
227 tests completed, 219 failed, 1 skipped
> Task :runners:spark:3:validatesRunnerStreaming FAILED
FAILURE: Build completed with 3 failures.
1: Task failed with an exception.
-----------
* What went wrong:
Execution failed for task ':runners:spark:3:validatesRunnerBatch'.
> There were failing tests. See the report at: file://<https://ci-beam.apache.org/job/beam_PostCommit_Java_ValidatesRunner_Spark/ws/src/runners/spark/3/build/reports/tests/validatesRunnerBatch/index.html>
* Try:
> Run with --stacktrace option to get the stack trace.
> Run with --info or --debug option to get more log output.
==============================================================================
2: Task failed with an exception.
-----------
* What went wrong:
Execution failed for task ':runners:spark:3:validatesRunnerBatchWithBoundedSDFExperiment'.
> There were failing tests. See the report at: file://<https://ci-beam.apache.org/job/beam_PostCommit_Java_ValidatesRunner_Spark/ws/src/runners/spark/3/build/reports/tests/validatesRunnerBatchWithBoundedSDFExperiment/index.html>
* Try:
> Run with --stacktrace option to get the stack trace.
> Run with --info or --debug option to get more log output.
==============================================================================
3: Task failed with an exception.
-----------
* What went wrong:
Execution failed for task ':runners:spark:3:validatesRunnerStreaming'.
> There were failing tests. See the report at: file://<https://ci-beam.apache.org/job/beam_PostCommit_Java_ValidatesRunner_Spark/ws/src/runners/spark/3/build/reports/tests/validatesRunnerStreaming/index.html>
* Try:
> Run with --stacktrace option to get the stack trace.
> Run with --info or --debug option to get more log output.
==============================================================================
* Get more help at https://help.gradle.org
Deprecated Gradle features were used in this build, making it incompatible with Gradle 8.0.
You can use '--warning-mode all' to show the individual deprecation warnings and determine if they come from your own scripts or plugins.
See https://docs.gradle.org/7.5.1/userguide/command_line_interface.html#sec:command_line_warnings
BUILD FAILED in 13m 54s
143 actionable tasks: 87 executed, 54 from cache, 2 up-to-date
Publishing build scan...
https://ge.apache.org/s/xhq3o2fgcl7fc
Build step 'Invoke Gradle script' changed build result to FAILURE
Build step 'Invoke Gradle script' marked build as failure
---------------------------------------------------------------------
To unsubscribe, e-mail: builds-unsubscribe@beam.apache.org
For additional commands, e-mail: builds-help@beam.apache.org
Build failed in Jenkins: beam_PostCommit_Java_ValidatesRunner_Spark #11849
Posted by Apache Jenkins Server <je...@builds.apache.org>.
See <https://ci-beam.apache.org/job/beam_PostCommit_Java_ValidatesRunner_Spark/11849/display/redirect>
Changes:
------------------------------------------
[...truncated 123.22 KB...]
java.lang.StackOverflowError at JDK14LoggerAdapter.java:595
org.apache.beam.sdk.transforms.ParDoSchemaTest > testSimpleSchemaPipeline FAILED
java.lang.StackOverflowError at JDK14LoggerAdapter.java:581
org.apache.beam.sdk.transforms.windowing.WindowingTest > testMergingWindowing FAILED
java.lang.StackOverflowError at JDK14LoggerAdapter.java:595
org.apache.beam.sdk.transforms.join.CoGroupByKeyTest > testCoGroupByKeyWithWindowing FAILED
java.lang.StackOverflowError at JDK14LoggerAdapter.java:595
org.apache.beam.sdk.transforms.ReshuffleTest > testReshuffleAfterSessionsAndGroupByKey FAILED
java.lang.StackOverflowError at Throwable.java:825
org.apache.beam.sdk.transforms.ParDoSchemaTest > testSchemaConversionPipeline FAILED
java.lang.StackOverflowError at JDK14LoggerAdapter.java:581
org.apache.beam.sdk.transforms.windowing.WindowingTest > testWindowPreservation FAILED
java.lang.StackOverflowError at JDK14LoggerAdapter.java:581
org.apache.beam.sdk.values.PCollectionRowTupleTest > testComposePCollectionRowTuple FAILED
java.lang.StackOverflowError at JDK14LoggerAdapter.java:595
org.apache.beam.sdk.transforms.ReshuffleTest > testReshuffleAfterFixedWindows FAILED
java.lang.StackOverflowError at Throwable.java:825
org.apache.beam.sdk.transforms.ParDoSchemaTest > testReadAndWriteWithSchemaRegistry FAILED
java.lang.StackOverflowError at JDK14LoggerAdapter.java:581
org.apache.beam.sdk.transforms.windowing.WindowingTest > testNonPartitioningWindowing FAILED
java.lang.StackOverflowError at JDK14LoggerAdapter.java:595
org.apache.beam.sdk.transforms.ReshuffleTest > testReshuffleAfterFixedWindowsAndGroupByKey FAILED
java.lang.StackOverflowError at Throwable.java:825
org.apache.beam.sdk.transforms.ParDoSchemaTest > testReadAndWriteMultiOutput FAILED
java.lang.StackOverflowError at JDK14LoggerAdapter.java:595
org.apache.beam.sdk.transforms.windowing.WindowingTest > testPartitioningWindowing FAILED
java.lang.StackOverflowError at JDK14LoggerAdapter.java:595
org.apache.beam.sdk.transforms.ReshuffleTest > testReshuffleAfterSlidingWindows FAILED
java.lang.StackOverflowError at Throwable.java:825
org.apache.beam.sdk.transforms.ParDoSchemaTest > testNestedSchema FAILED
java.lang.StackOverflowError at JDK14LoggerAdapter.java:581
org.apache.beam.sdk.transforms.ReshuffleTest > testReshufflePreservesTimestamps FAILED
java.lang.StackOverflowError at Throwable.java:825
org.apache.beam.sdk.transforms.ReshuffleTest > testReshuffleAfterSlidingWindowsAndGroupByKey FAILED
java.lang.StackOverflowError at Throwable.java:825
org.apache.beam.sdk.transforms.ReshuffleTest > testJustReshuffle FAILED
java.lang.StackOverflowError at Throwable.java:825
org.apache.beam.sdk.transforms.ViewTest > testEmptySingletonSideInput FAILED
java.lang.AssertionError at MatcherAssert.java:18
org.apache.beam.sdk.transforms.ViewTest > testMapAsEntrySetSideInput FAILED
java.lang.StackOverflowError at JDK14LoggerAdapter.java:581
org.apache.beam.sdk.transforms.ViewTest > testNonSingletonSideInput FAILED
java.lang.AssertionError at MatcherAssert.java:18
org.apache.beam.sdk.transforms.ViewTest > testMultimapSideInput FAILED
java.lang.StackOverflowError at JDK14LoggerAdapter.java:581
org.apache.beam.sdk.transforms.ViewTest > testEmptyIterableSideInput FAILED
java.lang.StackOverflowError at JDK14LoggerAdapter.java:581
org.apache.beam.sdk.transforms.ViewTest > testMapSideInputWithNullValuesCatchesDuplicates FAILED
java.lang.AssertionError at MatcherAssert.java:18
org.apache.beam.sdk.transforms.ViewTest > testSideInputWithNestedIterables FAILED
java.lang.StackOverflowError at JDK14LoggerAdapter.java:581
org.apache.beam.sdk.transforms.ViewTest > testListSideInput FAILED
java.lang.StackOverflowError at JDK14LoggerAdapter.java:581
org.apache.beam.sdk.transforms.ViewTest > testMapSideInput FAILED
java.lang.StackOverflowError at JDK14LoggerAdapter.java:581
org.apache.beam.sdk.transforms.ViewTest > testWindowedSideInputFixedToFixedWithDefault FAILED
java.lang.StackOverflowError at JDK14LoggerAdapter.java:581
org.apache.beam.sdk.transforms.ViewTest > testWindowedIterableSideInput FAILED
java.lang.StackOverflowError at JDK14LoggerAdapter.java:581
org.apache.beam.sdk.transforms.ViewTest > testWindowedMapSideInputWithNonDeterministicKeyCoder FAILED
java.lang.StackOverflowError at JDK14LoggerAdapter.java:581
org.apache.beam.sdk.transforms.ViewTest > testWindowedSideInputFixedToGlobal FAILED
java.lang.StackOverflowError at JDK14LoggerAdapter.java:581
org.apache.beam.sdk.transforms.ViewTest > testMultimapSideInputWithNonDeterministicKeyCoder FAILED
java.lang.StackOverflowError at JDK14LoggerAdapter.java:581
org.apache.beam.sdk.transforms.ViewTest > testEmptyMultimapSideInput FAILED
java.lang.StackOverflowError at JDK14LoggerAdapter.java:581
org.apache.beam.sdk.transforms.ViewTest > testDiscardingNonSingletonSideInput FAILED
java.lang.AssertionError at MatcherAssert.java:18
org.apache.beam.sdk.transforms.ViewTest > testCombinedMapSideInput FAILED
java.lang.StackOverflowError at JDK14LoggerAdapter.java:581
org.apache.beam.sdk.transforms.ViewTest > testMultimapSideInputIsImmutable FAILED
java.lang.StackOverflowError at JDK14LoggerAdapter.java:581
org.apache.beam.sdk.transforms.ViewTest > testWindowedMultimapAsEntrySetSideInput FAILED
java.lang.StackOverflowError at JDK14LoggerAdapter.java:581
org.apache.beam.sdk.transforms.ViewTest > testWindowedMultimapSideInputWithNonDeterministicKeyCoder FAILED
java.lang.StackOverflowError at JDK14LoggerAdapter.java:581
org.apache.beam.sdk.transforms.ViewTest > testMapSideInputWithNonDeterministicKeyCoder FAILED
java.lang.StackOverflowError at JDK14LoggerAdapter.java:581
org.apache.beam.sdk.transforms.ViewTest > testWindowedSingletonSideInput FAILED
java.lang.StackOverflowError at JDK14LoggerAdapter.java:581
org.apache.beam.sdk.transforms.ViewTest > testWindowedMultimapSideInput FAILED
java.lang.StackOverflowError at JDK14LoggerAdapter.java:581
org.apache.beam.sdk.transforms.ViewTest > testSideInputWithNullDefault FAILED
java.lang.StackOverflowError at JDK14LoggerAdapter.java:581
org.apache.beam.sdk.transforms.ViewTest > testWindowedListSideInput FAILED
java.lang.StackOverflowError at JDK14LoggerAdapter.java:581
org.apache.beam.sdk.transforms.ViewTest > testWindowedMapSideInput FAILED
java.lang.StackOverflowError at JDK14LoggerAdapter.java:581
org.apache.beam.sdk.transforms.ViewTest > testIterableSideInputIsImmutable FAILED
java.lang.StackOverflowError at JDK14LoggerAdapter.java:581
org.apache.beam.sdk.transforms.ViewTest > testListSideInputIsImmutable FAILED
java.lang.StackOverflowError at JDK14LoggerAdapter.java:581
org.apache.beam.sdk.transforms.ViewTest > testEmptyListSideInput FAILED
java.lang.StackOverflowError at JDK14LoggerAdapter.java:581
org.apache.beam.sdk.transforms.ViewTest > testWindowedSideInputFixedToFixed FAILED
java.lang.StackOverflowError at JDK14LoggerAdapter.java:581
org.apache.beam.sdk.transforms.ViewTest > testIterableSideInput FAILED
java.lang.StackOverflowError at JDK14LoggerAdapter.java:581
org.apache.beam.sdk.transforms.ViewTest > testEmptyMultimapSideInputWithNonDeterministicKeyCoder FAILED
java.lang.StackOverflowError at JDK14LoggerAdapter.java:581
org.apache.beam.sdk.transforms.ViewTest > testEmptyMapSideInput FAILED
java.lang.StackOverflowError at JDK14LoggerAdapter.java:581
org.apache.beam.sdk.transforms.ViewTest > testMapSideInputIsImmutable FAILED
java.lang.StackOverflowError at JDK14LoggerAdapter.java:581
org.apache.beam.sdk.transforms.ViewTest > testWindowedMapAsEntrySetSideInput FAILED
java.lang.StackOverflowError at JDK14LoggerAdapter.java:581
org.apache.beam.sdk.transforms.ViewTest > testEmptyMapSideInputWithNonDeterministicKeyCoder FAILED
java.lang.StackOverflowError at JDK14LoggerAdapter.java:581
org.apache.beam.sdk.transforms.ViewTest > testMultimapAsEntrySetSideInput FAILED
java.lang.StackOverflowError at JDK14LoggerAdapter.java:581
org.apache.beam.sdk.transforms.ViewTest > testSingletonSideInput FAILED
java.lang.StackOverflowError at JDK14LoggerAdapter.java:581
org.apache.beam.sdk.transforms.windowing.WindowTest > testTimestampCombinerEndOfWindow FAILED
java.lang.StackOverflowError at JDK14LoggerAdapter.java:595
org.apache.beam.sdk.transforms.windowing.WindowTest > testTimestampCombinerDefault FAILED
java.lang.StackOverflowError at JDK14LoggerAdapter.java:595
org.apache.beam.sdk.transforms.windowing.WindowTest > testMergingCustomWindows FAILED
java.lang.StackOverflowError at JDK14LoggerAdapter.java:581
org.apache.beam.sdk.transforms.windowing.WindowTest > testNoWindowFnDoesNotReassignWindows FAILED
java.lang.StackOverflowError at JDK14LoggerAdapter.java:595
org.apache.beam.sdk.transforms.windowing.WindowTest > testMergingCustomWindowsWithoutCustomWindowTypes FAILED
java.lang.StackOverflowError at JDK14LoggerAdapter.java:581
org.apache.beam.sdk.transforms.windowing.WindowTest > testMergingCustomWindowsKeyedCollection FAILED
java.lang.StackOverflowError at JDK14LoggerAdapter.java:581
org.apache.beam.sdk.values.PCollectionTupleTest > testComposePCollectionTuple FAILED
java.lang.StackOverflowError at JDK14LoggerAdapter.java:595
org.apache.beam.runners.core.metrics.MetricsPusherTest > pushesUserMetrics FAILED
java.lang.StackOverflowError at SLF4JBridgeHandler.java:220
227 tests completed, 219 failed, 1 skipped
> Task :runners:spark:3:validatesRunnerStreaming FAILED
FAILURE: Build completed with 3 failures.
1: Task failed with an exception.
-----------
* What went wrong:
Execution failed for task ':runners:spark:3:validatesRunnerBatch'.
> There were failing tests. See the report at: file://<https://ci-beam.apache.org/job/beam_PostCommit_Java_ValidatesRunner_Spark/ws/src/runners/spark/3/build/reports/tests/validatesRunnerBatch/index.html>
* Try:
> Run with --stacktrace option to get the stack trace.
> Run with --info or --debug option to get more log output.
==============================================================================
2: Task failed with an exception.
-----------
* What went wrong:
Execution failed for task ':runners:spark:3:validatesRunnerBatchWithBoundedSDFExperiment'.
> There were failing tests. See the report at: file://<https://ci-beam.apache.org/job/beam_PostCommit_Java_ValidatesRunner_Spark/ws/src/runners/spark/3/build/reports/tests/validatesRunnerBatchWithBoundedSDFExperiment/index.html>
* Try:
> Run with --stacktrace option to get the stack trace.
> Run with --info or --debug option to get more log output.
==============================================================================
3: Task failed with an exception.
-----------
* What went wrong:
Execution failed for task ':runners:spark:3:validatesRunnerStreaming'.
> There were failing tests. See the report at: file://<https://ci-beam.apache.org/job/beam_PostCommit_Java_ValidatesRunner_Spark/ws/src/runners/spark/3/build/reports/tests/validatesRunnerStreaming/index.html>
* Try:
> Run with --stacktrace option to get the stack trace.
> Run with --info or --debug option to get more log output.
==============================================================================
* Get more help at https://help.gradle.org
Deprecated Gradle features were used in this build, making it incompatible with Gradle 8.0.
You can use '--warning-mode all' to show the individual deprecation warnings and determine if they come from your own scripts or plugins.
See https://docs.gradle.org/7.5.1/userguide/command_line_interface.html#sec:command_line_warnings
BUILD FAILED in 14m 38s
143 actionable tasks: 87 executed, 54 from cache, 2 up-to-date
Publishing build scan...
https://ge.apache.org/s/5jesnnu767qem
Build step 'Invoke Gradle script' changed build result to FAILURE
Build step 'Invoke Gradle script' marked build as failure
---------------------------------------------------------------------
To unsubscribe, e-mail: builds-unsubscribe@beam.apache.org
For additional commands, e-mail: builds-help@beam.apache.org
Build failed in Jenkins: beam_PostCommit_Java_ValidatesRunner_Spark #11848
Posted by Apache Jenkins Server <je...@builds.apache.org>.
See <https://ci-beam.apache.org/job/beam_PostCommit_Java_ValidatesRunner_Spark/11848/display/redirect>
Changes:
------------------------------------------
[...truncated 123.22 KB...]
java.lang.StackOverflowError at JDK14LoggerAdapter.java:595
org.apache.beam.sdk.transforms.ParDoSchemaTest > testSimpleSchemaPipeline FAILED
java.lang.StackOverflowError at JDK14LoggerAdapter.java:581
org.apache.beam.sdk.transforms.ReshuffleTest > testReshuffleAfterSessionsAndGroupByKey FAILED
java.lang.StackOverflowError at Throwable.java:825
org.apache.beam.sdk.transforms.windowing.WindowingTest > testMergingWindowing FAILED
java.lang.StackOverflowError at JDK14LoggerAdapter.java:595
org.apache.beam.sdk.transforms.join.CoGroupByKeyTest > testCoGroupByKeyWithWindowing FAILED
java.lang.StackOverflowError at JDK14LoggerAdapter.java:595
org.apache.beam.sdk.transforms.ParDoSchemaTest > testSchemaConversionPipeline FAILED
java.lang.StackOverflowError at JDK14LoggerAdapter.java:581
org.apache.beam.sdk.transforms.ReshuffleTest > testReshuffleAfterFixedWindows FAILED
java.lang.StackOverflowError at Throwable.java:825
org.apache.beam.sdk.transforms.windowing.WindowingTest > testWindowPreservation FAILED
java.lang.StackOverflowError at JDK14LoggerAdapter.java:581
org.apache.beam.sdk.values.PCollectionRowTupleTest > testComposePCollectionRowTuple FAILED
java.lang.StackOverflowError at JDK14LoggerAdapter.java:595
org.apache.beam.sdk.transforms.ParDoSchemaTest > testReadAndWriteWithSchemaRegistry FAILED
java.lang.StackOverflowError at JDK14LoggerAdapter.java:581
org.apache.beam.sdk.transforms.ReshuffleTest > testReshuffleAfterFixedWindowsAndGroupByKey FAILED
java.lang.StackOverflowError at Throwable.java:825
org.apache.beam.sdk.transforms.windowing.WindowingTest > testNonPartitioningWindowing FAILED
java.lang.StackOverflowError at JDK14LoggerAdapter.java:595
org.apache.beam.sdk.transforms.ParDoSchemaTest > testReadAndWriteMultiOutput FAILED
java.lang.StackOverflowError at JDK14LoggerAdapter.java:595
org.apache.beam.sdk.transforms.ReshuffleTest > testReshuffleAfterSlidingWindows FAILED
java.lang.StackOverflowError at Throwable.java:825
org.apache.beam.sdk.transforms.windowing.WindowingTest > testPartitioningWindowing FAILED
java.lang.StackOverflowError at JDK14LoggerAdapter.java:595
org.apache.beam.sdk.transforms.ParDoSchemaTest > testNestedSchema FAILED
java.lang.StackOverflowError at JDK14LoggerAdapter.java:581
org.apache.beam.sdk.transforms.ReshuffleTest > testReshufflePreservesTimestamps FAILED
java.lang.StackOverflowError at Throwable.java:825
org.apache.beam.sdk.transforms.ReshuffleTest > testReshuffleAfterSlidingWindowsAndGroupByKey FAILED
java.lang.StackOverflowError at Throwable.java:825
org.apache.beam.sdk.transforms.ReshuffleTest > testJustReshuffle FAILED
java.lang.StackOverflowError at Throwable.java:825
org.apache.beam.sdk.transforms.ViewTest > testEmptySingletonSideInput FAILED
java.lang.AssertionError at MatcherAssert.java:18
org.apache.beam.sdk.transforms.ViewTest > testMapAsEntrySetSideInput FAILED
java.lang.StackOverflowError at JDK14LoggerAdapter.java:581
org.apache.beam.sdk.transforms.ViewTest > testNonSingletonSideInput FAILED
java.lang.AssertionError at MatcherAssert.java:18
org.apache.beam.sdk.transforms.ViewTest > testMultimapSideInput FAILED
java.lang.StackOverflowError at JDK14LoggerAdapter.java:581
org.apache.beam.sdk.transforms.ViewTest > testEmptyIterableSideInput FAILED
java.lang.StackOverflowError at JDK14LoggerAdapter.java:581
org.apache.beam.sdk.transforms.ViewTest > testMapSideInputWithNullValuesCatchesDuplicates FAILED
java.lang.AssertionError at MatcherAssert.java:18
org.apache.beam.sdk.transforms.ViewTest > testSideInputWithNestedIterables FAILED
java.lang.StackOverflowError at JDK14LoggerAdapter.java:581
org.apache.beam.sdk.transforms.ViewTest > testListSideInput FAILED
java.lang.StackOverflowError at JDK14LoggerAdapter.java:581
org.apache.beam.sdk.transforms.ViewTest > testMapSideInput FAILED
java.lang.StackOverflowError at JDK14LoggerAdapter.java:581
org.apache.beam.sdk.transforms.ViewTest > testWindowedSideInputFixedToFixedWithDefault FAILED
java.lang.StackOverflowError at JDK14LoggerAdapter.java:581
org.apache.beam.sdk.transforms.ViewTest > testWindowedIterableSideInput FAILED
java.lang.StackOverflowError at JDK14LoggerAdapter.java:581
org.apache.beam.sdk.transforms.ViewTest > testWindowedMapSideInputWithNonDeterministicKeyCoder FAILED
java.lang.StackOverflowError at JDK14LoggerAdapter.java:581
org.apache.beam.sdk.transforms.ViewTest > testWindowedSideInputFixedToGlobal FAILED
java.lang.StackOverflowError at JDK14LoggerAdapter.java:581
org.apache.beam.sdk.transforms.ViewTest > testMultimapSideInputWithNonDeterministicKeyCoder FAILED
java.lang.StackOverflowError at JDK14LoggerAdapter.java:581
org.apache.beam.sdk.transforms.ViewTest > testEmptyMultimapSideInput FAILED
java.lang.StackOverflowError at JDK14LoggerAdapter.java:581
org.apache.beam.sdk.transforms.ViewTest > testDiscardingNonSingletonSideInput FAILED
java.lang.AssertionError at MatcherAssert.java:18
org.apache.beam.sdk.transforms.ViewTest > testCombinedMapSideInput FAILED
java.lang.StackOverflowError at JDK14LoggerAdapter.java:581
org.apache.beam.sdk.transforms.ViewTest > testMultimapSideInputIsImmutable FAILED
java.lang.StackOverflowError at JDK14LoggerAdapter.java:581
org.apache.beam.sdk.transforms.ViewTest > testWindowedMultimapAsEntrySetSideInput FAILED
java.lang.StackOverflowError at JDK14LoggerAdapter.java:581
org.apache.beam.sdk.transforms.ViewTest > testWindowedMultimapSideInputWithNonDeterministicKeyCoder FAILED
java.lang.StackOverflowError at JDK14LoggerAdapter.java:581
org.apache.beam.sdk.transforms.ViewTest > testMapSideInputWithNonDeterministicKeyCoder FAILED
java.lang.StackOverflowError at JDK14LoggerAdapter.java:581
org.apache.beam.sdk.transforms.ViewTest > testWindowedSingletonSideInput FAILED
java.lang.StackOverflowError at JDK14LoggerAdapter.java:581
org.apache.beam.sdk.transforms.ViewTest > testWindowedMultimapSideInput FAILED
java.lang.StackOverflowError at JDK14LoggerAdapter.java:581
org.apache.beam.sdk.transforms.ViewTest > testSideInputWithNullDefault FAILED
java.lang.StackOverflowError at JDK14LoggerAdapter.java:581
org.apache.beam.sdk.transforms.ViewTest > testWindowedListSideInput FAILED
java.lang.StackOverflowError at JDK14LoggerAdapter.java:581
org.apache.beam.sdk.transforms.ViewTest > testWindowedMapSideInput FAILED
java.lang.StackOverflowError at JDK14LoggerAdapter.java:581
org.apache.beam.sdk.transforms.ViewTest > testIterableSideInputIsImmutable FAILED
java.lang.StackOverflowError at JDK14LoggerAdapter.java:581
org.apache.beam.sdk.transforms.ViewTest > testListSideInputIsImmutable FAILED
java.lang.StackOverflowError at JDK14LoggerAdapter.java:581
org.apache.beam.sdk.transforms.ViewTest > testEmptyListSideInput FAILED
java.lang.StackOverflowError at JDK14LoggerAdapter.java:581
org.apache.beam.sdk.transforms.ViewTest > testWindowedSideInputFixedToFixed FAILED
java.lang.StackOverflowError at JDK14LoggerAdapter.java:581
org.apache.beam.sdk.transforms.ViewTest > testIterableSideInput FAILED
java.lang.StackOverflowError at JDK14LoggerAdapter.java:581
org.apache.beam.sdk.transforms.ViewTest > testEmptyMultimapSideInputWithNonDeterministicKeyCoder FAILED
java.lang.StackOverflowError at JDK14LoggerAdapter.java:581
org.apache.beam.sdk.transforms.ViewTest > testEmptyMapSideInput FAILED
java.lang.StackOverflowError at JDK14LoggerAdapter.java:581
org.apache.beam.sdk.transforms.ViewTest > testMapSideInputIsImmutable FAILED
java.lang.StackOverflowError at JDK14LoggerAdapter.java:581
org.apache.beam.sdk.transforms.ViewTest > testWindowedMapAsEntrySetSideInput FAILED
java.lang.StackOverflowError at JDK14LoggerAdapter.java:581
org.apache.beam.sdk.transforms.ViewTest > testEmptyMapSideInputWithNonDeterministicKeyCoder FAILED
java.lang.StackOverflowError at JDK14LoggerAdapter.java:581
org.apache.beam.sdk.transforms.ViewTest > testMultimapAsEntrySetSideInput FAILED
java.lang.StackOverflowError at JDK14LoggerAdapter.java:581
org.apache.beam.sdk.transforms.ViewTest > testSingletonSideInput FAILED
java.lang.StackOverflowError at JDK14LoggerAdapter.java:581
org.apache.beam.sdk.transforms.windowing.WindowTest > testTimestampCombinerEndOfWindow FAILED
java.lang.StackOverflowError at JDK14LoggerAdapter.java:595
org.apache.beam.sdk.transforms.windowing.WindowTest > testTimestampCombinerDefault FAILED
java.lang.StackOverflowError at JDK14LoggerAdapter.java:595
org.apache.beam.sdk.transforms.windowing.WindowTest > testMergingCustomWindows FAILED
java.lang.StackOverflowError at JDK14LoggerAdapter.java:581
org.apache.beam.sdk.transforms.windowing.WindowTest > testNoWindowFnDoesNotReassignWindows FAILED
java.lang.StackOverflowError at JDK14LoggerAdapter.java:595
org.apache.beam.sdk.transforms.windowing.WindowTest > testMergingCustomWindowsWithoutCustomWindowTypes FAILED
java.lang.StackOverflowError at JDK14LoggerAdapter.java:581
org.apache.beam.sdk.transforms.windowing.WindowTest > testMergingCustomWindowsKeyedCollection FAILED
java.lang.StackOverflowError at JDK14LoggerAdapter.java:581
org.apache.beam.sdk.values.PCollectionTupleTest > testComposePCollectionTuple FAILED
java.lang.StackOverflowError at JDK14LoggerAdapter.java:595
org.apache.beam.runners.core.metrics.MetricsPusherTest > pushesUserMetrics FAILED
java.lang.StackOverflowError at SLF4JBridgeHandler.java:220
227 tests completed, 219 failed, 1 skipped
> Task :runners:spark:3:validatesRunnerStreaming FAILED
FAILURE: Build completed with 3 failures.
1: Task failed with an exception.
-----------
* What went wrong:
Execution failed for task ':runners:spark:3:validatesRunnerBatch'.
> There were failing tests. See the report at: file://<https://ci-beam.apache.org/job/beam_PostCommit_Java_ValidatesRunner_Spark/ws/src/runners/spark/3/build/reports/tests/validatesRunnerBatch/index.html>
* Try:
> Run with --stacktrace option to get the stack trace.
> Run with --info or --debug option to get more log output.
==============================================================================
2: Task failed with an exception.
-----------
* What went wrong:
Execution failed for task ':runners:spark:3:validatesRunnerBatchWithBoundedSDFExperiment'.
> There were failing tests. See the report at: file://<https://ci-beam.apache.org/job/beam_PostCommit_Java_ValidatesRunner_Spark/ws/src/runners/spark/3/build/reports/tests/validatesRunnerBatchWithBoundedSDFExperiment/index.html>
* Try:
> Run with --stacktrace option to get the stack trace.
> Run with --info or --debug option to get more log output.
==============================================================================
3: Task failed with an exception.
-----------
* What went wrong:
Execution failed for task ':runners:spark:3:validatesRunnerStreaming'.
> There were failing tests. See the report at: file://<https://ci-beam.apache.org/job/beam_PostCommit_Java_ValidatesRunner_Spark/ws/src/runners/spark/3/build/reports/tests/validatesRunnerStreaming/index.html>
* Try:
> Run with --stacktrace option to get the stack trace.
> Run with --info or --debug option to get more log output.
==============================================================================
* Get more help at https://help.gradle.org
Deprecated Gradle features were used in this build, making it incompatible with Gradle 8.0.
You can use '--warning-mode all' to show the individual deprecation warnings and determine if they come from your own scripts or plugins.
See https://docs.gradle.org/7.5.1/userguide/command_line_interface.html#sec:command_line_warnings
BUILD FAILED in 13m 59s
143 actionable tasks: 87 executed, 54 from cache, 2 up-to-date
Publishing build scan...
https://ge.apache.org/s/mfbgzixz4i4nc
Build step 'Invoke Gradle script' changed build result to FAILURE
Build step 'Invoke Gradle script' marked build as failure
---------------------------------------------------------------------
To unsubscribe, e-mail: builds-unsubscribe@beam.apache.org
For additional commands, e-mail: builds-help@beam.apache.org
Build failed in Jenkins: beam_PostCommit_Java_ValidatesRunner_Spark #11847
Posted by Apache Jenkins Server <je...@builds.apache.org>.
See <https://ci-beam.apache.org/job/beam_PostCommit_Java_ValidatesRunner_Spark/11847/display/redirect?page=changes>
Changes:
[noreply] Add new Beam Java SDK examples (#26488)
------------------------------------------
[...truncated 123.22 KB...]
java.lang.StackOverflowError at JDK14LoggerAdapter.java:595
org.apache.beam.sdk.transforms.ParDoSchemaTest > testSimpleSchemaPipeline FAILED
java.lang.StackOverflowError at JDK14LoggerAdapter.java:581
org.apache.beam.sdk.transforms.ReshuffleTest > testReshuffleAfterSessionsAndGroupByKey FAILED
java.lang.StackOverflowError at Throwable.java:825
org.apache.beam.sdk.transforms.windowing.WindowingTest > testMergingWindowing FAILED
java.lang.StackOverflowError at JDK14LoggerAdapter.java:595
org.apache.beam.sdk.transforms.join.CoGroupByKeyTest > testCoGroupByKeyWithWindowing FAILED
java.lang.StackOverflowError at JDK14LoggerAdapter.java:595
org.apache.beam.sdk.transforms.ParDoSchemaTest > testSchemaConversionPipeline FAILED
java.lang.StackOverflowError at JDK14LoggerAdapter.java:581
org.apache.beam.sdk.transforms.ReshuffleTest > testReshuffleAfterFixedWindows FAILED
java.lang.StackOverflowError at Throwable.java:825
org.apache.beam.sdk.transforms.windowing.WindowingTest > testWindowPreservation FAILED
java.lang.StackOverflowError at JDK14LoggerAdapter.java:581
org.apache.beam.sdk.values.PCollectionRowTupleTest > testComposePCollectionRowTuple FAILED
java.lang.StackOverflowError at JDK14LoggerAdapter.java:595
org.apache.beam.sdk.transforms.ParDoSchemaTest > testReadAndWriteWithSchemaRegistry FAILED
java.lang.StackOverflowError at JDK14LoggerAdapter.java:581
org.apache.beam.sdk.transforms.ReshuffleTest > testReshuffleAfterFixedWindowsAndGroupByKey FAILED
java.lang.StackOverflowError at Throwable.java:825
org.apache.beam.sdk.transforms.windowing.WindowingTest > testNonPartitioningWindowing FAILED
java.lang.StackOverflowError at JDK14LoggerAdapter.java:595
org.apache.beam.sdk.transforms.ParDoSchemaTest > testReadAndWriteMultiOutput FAILED
java.lang.StackOverflowError at JDK14LoggerAdapter.java:595
org.apache.beam.sdk.transforms.ReshuffleTest > testReshuffleAfterSlidingWindows FAILED
java.lang.StackOverflowError at Throwable.java:825
org.apache.beam.sdk.transforms.windowing.WindowingTest > testPartitioningWindowing FAILED
java.lang.StackOverflowError at JDK14LoggerAdapter.java:595
org.apache.beam.sdk.transforms.ParDoSchemaTest > testNestedSchema FAILED
java.lang.StackOverflowError at JDK14LoggerAdapter.java:581
org.apache.beam.sdk.transforms.ReshuffleTest > testReshufflePreservesTimestamps FAILED
java.lang.StackOverflowError at Throwable.java:825
org.apache.beam.sdk.transforms.ReshuffleTest > testReshuffleAfterSlidingWindowsAndGroupByKey FAILED
java.lang.StackOverflowError at Throwable.java:825
org.apache.beam.sdk.transforms.ReshuffleTest > testJustReshuffle FAILED
java.lang.StackOverflowError at Throwable.java:825
org.apache.beam.sdk.transforms.ViewTest > testEmptySingletonSideInput FAILED
java.lang.AssertionError at MatcherAssert.java:18
org.apache.beam.sdk.transforms.ViewTest > testMapAsEntrySetSideInput FAILED
java.lang.StackOverflowError at JDK14LoggerAdapter.java:581
org.apache.beam.sdk.transforms.ViewTest > testNonSingletonSideInput FAILED
java.lang.AssertionError at MatcherAssert.java:18
org.apache.beam.sdk.transforms.ViewTest > testMultimapSideInput FAILED
java.lang.StackOverflowError at JDK14LoggerAdapter.java:581
org.apache.beam.sdk.transforms.ViewTest > testEmptyIterableSideInput FAILED
java.lang.StackOverflowError at JDK14LoggerAdapter.java:581
org.apache.beam.sdk.transforms.ViewTest > testMapSideInputWithNullValuesCatchesDuplicates FAILED
java.lang.AssertionError at MatcherAssert.java:18
org.apache.beam.sdk.transforms.ViewTest > testSideInputWithNestedIterables FAILED
java.lang.StackOverflowError at JDK14LoggerAdapter.java:581
org.apache.beam.sdk.transforms.ViewTest > testListSideInput FAILED
java.lang.StackOverflowError at JDK14LoggerAdapter.java:581
org.apache.beam.sdk.transforms.ViewTest > testMapSideInput FAILED
java.lang.StackOverflowError at JDK14LoggerAdapter.java:581
org.apache.beam.sdk.transforms.ViewTest > testWindowedSideInputFixedToFixedWithDefault FAILED
java.lang.StackOverflowError at JDK14LoggerAdapter.java:581
org.apache.beam.sdk.transforms.ViewTest > testWindowedIterableSideInput FAILED
java.lang.StackOverflowError at JDK14LoggerAdapter.java:581
org.apache.beam.sdk.transforms.ViewTest > testWindowedMapSideInputWithNonDeterministicKeyCoder FAILED
java.lang.StackOverflowError at JDK14LoggerAdapter.java:581
org.apache.beam.sdk.transforms.ViewTest > testWindowedSideInputFixedToGlobal FAILED
java.lang.StackOverflowError at JDK14LoggerAdapter.java:581
org.apache.beam.sdk.transforms.ViewTest > testMultimapSideInputWithNonDeterministicKeyCoder FAILED
java.lang.StackOverflowError at JDK14LoggerAdapter.java:581
org.apache.beam.sdk.transforms.ViewTest > testEmptyMultimapSideInput FAILED
java.lang.StackOverflowError at JDK14LoggerAdapter.java:581
org.apache.beam.sdk.transforms.ViewTest > testDiscardingNonSingletonSideInput FAILED
java.lang.AssertionError at MatcherAssert.java:18
org.apache.beam.sdk.transforms.ViewTest > testCombinedMapSideInput FAILED
java.lang.StackOverflowError at JDK14LoggerAdapter.java:581
org.apache.beam.sdk.transforms.ViewTest > testMultimapSideInputIsImmutable FAILED
java.lang.StackOverflowError at JDK14LoggerAdapter.java:581
org.apache.beam.sdk.transforms.ViewTest > testWindowedMultimapAsEntrySetSideInput FAILED
java.lang.StackOverflowError at JDK14LoggerAdapter.java:581
org.apache.beam.sdk.transforms.ViewTest > testWindowedMultimapSideInputWithNonDeterministicKeyCoder FAILED
java.lang.StackOverflowError at JDK14LoggerAdapter.java:581
org.apache.beam.sdk.transforms.ViewTest > testMapSideInputWithNonDeterministicKeyCoder FAILED
java.lang.StackOverflowError at JDK14LoggerAdapter.java:581
org.apache.beam.sdk.transforms.ViewTest > testWindowedSingletonSideInput FAILED
java.lang.StackOverflowError at JDK14LoggerAdapter.java:581
org.apache.beam.sdk.transforms.ViewTest > testWindowedMultimapSideInput FAILED
java.lang.StackOverflowError at JDK14LoggerAdapter.java:581
org.apache.beam.sdk.transforms.ViewTest > testSideInputWithNullDefault FAILED
java.lang.StackOverflowError at JDK14LoggerAdapter.java:581
org.apache.beam.sdk.transforms.ViewTest > testWindowedListSideInput FAILED
java.lang.StackOverflowError at JDK14LoggerAdapter.java:581
org.apache.beam.sdk.transforms.ViewTest > testWindowedMapSideInput FAILED
java.lang.StackOverflowError at JDK14LoggerAdapter.java:581
org.apache.beam.sdk.transforms.ViewTest > testIterableSideInputIsImmutable FAILED
java.lang.StackOverflowError at JDK14LoggerAdapter.java:581
org.apache.beam.sdk.transforms.ViewTest > testListSideInputIsImmutable FAILED
java.lang.StackOverflowError at JDK14LoggerAdapter.java:581
org.apache.beam.sdk.transforms.ViewTest > testEmptyListSideInput FAILED
java.lang.StackOverflowError at JDK14LoggerAdapter.java:581
org.apache.beam.sdk.transforms.ViewTest > testWindowedSideInputFixedToFixed FAILED
java.lang.StackOverflowError at JDK14LoggerAdapter.java:581
org.apache.beam.sdk.transforms.ViewTest > testIterableSideInput FAILED
java.lang.StackOverflowError at JDK14LoggerAdapter.java:581
org.apache.beam.sdk.transforms.ViewTest > testEmptyMultimapSideInputWithNonDeterministicKeyCoder FAILED
java.lang.StackOverflowError at JDK14LoggerAdapter.java:581
org.apache.beam.sdk.transforms.ViewTest > testEmptyMapSideInput FAILED
java.lang.StackOverflowError at JDK14LoggerAdapter.java:581
org.apache.beam.sdk.transforms.ViewTest > testMapSideInputIsImmutable FAILED
java.lang.StackOverflowError at JDK14LoggerAdapter.java:581
org.apache.beam.sdk.transforms.ViewTest > testWindowedMapAsEntrySetSideInput FAILED
java.lang.StackOverflowError at JDK14LoggerAdapter.java:581
org.apache.beam.sdk.transforms.ViewTest > testEmptyMapSideInputWithNonDeterministicKeyCoder FAILED
java.lang.StackOverflowError at JDK14LoggerAdapter.java:581
org.apache.beam.sdk.transforms.ViewTest > testMultimapAsEntrySetSideInput FAILED
java.lang.StackOverflowError at JDK14LoggerAdapter.java:581
org.apache.beam.sdk.transforms.ViewTest > testSingletonSideInput FAILED
java.lang.StackOverflowError at JDK14LoggerAdapter.java:581
org.apache.beam.sdk.transforms.windowing.WindowTest > testTimestampCombinerEndOfWindow FAILED
java.lang.StackOverflowError at JDK14LoggerAdapter.java:595
org.apache.beam.sdk.transforms.windowing.WindowTest > testTimestampCombinerDefault FAILED
java.lang.StackOverflowError at JDK14LoggerAdapter.java:595
org.apache.beam.sdk.transforms.windowing.WindowTest > testMergingCustomWindows FAILED
java.lang.StackOverflowError at JDK14LoggerAdapter.java:581
org.apache.beam.sdk.transforms.windowing.WindowTest > testNoWindowFnDoesNotReassignWindows FAILED
java.lang.StackOverflowError at JDK14LoggerAdapter.java:595
org.apache.beam.sdk.transforms.windowing.WindowTest > testMergingCustomWindowsWithoutCustomWindowTypes FAILED
java.lang.StackOverflowError at JDK14LoggerAdapter.java:581
org.apache.beam.sdk.transforms.windowing.WindowTest > testMergingCustomWindowsKeyedCollection FAILED
java.lang.StackOverflowError at JDK14LoggerAdapter.java:581
org.apache.beam.sdk.values.PCollectionTupleTest > testComposePCollectionTuple FAILED
java.lang.StackOverflowError at JDK14LoggerAdapter.java:595
org.apache.beam.runners.core.metrics.MetricsPusherTest > pushesUserMetrics FAILED
java.lang.StackOverflowError at SLF4JBridgeHandler.java:220
227 tests completed, 219 failed, 1 skipped
> Task :runners:spark:3:validatesRunnerStreaming FAILED
FAILURE: Build completed with 3 failures.
1: Task failed with an exception.
-----------
* What went wrong:
Execution failed for task ':runners:spark:3:validatesRunnerBatch'.
> There were failing tests. See the report at: file://<https://ci-beam.apache.org/job/beam_PostCommit_Java_ValidatesRunner_Spark/ws/src/runners/spark/3/build/reports/tests/validatesRunnerBatch/index.html>
* Try:
> Run with --stacktrace option to get the stack trace.
> Run with --info or --debug option to get more log output.
==============================================================================
2: Task failed with an exception.
-----------
* What went wrong:
Execution failed for task ':runners:spark:3:validatesRunnerBatchWithBoundedSDFExperiment'.
> There were failing tests. See the report at: file://<https://ci-beam.apache.org/job/beam_PostCommit_Java_ValidatesRunner_Spark/ws/src/runners/spark/3/build/reports/tests/validatesRunnerBatchWithBoundedSDFExperiment/index.html>
* Try:
> Run with --stacktrace option to get the stack trace.
> Run with --info or --debug option to get more log output.
==============================================================================
3: Task failed with an exception.
-----------
* What went wrong:
Execution failed for task ':runners:spark:3:validatesRunnerStreaming'.
> There were failing tests. See the report at: file://<https://ci-beam.apache.org/job/beam_PostCommit_Java_ValidatesRunner_Spark/ws/src/runners/spark/3/build/reports/tests/validatesRunnerStreaming/index.html>
* Try:
> Run with --stacktrace option to get the stack trace.
> Run with --info or --debug option to get more log output.
==============================================================================
* Get more help at https://help.gradle.org
Deprecated Gradle features were used in this build, making it incompatible with Gradle 8.0.
You can use '--warning-mode all' to show the individual deprecation warnings and determine if they come from your own scripts or plugins.
See https://docs.gradle.org/7.5.1/userguide/command_line_interface.html#sec:command_line_warnings
BUILD FAILED in 13m 57s
143 actionable tasks: 87 executed, 54 from cache, 2 up-to-date
Publishing build scan...
https://ge.apache.org/s/dnds5ljxpn4ha
Build step 'Invoke Gradle script' changed build result to FAILURE
Build step 'Invoke Gradle script' marked build as failure
---------------------------------------------------------------------
To unsubscribe, e-mail: builds-unsubscribe@beam.apache.org
For additional commands, e-mail: builds-help@beam.apache.org
Build failed in Jenkins: beam_PostCommit_Java_ValidatesRunner_Spark #11846
Posted by Apache Jenkins Server <je...@builds.apache.org>.
See <https://ci-beam.apache.org/job/beam_PostCommit_Java_ValidatesRunner_Spark/11846/display/redirect>
Changes:
------------------------------------------
[...truncated 123.25 KB...]
java.lang.StackOverflowError at JDK14LoggerAdapter.java:581
org.apache.beam.sdk.transforms.join.CoGroupByKeyTest > testCoGroupByKeyHandleResults FAILED
java.lang.StackOverflowError at JDK14LoggerAdapter.java:595
org.apache.beam.sdk.transforms.ReshuffleTest > testReshuffleAfterSessionsAndGroupByKey FAILED
java.lang.StackOverflowError at Throwable.java:825
org.apache.beam.sdk.transforms.windowing.WindowingTest > testMergingWindowing FAILED
java.lang.StackOverflowError at JDK14LoggerAdapter.java:595
org.apache.beam.sdk.transforms.ParDoSchemaTest > testSchemaConversionPipeline FAILED
java.lang.StackOverflowError at JDK14LoggerAdapter.java:581
org.apache.beam.sdk.transforms.join.CoGroupByKeyTest > testCoGroupByKeyWithWindowing FAILED
java.lang.StackOverflowError at JDK14LoggerAdapter.java:595
org.apache.beam.sdk.transforms.ReshuffleTest > testReshuffleAfterFixedWindows FAILED
java.lang.StackOverflowError at Throwable.java:825
org.apache.beam.sdk.transforms.windowing.WindowingTest > testWindowPreservation FAILED
java.lang.StackOverflowError at JDK14LoggerAdapter.java:581
org.apache.beam.sdk.transforms.ParDoSchemaTest > testReadAndWriteWithSchemaRegistry FAILED
java.lang.StackOverflowError at JDK14LoggerAdapter.java:581
org.apache.beam.sdk.values.PCollectionRowTupleTest > testComposePCollectionRowTuple FAILED
java.lang.StackOverflowError at JDK14LoggerAdapter.java:595
org.apache.beam.sdk.transforms.ReshuffleTest > testReshuffleAfterFixedWindowsAndGroupByKey FAILED
java.lang.StackOverflowError at Throwable.java:825
org.apache.beam.sdk.transforms.windowing.WindowingTest > testNonPartitioningWindowing FAILED
java.lang.StackOverflowError at JDK14LoggerAdapter.java:595
org.apache.beam.sdk.transforms.ParDoSchemaTest > testReadAndWriteMultiOutput FAILED
java.lang.StackOverflowError at JDK14LoggerAdapter.java:595
org.apache.beam.sdk.transforms.ReshuffleTest > testReshuffleAfterSlidingWindows FAILED
java.lang.StackOverflowError at Throwable.java:825
org.apache.beam.sdk.transforms.windowing.WindowingTest > testPartitioningWindowing FAILED
java.lang.StackOverflowError at JDK14LoggerAdapter.java:595
org.apache.beam.sdk.transforms.ParDoSchemaTest > testNestedSchema FAILED
java.lang.StackOverflowError at JDK14LoggerAdapter.java:581
org.apache.beam.sdk.transforms.ReshuffleTest > testReshufflePreservesTimestamps FAILED
java.lang.StackOverflowError at Throwable.java:825
org.apache.beam.sdk.transforms.ReshuffleTest > testReshuffleAfterSlidingWindowsAndGroupByKey FAILED
java.lang.StackOverflowError at Throwable.java:825
org.apache.beam.sdk.transforms.ReshuffleTest > testJustReshuffle FAILED
java.lang.StackOverflowError at Throwable.java:825
org.apache.beam.sdk.transforms.ViewTest > testEmptySingletonSideInput FAILED
java.lang.AssertionError at MatcherAssert.java:18
org.apache.beam.sdk.transforms.ViewTest > testMapAsEntrySetSideInput FAILED
java.lang.StackOverflowError at JDK14LoggerAdapter.java:581
org.apache.beam.sdk.transforms.ViewTest > testNonSingletonSideInput FAILED
java.lang.AssertionError at MatcherAssert.java:18
org.apache.beam.sdk.transforms.ViewTest > testMultimapSideInput FAILED
java.lang.StackOverflowError at JDK14LoggerAdapter.java:581
org.apache.beam.sdk.transforms.ViewTest > testEmptyIterableSideInput FAILED
java.lang.StackOverflowError at JDK14LoggerAdapter.java:581
org.apache.beam.sdk.transforms.ViewTest > testMapSideInputWithNullValuesCatchesDuplicates FAILED
java.lang.AssertionError at MatcherAssert.java:18
org.apache.beam.sdk.transforms.ViewTest > testSideInputWithNestedIterables FAILED
java.lang.StackOverflowError at JDK14LoggerAdapter.java:581
org.apache.beam.sdk.transforms.ViewTest > testListSideInput FAILED
java.lang.StackOverflowError at JDK14LoggerAdapter.java:581
org.apache.beam.sdk.transforms.ViewTest > testMapSideInput FAILED
java.lang.StackOverflowError at JDK14LoggerAdapter.java:581
org.apache.beam.sdk.transforms.ViewTest > testWindowedSideInputFixedToFixedWithDefault FAILED
java.lang.StackOverflowError at JDK14LoggerAdapter.java:581
org.apache.beam.sdk.transforms.ViewTest > testWindowedIterableSideInput FAILED
java.lang.StackOverflowError at JDK14LoggerAdapter.java:581
org.apache.beam.sdk.transforms.ViewTest > testWindowedMapSideInputWithNonDeterministicKeyCoder FAILED
java.lang.StackOverflowError at JDK14LoggerAdapter.java:581
org.apache.beam.sdk.transforms.ViewTest > testWindowedSideInputFixedToGlobal FAILED
java.lang.StackOverflowError at JDK14LoggerAdapter.java:581
org.apache.beam.sdk.transforms.ViewTest > testMultimapSideInputWithNonDeterministicKeyCoder FAILED
java.lang.StackOverflowError at JDK14LoggerAdapter.java:581
org.apache.beam.sdk.transforms.ViewTest > testEmptyMultimapSideInput FAILED
java.lang.StackOverflowError at JDK14LoggerAdapter.java:581
org.apache.beam.sdk.transforms.ViewTest > testDiscardingNonSingletonSideInput FAILED
java.lang.AssertionError at MatcherAssert.java:18
org.apache.beam.sdk.transforms.ViewTest > testCombinedMapSideInput FAILED
java.lang.StackOverflowError at JDK14LoggerAdapter.java:581
org.apache.beam.sdk.transforms.ViewTest > testMultimapSideInputIsImmutable FAILED
java.lang.StackOverflowError at JDK14LoggerAdapter.java:581
org.apache.beam.sdk.transforms.ViewTest > testWindowedMultimapAsEntrySetSideInput FAILED
java.lang.StackOverflowError at JDK14LoggerAdapter.java:581
org.apache.beam.sdk.transforms.ViewTest > testWindowedMultimapSideInputWithNonDeterministicKeyCoder FAILED
java.lang.StackOverflowError at JDK14LoggerAdapter.java:581
org.apache.beam.sdk.transforms.ViewTest > testMapSideInputWithNonDeterministicKeyCoder FAILED
java.lang.StackOverflowError at JDK14LoggerAdapter.java:581
org.apache.beam.sdk.transforms.ViewTest > testWindowedSingletonSideInput FAILED
java.lang.StackOverflowError at JDK14LoggerAdapter.java:581
org.apache.beam.sdk.transforms.ViewTest > testWindowedMultimapSideInput FAILED
java.lang.StackOverflowError at JDK14LoggerAdapter.java:581
org.apache.beam.sdk.transforms.ViewTest > testSideInputWithNullDefault FAILED
java.lang.StackOverflowError at JDK14LoggerAdapter.java:581
org.apache.beam.sdk.transforms.ViewTest > testWindowedListSideInput FAILED
java.lang.StackOverflowError at JDK14LoggerAdapter.java:581
org.apache.beam.sdk.transforms.ViewTest > testWindowedMapSideInput FAILED
java.lang.StackOverflowError at JDK14LoggerAdapter.java:581
org.apache.beam.sdk.transforms.ViewTest > testIterableSideInputIsImmutable FAILED
java.lang.StackOverflowError at JDK14LoggerAdapter.java:581
org.apache.beam.sdk.transforms.ViewTest > testListSideInputIsImmutable FAILED
java.lang.StackOverflowError at JDK14LoggerAdapter.java:581
org.apache.beam.sdk.transforms.ViewTest > testEmptyListSideInput FAILED
java.lang.StackOverflowError at JDK14LoggerAdapter.java:581
org.apache.beam.sdk.transforms.ViewTest > testWindowedSideInputFixedToFixed FAILED
java.lang.StackOverflowError at JDK14LoggerAdapter.java:581
org.apache.beam.sdk.transforms.ViewTest > testIterableSideInput FAILED
java.lang.StackOverflowError at JDK14LoggerAdapter.java:581
org.apache.beam.sdk.transforms.ViewTest > testEmptyMultimapSideInputWithNonDeterministicKeyCoder FAILED
java.lang.StackOverflowError at JDK14LoggerAdapter.java:581
org.apache.beam.sdk.transforms.ViewTest > testEmptyMapSideInput FAILED
java.lang.StackOverflowError at JDK14LoggerAdapter.java:581
org.apache.beam.sdk.transforms.ViewTest > testMapSideInputIsImmutable FAILED
java.lang.StackOverflowError at JDK14LoggerAdapter.java:581
org.apache.beam.sdk.transforms.ViewTest > testWindowedMapAsEntrySetSideInput FAILED
java.lang.StackOverflowError at JDK14LoggerAdapter.java:581
org.apache.beam.sdk.transforms.ViewTest > testEmptyMapSideInputWithNonDeterministicKeyCoder FAILED
java.lang.StackOverflowError at JDK14LoggerAdapter.java:581
org.apache.beam.sdk.transforms.ViewTest > testMultimapAsEntrySetSideInput FAILED
java.lang.StackOverflowError at JDK14LoggerAdapter.java:581
org.apache.beam.sdk.transforms.ViewTest > testSingletonSideInput FAILED
java.lang.StackOverflowError at JDK14LoggerAdapter.java:581
org.apache.beam.sdk.transforms.windowing.WindowTest > testTimestampCombinerEndOfWindow FAILED
java.lang.StackOverflowError at JDK14LoggerAdapter.java:595
org.apache.beam.sdk.transforms.windowing.WindowTest > testTimestampCombinerDefault FAILED
java.lang.StackOverflowError at JDK14LoggerAdapter.java:595
org.apache.beam.sdk.transforms.windowing.WindowTest > testMergingCustomWindows FAILED
java.lang.StackOverflowError at JDK14LoggerAdapter.java:581
org.apache.beam.sdk.transforms.windowing.WindowTest > testNoWindowFnDoesNotReassignWindows FAILED
java.lang.StackOverflowError at JDK14LoggerAdapter.java:595
org.apache.beam.sdk.transforms.windowing.WindowTest > testMergingCustomWindowsWithoutCustomWindowTypes FAILED
java.lang.StackOverflowError at JDK14LoggerAdapter.java:581
org.apache.beam.sdk.transforms.windowing.WindowTest > testMergingCustomWindowsKeyedCollection FAILED
java.lang.StackOverflowError at JDK14LoggerAdapter.java:581
org.apache.beam.sdk.values.PCollectionTupleTest > testComposePCollectionTuple FAILED
java.lang.StackOverflowError at JDK14LoggerAdapter.java:595
org.apache.beam.runners.core.metrics.MetricsPusherTest > pushesUserMetrics FAILED
java.lang.StackOverflowError at SLF4JBridgeHandler.java:220
227 tests completed, 219 failed, 1 skipped
> Task :runners:spark:3:validatesRunnerStreaming FAILED
FAILURE: Build completed with 3 failures.
1: Task failed with an exception.
-----------
* What went wrong:
Execution failed for task ':runners:spark:3:validatesRunnerBatch'.
> There were failing tests. See the report at: file://<https://ci-beam.apache.org/job/beam_PostCommit_Java_ValidatesRunner_Spark/ws/src/runners/spark/3/build/reports/tests/validatesRunnerBatch/index.html>
* Try:
> Run with --stacktrace option to get the stack trace.
> Run with --info or --debug option to get more log output.
==============================================================================
2: Task failed with an exception.
-----------
* What went wrong:
Execution failed for task ':runners:spark:3:validatesRunnerBatchWithBoundedSDFExperiment'.
> There were failing tests. See the report at: file://<https://ci-beam.apache.org/job/beam_PostCommit_Java_ValidatesRunner_Spark/ws/src/runners/spark/3/build/reports/tests/validatesRunnerBatchWithBoundedSDFExperiment/index.html>
* Try:
> Run with --stacktrace option to get the stack trace.
> Run with --info or --debug option to get more log output.
==============================================================================
3: Task failed with an exception.
-----------
* What went wrong:
Execution failed for task ':runners:spark:3:validatesRunnerStreaming'.
> There were failing tests. See the report at: file://<https://ci-beam.apache.org/job/beam_PostCommit_Java_ValidatesRunner_Spark/ws/src/runners/spark/3/build/reports/tests/validatesRunnerStreaming/index.html>
* Try:
> Run with --stacktrace option to get the stack trace.
> Run with --info or --debug option to get more log output.
==============================================================================
* Get more help at https://help.gradle.org
Deprecated Gradle features were used in this build, making it incompatible with Gradle 8.0.
You can use '--warning-mode all' to show the individual deprecation warnings and determine if they come from your own scripts or plugins.
See https://docs.gradle.org/7.5.1/userguide/command_line_interface.html#sec:command_line_warnings
BUILD FAILED in 14m 7s
143 actionable tasks: 87 executed, 54 from cache, 2 up-to-date
Publishing build scan...
https://ge.apache.org/s/2njurhjd66wfk
Build step 'Invoke Gradle script' changed build result to FAILURE
Build step 'Invoke Gradle script' marked build as failure
---------------------------------------------------------------------
To unsubscribe, e-mail: builds-unsubscribe@beam.apache.org
For additional commands, e-mail: builds-help@beam.apache.org
Build failed in Jenkins: beam_PostCommit_Java_ValidatesRunner_Spark #11845
Posted by Apache Jenkins Server <je...@builds.apache.org>.
See <https://ci-beam.apache.org/job/beam_PostCommit_Java_ValidatesRunner_Spark/11845/display/redirect>
Changes:
------------------------------------------
[...truncated 123.23 KB...]
java.lang.StackOverflowError at JDK14LoggerAdapter.java:595
org.apache.beam.sdk.transforms.ParDoSchemaTest > testSimpleSchemaPipeline FAILED
java.lang.StackOverflowError at JDK14LoggerAdapter.java:581
org.apache.beam.sdk.transforms.ReshuffleTest > testReshuffleAfterSessionsAndGroupByKey FAILED
java.lang.StackOverflowError at Throwable.java:825
org.apache.beam.sdk.transforms.windowing.WindowingTest > testMergingWindowing FAILED
java.lang.StackOverflowError at JDK14LoggerAdapter.java:595
org.apache.beam.sdk.transforms.join.CoGroupByKeyTest > testCoGroupByKeyWithWindowing FAILED
java.lang.StackOverflowError at JDK14LoggerAdapter.java:595
org.apache.beam.sdk.transforms.ParDoSchemaTest > testSchemaConversionPipeline FAILED
java.lang.StackOverflowError at JDK14LoggerAdapter.java:581
org.apache.beam.sdk.transforms.ReshuffleTest > testReshuffleAfterFixedWindows FAILED
java.lang.StackOverflowError at Throwable.java:825
org.apache.beam.sdk.transforms.windowing.WindowingTest > testWindowPreservation FAILED
java.lang.StackOverflowError at JDK14LoggerAdapter.java:581
org.apache.beam.sdk.values.PCollectionRowTupleTest > testComposePCollectionRowTuple FAILED
java.lang.StackOverflowError at JDK14LoggerAdapter.java:595
org.apache.beam.sdk.transforms.ParDoSchemaTest > testReadAndWriteWithSchemaRegistry FAILED
java.lang.StackOverflowError at JDK14LoggerAdapter.java:581
org.apache.beam.sdk.transforms.ReshuffleTest > testReshuffleAfterFixedWindowsAndGroupByKey FAILED
java.lang.StackOverflowError at Throwable.java:825
org.apache.beam.sdk.transforms.windowing.WindowingTest > testNonPartitioningWindowing FAILED
java.lang.StackOverflowError at JDK14LoggerAdapter.java:595
org.apache.beam.sdk.transforms.ParDoSchemaTest > testReadAndWriteMultiOutput FAILED
java.lang.StackOverflowError at JDK14LoggerAdapter.java:595
org.apache.beam.sdk.transforms.ReshuffleTest > testReshuffleAfterSlidingWindows FAILED
java.lang.StackOverflowError at Throwable.java:825
org.apache.beam.sdk.transforms.windowing.WindowingTest > testPartitioningWindowing FAILED
java.lang.StackOverflowError at JDK14LoggerAdapter.java:595
org.apache.beam.sdk.transforms.ParDoSchemaTest > testNestedSchema FAILED
java.lang.StackOverflowError at JDK14LoggerAdapter.java:581
org.apache.beam.sdk.transforms.ReshuffleTest > testReshufflePreservesTimestamps FAILED
java.lang.StackOverflowError at Throwable.java:825
org.apache.beam.sdk.transforms.ReshuffleTest > testReshuffleAfterSlidingWindowsAndGroupByKey FAILED
java.lang.StackOverflowError at Throwable.java:825
org.apache.beam.sdk.transforms.ReshuffleTest > testJustReshuffle FAILED
java.lang.StackOverflowError at Throwable.java:825
org.apache.beam.sdk.transforms.ViewTest > testEmptySingletonSideInput FAILED
java.lang.AssertionError at MatcherAssert.java:18
org.apache.beam.sdk.transforms.ViewTest > testMapAsEntrySetSideInput FAILED
java.lang.StackOverflowError at JDK14LoggerAdapter.java:581
org.apache.beam.sdk.transforms.ViewTest > testNonSingletonSideInput FAILED
java.lang.AssertionError at MatcherAssert.java:18
org.apache.beam.sdk.transforms.ViewTest > testMultimapSideInput FAILED
java.lang.StackOverflowError at JDK14LoggerAdapter.java:581
org.apache.beam.sdk.transforms.ViewTest > testEmptyIterableSideInput FAILED
java.lang.StackOverflowError at JDK14LoggerAdapter.java:581
org.apache.beam.sdk.transforms.ViewTest > testMapSideInputWithNullValuesCatchesDuplicates FAILED
java.lang.AssertionError at MatcherAssert.java:18
org.apache.beam.sdk.transforms.ViewTest > testSideInputWithNestedIterables FAILED
java.lang.StackOverflowError at JDK14LoggerAdapter.java:581
org.apache.beam.sdk.transforms.ViewTest > testListSideInput FAILED
java.lang.StackOverflowError at JDK14LoggerAdapter.java:581
org.apache.beam.sdk.transforms.ViewTest > testMapSideInput FAILED
java.lang.StackOverflowError at JDK14LoggerAdapter.java:581
org.apache.beam.sdk.transforms.ViewTest > testWindowedSideInputFixedToFixedWithDefault FAILED
java.lang.StackOverflowError at JDK14LoggerAdapter.java:581
org.apache.beam.sdk.transforms.ViewTest > testWindowedIterableSideInput FAILED
java.lang.StackOverflowError at JDK14LoggerAdapter.java:581
org.apache.beam.sdk.transforms.ViewTest > testWindowedMapSideInputWithNonDeterministicKeyCoder FAILED
java.lang.StackOverflowError at JDK14LoggerAdapter.java:581
org.apache.beam.sdk.transforms.ViewTest > testWindowedSideInputFixedToGlobal FAILED
java.lang.StackOverflowError at JDK14LoggerAdapter.java:581
org.apache.beam.sdk.transforms.ViewTest > testMultimapSideInputWithNonDeterministicKeyCoder FAILED
java.lang.StackOverflowError at JDK14LoggerAdapter.java:581
org.apache.beam.sdk.transforms.ViewTest > testEmptyMultimapSideInput FAILED
java.lang.StackOverflowError at JDK14LoggerAdapter.java:581
org.apache.beam.sdk.transforms.ViewTest > testDiscardingNonSingletonSideInput FAILED
java.lang.AssertionError at MatcherAssert.java:18
org.apache.beam.sdk.transforms.ViewTest > testCombinedMapSideInput FAILED
java.lang.StackOverflowError at JDK14LoggerAdapter.java:581
org.apache.beam.sdk.transforms.ViewTest > testMultimapSideInputIsImmutable FAILED
java.lang.StackOverflowError at JDK14LoggerAdapter.java:581
org.apache.beam.sdk.transforms.ViewTest > testWindowedMultimapAsEntrySetSideInput FAILED
java.lang.StackOverflowError at JDK14LoggerAdapter.java:581
org.apache.beam.sdk.transforms.ViewTest > testWindowedMultimapSideInputWithNonDeterministicKeyCoder FAILED
java.lang.StackOverflowError at JDK14LoggerAdapter.java:581
org.apache.beam.sdk.transforms.ViewTest > testMapSideInputWithNonDeterministicKeyCoder FAILED
java.lang.StackOverflowError at JDK14LoggerAdapter.java:581
org.apache.beam.sdk.transforms.ViewTest > testWindowedSingletonSideInput FAILED
java.lang.StackOverflowError at JDK14LoggerAdapter.java:581
org.apache.beam.sdk.transforms.ViewTest > testWindowedMultimapSideInput FAILED
java.lang.StackOverflowError at JDK14LoggerAdapter.java:581
org.apache.beam.sdk.transforms.ViewTest > testSideInputWithNullDefault FAILED
java.lang.StackOverflowError at JDK14LoggerAdapter.java:581
org.apache.beam.sdk.transforms.ViewTest > testWindowedListSideInput FAILED
java.lang.StackOverflowError at JDK14LoggerAdapter.java:581
org.apache.beam.sdk.transforms.ViewTest > testWindowedMapSideInput FAILED
java.lang.StackOverflowError at JDK14LoggerAdapter.java:581
org.apache.beam.sdk.transforms.ViewTest > testIterableSideInputIsImmutable FAILED
java.lang.StackOverflowError at JDK14LoggerAdapter.java:581
org.apache.beam.sdk.transforms.ViewTest > testListSideInputIsImmutable FAILED
java.lang.StackOverflowError at JDK14LoggerAdapter.java:581
org.apache.beam.sdk.transforms.ViewTest > testEmptyListSideInput FAILED
java.lang.StackOverflowError at JDK14LoggerAdapter.java:581
org.apache.beam.sdk.transforms.ViewTest > testWindowedSideInputFixedToFixed FAILED
java.lang.StackOverflowError at JDK14LoggerAdapter.java:581
org.apache.beam.sdk.transforms.ViewTest > testIterableSideInput FAILED
java.lang.StackOverflowError at JDK14LoggerAdapter.java:581
org.apache.beam.sdk.transforms.ViewTest > testEmptyMultimapSideInputWithNonDeterministicKeyCoder FAILED
java.lang.StackOverflowError at JDK14LoggerAdapter.java:581
org.apache.beam.sdk.transforms.ViewTest > testEmptyMapSideInput FAILED
java.lang.StackOverflowError at JDK14LoggerAdapter.java:581
org.apache.beam.sdk.transforms.ViewTest > testMapSideInputIsImmutable FAILED
java.lang.StackOverflowError at JDK14LoggerAdapter.java:581
org.apache.beam.sdk.transforms.ViewTest > testWindowedMapAsEntrySetSideInput FAILED
java.lang.StackOverflowError at JDK14LoggerAdapter.java:581
org.apache.beam.sdk.transforms.ViewTest > testEmptyMapSideInputWithNonDeterministicKeyCoder FAILED
java.lang.StackOverflowError at JDK14LoggerAdapter.java:581
org.apache.beam.sdk.transforms.ViewTest > testMultimapAsEntrySetSideInput FAILED
java.lang.StackOverflowError at JDK14LoggerAdapter.java:581
org.apache.beam.sdk.transforms.ViewTest > testSingletonSideInput FAILED
java.lang.StackOverflowError at JDK14LoggerAdapter.java:581
org.apache.beam.sdk.transforms.windowing.WindowTest > testTimestampCombinerEndOfWindow FAILED
java.lang.StackOverflowError at JDK14LoggerAdapter.java:595
org.apache.beam.sdk.transforms.windowing.WindowTest > testTimestampCombinerDefault FAILED
java.lang.StackOverflowError at JDK14LoggerAdapter.java:595
org.apache.beam.sdk.transforms.windowing.WindowTest > testMergingCustomWindows FAILED
java.lang.StackOverflowError at JDK14LoggerAdapter.java:581
org.apache.beam.sdk.transforms.windowing.WindowTest > testNoWindowFnDoesNotReassignWindows FAILED
java.lang.StackOverflowError at JDK14LoggerAdapter.java:595
org.apache.beam.sdk.transforms.windowing.WindowTest > testMergingCustomWindowsWithoutCustomWindowTypes FAILED
java.lang.StackOverflowError at JDK14LoggerAdapter.java:581
org.apache.beam.sdk.transforms.windowing.WindowTest > testMergingCustomWindowsKeyedCollection FAILED
java.lang.StackOverflowError at JDK14LoggerAdapter.java:581
org.apache.beam.sdk.values.PCollectionTupleTest > testComposePCollectionTuple FAILED
java.lang.StackOverflowError at JDK14LoggerAdapter.java:595
org.apache.beam.runners.core.metrics.MetricsPusherTest > pushesUserMetrics FAILED
java.lang.StackOverflowError at SLF4JBridgeHandler.java:220
227 tests completed, 219 failed, 1 skipped
> Task :runners:spark:3:validatesRunnerStreaming FAILED
FAILURE: Build completed with 3 failures.
1: Task failed with an exception.
-----------
* What went wrong:
Execution failed for task ':runners:spark:3:validatesRunnerBatch'.
> There were failing tests. See the report at: file://<https://ci-beam.apache.org/job/beam_PostCommit_Java_ValidatesRunner_Spark/ws/src/runners/spark/3/build/reports/tests/validatesRunnerBatch/index.html>
* Try:
> Run with --stacktrace option to get the stack trace.
> Run with --info or --debug option to get more log output.
==============================================================================
2: Task failed with an exception.
-----------
* What went wrong:
Execution failed for task ':runners:spark:3:validatesRunnerBatchWithBoundedSDFExperiment'.
> There were failing tests. See the report at: file://<https://ci-beam.apache.org/job/beam_PostCommit_Java_ValidatesRunner_Spark/ws/src/runners/spark/3/build/reports/tests/validatesRunnerBatchWithBoundedSDFExperiment/index.html>
* Try:
> Run with --stacktrace option to get the stack trace.
> Run with --info or --debug option to get more log output.
==============================================================================
3: Task failed with an exception.
-----------
* What went wrong:
Execution failed for task ':runners:spark:3:validatesRunnerStreaming'.
> There were failing tests. See the report at: file://<https://ci-beam.apache.org/job/beam_PostCommit_Java_ValidatesRunner_Spark/ws/src/runners/spark/3/build/reports/tests/validatesRunnerStreaming/index.html>
* Try:
> Run with --stacktrace option to get the stack trace.
> Run with --info or --debug option to get more log output.
==============================================================================
* Get more help at https://help.gradle.org
Deprecated Gradle features were used in this build, making it incompatible with Gradle 8.0.
You can use '--warning-mode all' to show the individual deprecation warnings and determine if they come from your own scripts or plugins.
See https://docs.gradle.org/7.5.1/userguide/command_line_interface.html#sec:command_line_warnings
BUILD FAILED in 14m 15s
143 actionable tasks: 87 executed, 54 from cache, 2 up-to-date
Publishing build scan...
https://ge.apache.org/s/cozdt5gdkioga
Build step 'Invoke Gradle script' changed build result to FAILURE
Build step 'Invoke Gradle script' marked build as failure
---------------------------------------------------------------------
To unsubscribe, e-mail: builds-unsubscribe@beam.apache.org
For additional commands, e-mail: builds-help@beam.apache.org
Build failed in Jenkins: beam_PostCommit_Java_ValidatesRunner_Spark #11844
Posted by Apache Jenkins Server <je...@builds.apache.org>.
See <https://ci-beam.apache.org/job/beam_PostCommit_Java_ValidatesRunner_Spark/11844/display/redirect>
Changes:
------------------------------------------
[...truncated 123.26 KB...]
java.lang.StackOverflowError at JDK14LoggerAdapter.java:581
org.apache.beam.sdk.transforms.WithTimestampsTest > withTimestampsLambdaShouldApplyTimestamps FAILED
java.lang.StackOverflowError at JDK14LoggerAdapter.java:581
org.apache.beam.sdk.transforms.ReshuffleTest > testReshuffleAfterSessionsAndGroupByKey FAILED
java.lang.StackOverflowError at Throwable.java:825
org.apache.beam.sdk.transforms.ParDoSchemaTest > testSimpleSchemaPipeline FAILED
java.lang.StackOverflowError at JDK14LoggerAdapter.java:581
org.apache.beam.sdk.values.PCollectionRowTupleTest > testComposePCollectionRowTuple FAILED
java.lang.StackOverflowError at JDK14LoggerAdapter.java:595
org.apache.beam.sdk.transforms.windowing.WindowingTest > testMergingWindowing FAILED
java.lang.StackOverflowError at JDK14LoggerAdapter.java:595
org.apache.beam.sdk.transforms.ReshuffleTest > testReshuffleAfterFixedWindows FAILED
java.lang.StackOverflowError at Throwable.java:825
org.apache.beam.sdk.transforms.ParDoSchemaTest > testSchemaConversionPipeline FAILED
java.lang.StackOverflowError at JDK14LoggerAdapter.java:581
org.apache.beam.sdk.transforms.windowing.WindowingTest > testWindowPreservation FAILED
java.lang.StackOverflowError at JDK14LoggerAdapter.java:581
org.apache.beam.sdk.transforms.ReshuffleTest > testReshuffleAfterFixedWindowsAndGroupByKey FAILED
java.lang.StackOverflowError at Throwable.java:825
org.apache.beam.sdk.transforms.ParDoSchemaTest > testReadAndWriteWithSchemaRegistry FAILED
java.lang.StackOverflowError at JDK14LoggerAdapter.java:581
org.apache.beam.sdk.transforms.windowing.WindowingTest > testNonPartitioningWindowing FAILED
java.lang.StackOverflowError at JDK14LoggerAdapter.java:595
org.apache.beam.sdk.transforms.ReshuffleTest > testReshuffleAfterSlidingWindows FAILED
java.lang.StackOverflowError at Throwable.java:825
org.apache.beam.sdk.transforms.ParDoSchemaTest > testReadAndWriteMultiOutput FAILED
java.lang.StackOverflowError at JDK14LoggerAdapter.java:595
org.apache.beam.sdk.transforms.windowing.WindowingTest > testPartitioningWindowing FAILED
java.lang.StackOverflowError at JDK14LoggerAdapter.java:595
org.apache.beam.sdk.transforms.ReshuffleTest > testReshufflePreservesTimestamps FAILED
java.lang.StackOverflowError at Throwable.java:825
org.apache.beam.sdk.transforms.ParDoSchemaTest > testNestedSchema FAILED
java.lang.StackOverflowError at JDK14LoggerAdapter.java:581
org.apache.beam.sdk.transforms.ReshuffleTest > testReshuffleAfterSlidingWindowsAndGroupByKey FAILED
java.lang.StackOverflowError at Throwable.java:825
org.apache.beam.sdk.transforms.ReshuffleTest > testJustReshuffle FAILED
java.lang.StackOverflowError at Throwable.java:825
org.apache.beam.sdk.transforms.ViewTest > testEmptySingletonSideInput FAILED
java.lang.AssertionError at MatcherAssert.java:18
org.apache.beam.sdk.transforms.ViewTest > testMapAsEntrySetSideInput FAILED
java.lang.StackOverflowError at JDK14LoggerAdapter.java:581
org.apache.beam.sdk.transforms.ViewTest > testNonSingletonSideInput FAILED
java.lang.AssertionError at MatcherAssert.java:18
org.apache.beam.sdk.transforms.ViewTest > testMultimapSideInput FAILED
java.lang.StackOverflowError at JDK14LoggerAdapter.java:581
org.apache.beam.sdk.transforms.ViewTest > testEmptyIterableSideInput FAILED
java.lang.StackOverflowError at JDK14LoggerAdapter.java:581
org.apache.beam.sdk.transforms.ViewTest > testMapSideInputWithNullValuesCatchesDuplicates FAILED
java.lang.AssertionError at MatcherAssert.java:18
org.apache.beam.sdk.transforms.ViewTest > testSideInputWithNestedIterables FAILED
java.lang.StackOverflowError at JDK14LoggerAdapter.java:581
org.apache.beam.sdk.transforms.ViewTest > testListSideInput FAILED
java.lang.StackOverflowError at JDK14LoggerAdapter.java:581
org.apache.beam.sdk.transforms.ViewTest > testMapSideInput FAILED
java.lang.StackOverflowError at JDK14LoggerAdapter.java:581
org.apache.beam.sdk.transforms.ViewTest > testWindowedSideInputFixedToFixedWithDefault FAILED
java.lang.StackOverflowError at JDK14LoggerAdapter.java:581
org.apache.beam.sdk.transforms.ViewTest > testWindowedIterableSideInput FAILED
java.lang.StackOverflowError at JDK14LoggerAdapter.java:581
org.apache.beam.sdk.transforms.ViewTest > testWindowedMapSideInputWithNonDeterministicKeyCoder FAILED
java.lang.StackOverflowError at JDK14LoggerAdapter.java:581
org.apache.beam.sdk.transforms.ViewTest > testWindowedSideInputFixedToGlobal FAILED
java.lang.StackOverflowError at JDK14LoggerAdapter.java:581
org.apache.beam.sdk.transforms.ViewTest > testMultimapSideInputWithNonDeterministicKeyCoder FAILED
java.lang.StackOverflowError at JDK14LoggerAdapter.java:581
org.apache.beam.sdk.transforms.ViewTest > testEmptyMultimapSideInput FAILED
java.lang.StackOverflowError at JDK14LoggerAdapter.java:581
org.apache.beam.sdk.transforms.ViewTest > testDiscardingNonSingletonSideInput FAILED
java.lang.AssertionError at MatcherAssert.java:18
org.apache.beam.sdk.transforms.ViewTest > testCombinedMapSideInput FAILED
java.lang.StackOverflowError at JDK14LoggerAdapter.java:581
org.apache.beam.sdk.transforms.ViewTest > testMultimapSideInputIsImmutable FAILED
java.lang.StackOverflowError at JDK14LoggerAdapter.java:581
org.apache.beam.sdk.transforms.ViewTest > testWindowedMultimapAsEntrySetSideInput FAILED
java.lang.StackOverflowError at JDK14LoggerAdapter.java:581
org.apache.beam.sdk.transforms.ViewTest > testWindowedMultimapSideInputWithNonDeterministicKeyCoder FAILED
java.lang.StackOverflowError at JDK14LoggerAdapter.java:581
org.apache.beam.sdk.transforms.ViewTest > testMapSideInputWithNonDeterministicKeyCoder FAILED
java.lang.StackOverflowError at JDK14LoggerAdapter.java:581
org.apache.beam.sdk.transforms.ViewTest > testWindowedSingletonSideInput FAILED
java.lang.StackOverflowError at JDK14LoggerAdapter.java:581
org.apache.beam.sdk.transforms.ViewTest > testWindowedMultimapSideInput FAILED
java.lang.StackOverflowError at JDK14LoggerAdapter.java:581
org.apache.beam.sdk.transforms.ViewTest > testSideInputWithNullDefault FAILED
java.lang.StackOverflowError at JDK14LoggerAdapter.java:581
org.apache.beam.sdk.transforms.ViewTest > testWindowedListSideInput FAILED
java.lang.StackOverflowError at JDK14LoggerAdapter.java:581
org.apache.beam.sdk.transforms.ViewTest > testWindowedMapSideInput FAILED
java.lang.StackOverflowError at JDK14LoggerAdapter.java:581
org.apache.beam.sdk.transforms.ViewTest > testIterableSideInputIsImmutable FAILED
java.lang.StackOverflowError at JDK14LoggerAdapter.java:581
org.apache.beam.sdk.transforms.ViewTest > testListSideInputIsImmutable FAILED
java.lang.StackOverflowError at JDK14LoggerAdapter.java:581
org.apache.beam.sdk.transforms.ViewTest > testEmptyListSideInput FAILED
java.lang.StackOverflowError at JDK14LoggerAdapter.java:581
org.apache.beam.sdk.transforms.ViewTest > testWindowedSideInputFixedToFixed FAILED
java.lang.StackOverflowError at JDK14LoggerAdapter.java:581
org.apache.beam.sdk.transforms.ViewTest > testIterableSideInput FAILED
java.lang.StackOverflowError at JDK14LoggerAdapter.java:581
org.apache.beam.sdk.transforms.ViewTest > testEmptyMultimapSideInputWithNonDeterministicKeyCoder FAILED
java.lang.StackOverflowError at JDK14LoggerAdapter.java:581
org.apache.beam.sdk.transforms.ViewTest > testEmptyMapSideInput FAILED
java.lang.StackOverflowError at JDK14LoggerAdapter.java:581
org.apache.beam.sdk.transforms.ViewTest > testMapSideInputIsImmutable FAILED
java.lang.StackOverflowError at JDK14LoggerAdapter.java:581
org.apache.beam.sdk.transforms.ViewTest > testWindowedMapAsEntrySetSideInput FAILED
java.lang.StackOverflowError at JDK14LoggerAdapter.java:581
org.apache.beam.sdk.transforms.ViewTest > testEmptyMapSideInputWithNonDeterministicKeyCoder FAILED
java.lang.StackOverflowError at JDK14LoggerAdapter.java:581
org.apache.beam.sdk.transforms.ViewTest > testMultimapAsEntrySetSideInput FAILED
java.lang.StackOverflowError at JDK14LoggerAdapter.java:581
org.apache.beam.sdk.transforms.ViewTest > testSingletonSideInput FAILED
java.lang.StackOverflowError at JDK14LoggerAdapter.java:581
org.apache.beam.sdk.transforms.windowing.WindowTest > testTimestampCombinerEndOfWindow FAILED
java.lang.StackOverflowError at JDK14LoggerAdapter.java:595
org.apache.beam.sdk.transforms.windowing.WindowTest > testTimestampCombinerDefault FAILED
java.lang.StackOverflowError at JDK14LoggerAdapter.java:595
org.apache.beam.sdk.transforms.windowing.WindowTest > testMergingCustomWindows FAILED
java.lang.StackOverflowError at JDK14LoggerAdapter.java:581
org.apache.beam.sdk.transforms.windowing.WindowTest > testNoWindowFnDoesNotReassignWindows FAILED
java.lang.StackOverflowError at JDK14LoggerAdapter.java:595
org.apache.beam.sdk.transforms.windowing.WindowTest > testMergingCustomWindowsWithoutCustomWindowTypes FAILED
java.lang.StackOverflowError at JDK14LoggerAdapter.java:581
org.apache.beam.sdk.transforms.windowing.WindowTest > testMergingCustomWindowsKeyedCollection FAILED
java.lang.StackOverflowError at JDK14LoggerAdapter.java:581
org.apache.beam.sdk.values.PCollectionTupleTest > testComposePCollectionTuple FAILED
java.lang.StackOverflowError at JDK14LoggerAdapter.java:595
org.apache.beam.runners.core.metrics.MetricsPusherTest > pushesUserMetrics FAILED
java.lang.StackOverflowError at SLF4JBridgeHandler.java:220
227 tests completed, 219 failed, 1 skipped
> Task :runners:spark:3:validatesRunnerStreaming FAILED
FAILURE: Build completed with 3 failures.
1: Task failed with an exception.
-----------
* What went wrong:
Execution failed for task ':runners:spark:3:validatesRunnerBatch'.
> There were failing tests. See the report at: file://<https://ci-beam.apache.org/job/beam_PostCommit_Java_ValidatesRunner_Spark/ws/src/runners/spark/3/build/reports/tests/validatesRunnerBatch/index.html>
* Try:
> Run with --stacktrace option to get the stack trace.
> Run with --info or --debug option to get more log output.
==============================================================================
2: Task failed with an exception.
-----------
* What went wrong:
Execution failed for task ':runners:spark:3:validatesRunnerBatchWithBoundedSDFExperiment'.
> There were failing tests. See the report at: file://<https://ci-beam.apache.org/job/beam_PostCommit_Java_ValidatesRunner_Spark/ws/src/runners/spark/3/build/reports/tests/validatesRunnerBatchWithBoundedSDFExperiment/index.html>
* Try:
> Run with --stacktrace option to get the stack trace.
> Run with --info or --debug option to get more log output.
==============================================================================
3: Task failed with an exception.
-----------
* What went wrong:
Execution failed for task ':runners:spark:3:validatesRunnerStreaming'.
> There were failing tests. See the report at: file://<https://ci-beam.apache.org/job/beam_PostCommit_Java_ValidatesRunner_Spark/ws/src/runners/spark/3/build/reports/tests/validatesRunnerStreaming/index.html>
* Try:
> Run with --stacktrace option to get the stack trace.
> Run with --info or --debug option to get more log output.
==============================================================================
* Get more help at https://help.gradle.org
Deprecated Gradle features were used in this build, making it incompatible with Gradle 8.0.
You can use '--warning-mode all' to show the individual deprecation warnings and determine if they come from your own scripts or plugins.
See https://docs.gradle.org/7.5.1/userguide/command_line_interface.html#sec:command_line_warnings
BUILD FAILED in 15m 24s
143 actionable tasks: 87 executed, 54 from cache, 2 up-to-date
Publishing build scan...
https://ge.apache.org/s/mznzqmevluaw4
Build step 'Invoke Gradle script' changed build result to FAILURE
Build step 'Invoke Gradle script' marked build as failure
---------------------------------------------------------------------
To unsubscribe, e-mail: builds-unsubscribe@beam.apache.org
For additional commands, e-mail: builds-help@beam.apache.org