You are viewing a plain text version of this content. The canonical link for it is here.
Posted to builds@solr.apache.org by Apache Jenkins Server <je...@builds.apache.org> on 2024/09/02 01:06:18 UTC

[JENKINS] Solr » Solr-BadApples-Tests-main - Build # 1435 - Unstable!

Build: https://ci-builds.apache.org/job/Solr/job/Solr-BadApples-Tests-main/1435/

1 tests failed.
FAILED:  org.apache.solr.search.TestMainQueryCaching.testScoringQuery

Error Message:
java.lang.NullPointerException

Stack Trace:
java.lang.NullPointerException
	at __randomizedtesting.SeedInfo.seed([50297C725D6856BE:837C903CA31F5410]:0)
	at org.apache.solr.search.TestMainQueryCaching.coreToInserts(TestMainQueryCaching.java:99)
	at org.apache.solr.search.TestMainQueryCaching.assertMetricCounts(TestMainQueryCaching.java:418)
	at org.apache.solr.search.TestMainQueryCaching.assertMetricCounts(TestMainQueryCaching.java:392)
	at org.apache.solr.search.TestMainQueryCaching.testScoringQuery(TestMainQueryCaching.java:144)
	at java.base/jdk.internal.reflect.NativeMethodAccessorImpl.invoke0(Native Method)
	at java.base/jdk.internal.reflect.NativeMethodAccessorImpl.invoke(NativeMethodAccessorImpl.java:62)
	at java.base/jdk.internal.reflect.DelegatingMethodAccessorImpl.invoke(DelegatingMethodAccessorImpl.java:43)
	at java.base/java.lang.reflect.Method.invoke(Method.java:566)
	at com.carrotsearch.randomizedtesting.RandomizedRunner.invoke(RandomizedRunner.java:1758)
	at com.carrotsearch.randomizedtesting.RandomizedRunner$8.evaluate(RandomizedRunner.java:946)
	at com.carrotsearch.randomizedtesting.RandomizedRunner$9.evaluate(RandomizedRunner.java:982)
	at com.carrotsearch.randomizedtesting.RandomizedRunner$10.evaluate(RandomizedRunner.java:996)
	at com.carrotsearch.randomizedtesting.rules.SystemPropertiesRestoreRule$1.evaluate(SystemPropertiesRestoreRule.java:80)
	at org.junit.rules.RunRules.evaluate(RunRules.java:20)
	at org.apache.lucene.tests.util.TestRuleSetupTeardownChained$1.evaluate(TestRuleSetupTeardownChained.java:48)
	at org.apache.lucene.tests.util.AbstractBeforeAfterRule$1.evaluate(AbstractBeforeAfterRule.java:43)
	at org.apache.lucene.tests.util.TestRuleThreadAndTestName$1.evaluate(TestRuleThreadAndTestName.java:45)
	at org.apache.lucene.tests.util.TestRuleIgnoreAfterMaxFailures$1.evaluate(TestRuleIgnoreAfterMaxFailures.java:60)
	at org.apache.lucene.tests.util.TestRuleMarkFailure$1.evaluate(TestRuleMarkFailure.java:44)
	at org.junit.rules.RunRules.evaluate(RunRules.java:20)
	at com.carrotsearch.randomizedtesting.rules.StatementAdapter.evaluate(StatementAdapter.java:36)
	at com.carrotsearch.randomizedtesting.ThreadLeakControl$StatementRunner.run(ThreadLeakControl.java:390)
	at com.carrotsearch.randomizedtesting.ThreadLeakControl.forkTimeoutingTask(ThreadLeakControl.java:843)
	at com.carrotsearch.randomizedtesting.ThreadLeakControl$3.evaluate(ThreadLeakControl.java:490)
	at com.carrotsearch.randomizedtesting.RandomizedRunner.runSingleTest(RandomizedRunner.java:955)
	at com.carrotsearch.randomizedtesting.RandomizedRunner$5.evaluate(RandomizedRunner.java:840)
	at com.carrotsearch.randomizedtesting.RandomizedRunner$6.evaluate(RandomizedRunner.java:891)
	at com.carrotsearch.randomizedtesting.RandomizedRunner$7.evaluate(RandomizedRunner.java:902)
	at com.carrotsearch.randomizedtesting.rules.StatementAdapter.evaluate(StatementAdapter.java:36)
	at com.carrotsearch.randomizedtesting.rules.StatementAdapter.evaluate(StatementAdapter.java:36)
	at org.apache.lucene.tests.util.AbstractBeforeAfterRule$1.evaluate(AbstractBeforeAfterRule.java:43)
	at com.carrotsearch.randomizedtesting.rules.SystemPropertiesRestoreRule$1.evaluate(SystemPropertiesRestoreRule.java:80)
	at org.junit.rules.RunRules.evaluate(RunRules.java:20)
	at org.apache.lucene.tests.util.AbstractBeforeAfterRule$1.evaluate(AbstractBeforeAfterRule.java:43)
	at com.carrotsearch.randomizedtesting.rules.StatementAdapter.evaluate(StatementAdapter.java:36)
	at org.apache.lucene.tests.util.TestRuleStoreClassName$1.evaluate(TestRuleStoreClassName.java:38)
	at com.carrotsearch.randomizedtesting.rules.NoShadowingOrOverridesOnMethodsRule$1.evaluate(NoShadowingOrOverridesOnMethodsRule.java:40)
	at com.carrotsearch.randomizedtesting.rules.NoShadowingOrOverridesOnMethodsRule$1.evaluate(NoShadowingOrOverridesOnMethodsRule.java:40)
	at com.carrotsearch.randomizedtesting.rules.StatementAdapter.evaluate(StatementAdapter.java:36)
	at com.carrotsearch.randomizedtesting.rules.StatementAdapter.evaluate(StatementAdapter.java:36)
	at org.apache.lucene.tests.util.TestRuleAssertionsRequired$1.evaluate(TestRuleAssertionsRequired.java:53)
	at org.apache.lucene.tests.util.AbstractBeforeAfterRule$1.evaluate(AbstractBeforeAfterRule.java:43)
	at org.apache.lucene.tests.util.TestRuleMarkFailure$1.evaluate(TestRuleMarkFailure.java:44)
	at org.apache.lucene.tests.util.TestRuleIgnoreAfterMaxFailures$1.evaluate(TestRuleIgnoreAfterMaxFailures.java:60)
	at org.apache.lucene.tests.util.TestRuleIgnoreTestSuites$1.evaluate(TestRuleIgnoreTestSuites.java:47)
	at org.junit.rules.RunRules.evaluate(RunRules.java:20)
	at com.carrotsearch.randomizedtesting.rules.StatementAdapter.evaluate(StatementAdapter.java:36)
	at com.carrotsearch.randomizedtesting.ThreadLeakControl$StatementRunner.run(ThreadLeakControl.java:390)
	at com.carrotsearch.randomizedtesting.ThreadLeakControl.lambda$forkTimeoutingTask$0(ThreadLeakControl.java:850)
	at java.base/java.lang.Thread.run(Thread.java:829)




Build Log:
[...truncated 1040 lines...]
ERROR: The following test(s) have failed:
  - org.apache.solr.search.TestMainQueryCaching.testScoringQuery (:solr:core)
    Test history: https://ge.apache.org/scans/tests?search.rootProjectNames=solr-root&tests.container=org.apache.solr.search.TestMainQueryCaching&tests.test=testScoringQuery http://fucit.org/solr-jenkins-reports/history-trend-of-recent-failures.html#series/org.apache.solr.search.TestMainQueryCaching.testScoringQuery
    Test output: /home/jenkins/jenkins-slave/workspace/Solr/Solr-BadApples-Tests-main/solr/core/build/test-results/test/outputs/OUTPUT-org.apache.solr.search.TestMainQueryCaching.txt
    Reproduce with: ./gradlew :solr:core:test --tests "org.apache.solr.search.TestMainQueryCaching.testScoringQuery" -Ptests.jvms=4 -Ptests.haltonfailure=false "-Ptests.jvmargs=-XX:TieredStopAtLevel=1 -XX:+UseParallelGC -XX:ActiveProcessorCount=1 -XX:ReservedCodeCacheSize=120m" -Ptests.seed=50297C725D6856BE -Ptests.multiplier=2 -Ptests.badapples=true -Ptests.file.encoding=ISO-8859-1


Deprecated Gradle features were used in this build, making it incompatible with Gradle 9.0.

You can use '--warning-mode all' to show the individual deprecation warnings and determine if they come from your own scripts or plugins.

For more on this, please refer to https://docs.gradle.org/8.4/userguide/command_line_interface.html#sec:command_line_warnings in the Gradle documentation.

BUILD SUCCESSFUL in 46m 38s
141 actionable tasks: 141 executed

Publishing build scan...
https://ge.apache.org/s/65pc22b2ultdo

Build step 'Invoke Gradle script' changed build result to SUCCESS
Archiving artifacts
‘**/*.events’ doesn’t match anything: ‘**’ exists but not ‘**/*.events’
No artifacts found that match the file pattern "**/*.events,heapdumps/**,**/hs_err_pid*". Configuration error?
Recording test results
[Checks API] No suitable checks publisher found.
Build step 'Publish JUnit test result report' changed build result to UNSTABLE
Email was triggered for: Unstable (Test Failures)
Sending email for trigger: Unstable (Test Failures)

[JENKINS] Solr » Solr-BadApples-Tests-main - Build # 1437 - Still Unstable!

Posted by Apache Jenkins Server <je...@builds.apache.org>.
Build: https://ci-builds.apache.org/job/Solr/job/Solr-BadApples-Tests-main/1437/

1 tests failed.
FAILED:  org.apache.solr.cloud.OverseerTest.testShardLeaderChange

Error Message:
com.carrotsearch.randomizedtesting.UncaughtExceptionError: Captured an uncaught exception in thread: Thread[id=8232, name=OverseerCollectionConfigSetProcessor-72435429004279810-127.0.0.1:38169_solr-n_0000000000, state=RUNNABLE, group=Overseer collection creation process.]

Stack Trace:
com.carrotsearch.randomizedtesting.UncaughtExceptionError: Captured an uncaught exception in thread: Thread[id=8232, name=OverseerCollectionConfigSetProcessor-72435429004279810-127.0.0.1:38169_solr-n_0000000000, state=RUNNABLE, group=Overseer collection creation process.]
	at __randomizedtesting.SeedInfo.seed([C68A0E90342CD65D:18D989672EB423AC]:0)
Caused by: org.apache.solr.common.AlreadyClosedException
	at __randomizedtesting.SeedInfo.seed([C68A0E90342CD65D]:0)
	at app//org.apache.solr.common.cloud.ZkCmdExecutor.retryOperation(ZkCmdExecutor.java:68)
	at app//org.apache.solr.common.cloud.SolrZkClient.getData(SolrZkClient.java:448)
	at app//org.apache.solr.cloud.OverseerTaskProcessor.amILeader(OverseerTaskProcessor.java:486)
	at app//org.apache.solr.cloud.OverseerTaskProcessor.run(OverseerTaskProcessor.java:171)
	at java.base@11.0.16.1/java.lang.Thread.run(Thread.java:829)




Build Log:
[...truncated 19525 lines...]
ERROR: The following test(s) have failed:
  - org.apache.solr.cloud.OverseerTest.testShardLeaderChange (:solr:core)
    Test history: https://ge.apache.org/scans/tests?search.rootProjectNames=solr-root&tests.container=org.apache.solr.cloud.OverseerTest&tests.test=testShardLeaderChange http://fucit.org/solr-jenkins-reports/history-trend-of-recent-failures.html#series/org.apache.solr.cloud.OverseerTest.testShardLeaderChange
    Test output: /home/jenkins/jenkins-slave/workspace/Solr/Solr-BadApples-Tests-main/solr/core/build/test-results/test/outputs/OUTPUT-org.apache.solr.cloud.OverseerTest.txt
    Reproduce with: ./gradlew :solr:core:test --tests "org.apache.solr.cloud.OverseerTest.testShardLeaderChange" -Ptests.jvms=4 -Ptests.haltonfailure=false "-Ptests.jvmargs=-XX:TieredStopAtLevel=1 -XX:+UseParallelGC -XX:ActiveProcessorCount=1 -XX:ReservedCodeCacheSize=120m" -Ptests.seed=C68A0E90342CD65D -Ptests.multiplier=2 -Ptests.badapples=true -Ptests.file.encoding=ISO-8859-1


Deprecated Gradle features were used in this build, making it incompatible with Gradle 9.0.

You can use '--warning-mode all' to show the individual deprecation warnings and determine if they come from your own scripts or plugins.

For more on this, please refer to https://docs.gradle.org/8.4/userguide/command_line_interface.html#sec:command_line_warnings in the Gradle documentation.

BUILD SUCCESSFUL in 46m 34s
141 actionable tasks: 141 executed

Publishing build scan...
https://ge.apache.org/s/z6kdr5wbak7qc

Build step 'Invoke Gradle script' changed build result to SUCCESS
Archiving artifacts
‘**/*.events’ doesn’t match anything: ‘**’ exists but not ‘**/*.events’
No artifacts found that match the file pattern "**/*.events,heapdumps/**,**/hs_err_pid*". Configuration error?
Recording test results
[Checks API] No suitable checks publisher found.
Build step 'Publish JUnit test result report' changed build result to UNSTABLE
Email was triggered for: Unstable (Test Failures)
Sending email for trigger: Unstable (Test Failures)

[JENKINS] Solr » Solr-BadApples-Tests-main - Build # 1436 - Still Unstable!

Posted by Apache Jenkins Server <je...@builds.apache.org>.
Build: https://ci-builds.apache.org/job/Solr/job/Solr-BadApples-Tests-main/1436/

1 tests failed.
FAILED:  org.apache.solr.client.solrj.TestLBHttp2SolrClient.testSimple

Error Message:
java.lang.AssertionError: expected:<3> but was:<2>

Stack Trace:
java.lang.AssertionError: expected:<3> but was:<2>
	at __randomizedtesting.SeedInfo.seed([D8F2AEF5C3BD3119:E0418A0BE44EE5C8]:0)
	at org.junit.Assert.fail(Assert.java:89)
	at org.junit.Assert.failNotEquals(Assert.java:835)
	at org.junit.Assert.assertEquals(Assert.java:647)
	at org.junit.Assert.assertEquals(Assert.java:633)
	at org.apache.solr.client.solrj.TestLBHttp2SolrClient.testSimple(TestLBHttp2SolrClient.java:165)
	at java.base/jdk.internal.reflect.NativeMethodAccessorImpl.invoke0(Native Method)
	at java.base/jdk.internal.reflect.NativeMethodAccessorImpl.invoke(NativeMethodAccessorImpl.java:62)
	at java.base/jdk.internal.reflect.DelegatingMethodAccessorImpl.invoke(DelegatingMethodAccessorImpl.java:43)
	at java.base/java.lang.reflect.Method.invoke(Method.java:566)
	at com.carrotsearch.randomizedtesting.RandomizedRunner.invoke(RandomizedRunner.java:1758)
	at com.carrotsearch.randomizedtesting.RandomizedRunner$8.evaluate(RandomizedRunner.java:946)
	at com.carrotsearch.randomizedtesting.RandomizedRunner$9.evaluate(RandomizedRunner.java:982)
	at com.carrotsearch.randomizedtesting.RandomizedRunner$10.evaluate(RandomizedRunner.java:996)
	at com.carrotsearch.randomizedtesting.rules.SystemPropertiesRestoreRule$1.evaluate(SystemPropertiesRestoreRule.java:80)
	at org.junit.rules.RunRules.evaluate(RunRules.java:20)
	at org.apache.lucene.tests.util.TestRuleSetupTeardownChained$1.evaluate(TestRuleSetupTeardownChained.java:48)
	at org.apache.lucene.tests.util.AbstractBeforeAfterRule$1.evaluate(AbstractBeforeAfterRule.java:43)
	at org.apache.lucene.tests.util.TestRuleThreadAndTestName$1.evaluate(TestRuleThreadAndTestName.java:45)
	at org.apache.lucene.tests.util.TestRuleIgnoreAfterMaxFailures$1.evaluate(TestRuleIgnoreAfterMaxFailures.java:60)
	at org.apache.lucene.tests.util.TestRuleMarkFailure$1.evaluate(TestRuleMarkFailure.java:44)
	at org.junit.rules.RunRules.evaluate(RunRules.java:20)
	at com.carrotsearch.randomizedtesting.rules.StatementAdapter.evaluate(StatementAdapter.java:36)
	at com.carrotsearch.randomizedtesting.ThreadLeakControl$StatementRunner.run(ThreadLeakControl.java:390)
	at com.carrotsearch.randomizedtesting.ThreadLeakControl.forkTimeoutingTask(ThreadLeakControl.java:843)
	at com.carrotsearch.randomizedtesting.ThreadLeakControl$3.evaluate(ThreadLeakControl.java:490)
	at com.carrotsearch.randomizedtesting.RandomizedRunner.runSingleTest(RandomizedRunner.java:955)
	at com.carrotsearch.randomizedtesting.RandomizedRunner$5.evaluate(RandomizedRunner.java:840)
	at com.carrotsearch.randomizedtesting.RandomizedRunner$6.evaluate(RandomizedRunner.java:891)
	at com.carrotsearch.randomizedtesting.RandomizedRunner$7.evaluate(RandomizedRunner.java:902)
	at com.carrotsearch.randomizedtesting.rules.StatementAdapter.evaluate(StatementAdapter.java:36)
	at com.carrotsearch.randomizedtesting.rules.StatementAdapter.evaluate(StatementAdapter.java:36)
	at org.apache.lucene.tests.util.AbstractBeforeAfterRule$1.evaluate(AbstractBeforeAfterRule.java:43)
	at com.carrotsearch.randomizedtesting.rules.SystemPropertiesRestoreRule$1.evaluate(SystemPropertiesRestoreRule.java:80)
	at org.junit.rules.RunRules.evaluate(RunRules.java:20)
	at org.apache.lucene.tests.util.AbstractBeforeAfterRule$1.evaluate(AbstractBeforeAfterRule.java:43)
	at com.carrotsearch.randomizedtesting.rules.StatementAdapter.evaluate(StatementAdapter.java:36)
	at org.apache.lucene.tests.util.TestRuleStoreClassName$1.evaluate(TestRuleStoreClassName.java:38)
	at com.carrotsearch.randomizedtesting.rules.NoShadowingOrOverridesOnMethodsRule$1.evaluate(NoShadowingOrOverridesOnMethodsRule.java:40)
	at com.carrotsearch.randomizedtesting.rules.NoShadowingOrOverridesOnMethodsRule$1.evaluate(NoShadowingOrOverridesOnMethodsRule.java:40)
	at com.carrotsearch.randomizedtesting.rules.StatementAdapter.evaluate(StatementAdapter.java:36)
	at com.carrotsearch.randomizedtesting.rules.StatementAdapter.evaluate(StatementAdapter.java:36)
	at org.apache.lucene.tests.util.TestRuleAssertionsRequired$1.evaluate(TestRuleAssertionsRequired.java:53)
	at org.apache.lucene.tests.util.AbstractBeforeAfterRule$1.evaluate(AbstractBeforeAfterRule.java:43)
	at org.apache.lucene.tests.util.TestRuleMarkFailure$1.evaluate(TestRuleMarkFailure.java:44)
	at org.apache.lucene.tests.util.TestRuleIgnoreAfterMaxFailures$1.evaluate(TestRuleIgnoreAfterMaxFailures.java:60)
	at org.apache.lucene.tests.util.TestRuleIgnoreTestSuites$1.evaluate(TestRuleIgnoreTestSuites.java:47)
	at org.junit.rules.RunRules.evaluate(RunRules.java:20)
	at com.carrotsearch.randomizedtesting.rules.StatementAdapter.evaluate(StatementAdapter.java:36)
	at com.carrotsearch.randomizedtesting.ThreadLeakControl$StatementRunner.run(ThreadLeakControl.java:390)
	at com.carrotsearch.randomizedtesting.ThreadLeakControl.lambda$forkTimeoutingTask$0(ThreadLeakControl.java:850)
	at java.base/java.lang.Thread.run(Thread.java:829)




Build Log:
[...truncated 1134 lines...]
ERROR: The following test(s) have failed:
  - org.apache.solr.client.solrj.TestLBHttp2SolrClient.testSimple (:solr:solrj)
    Test history: https://ge.apache.org/scans/tests?search.rootProjectNames=solr-root&tests.container=org.apache.solr.client.solrj.TestLBHttp2SolrClient&tests.test=testSimple http://fucit.org/solr-jenkins-reports/history-trend-of-recent-failures.html#series/org.apache.solr.client.solrj.TestLBHttp2SolrClient.testSimple
    Test output: /home/jenkins/jenkins-slave/workspace/Solr/Solr-BadApples-Tests-main/solr/solrj/build/test-results/test/outputs/OUTPUT-org.apache.solr.client.solrj.TestLBHttp2SolrClient.txt
    Reproduce with: ./gradlew :solr:solrj:test --tests "org.apache.solr.client.solrj.TestLBHttp2SolrClient.testSimple" -Ptests.jvms=4 -Ptests.haltonfailure=false "-Ptests.jvmargs=-XX:TieredStopAtLevel=1 -XX:+UseParallelGC -XX:ActiveProcessorCount=1 -XX:ReservedCodeCacheSize=120m" -Ptests.seed=D8F2AEF5C3BD3119 -Ptests.multiplier=2 -Ptests.badapples=true -Ptests.file.encoding=UTF-8


Deprecated Gradle features were used in this build, making it incompatible with Gradle 9.0.

You can use '--warning-mode all' to show the individual deprecation warnings and determine if they come from your own scripts or plugins.

For more on this, please refer to https://docs.gradle.org/8.4/userguide/command_line_interface.html#sec:command_line_warnings in the Gradle documentation.

BUILD SUCCESSFUL in 44m 42s
141 actionable tasks: 141 executed

Publishing build scan...
https://ge.apache.org/s/pchxsuetuo34w

Build step 'Invoke Gradle script' changed build result to SUCCESS
Archiving artifacts
‘**/*.events’ doesn’t match anything: ‘**’ exists but not ‘**/*.events’
No artifacts found that match the file pattern "**/*.events,heapdumps/**,**/hs_err_pid*". Configuration error?
Recording test results
[Checks API] No suitable checks publisher found.
Build step 'Publish JUnit test result report' changed build result to UNSTABLE
Email was triggered for: Unstable (Test Failures)
Sending email for trigger: Unstable (Test Failures)