You are viewing a plain text version of this content. The canonical link for it is here.
Posted to builds@cassandra.apache.org by Apache Jenkins Server <je...@builds.apache.org> on 2023/07/21 02:51:40 UTC

Build complete: Cassandra-3.0 #360 [UNSTABLE] 493d15fffa21e57fcaef7cfb2099cbaa3ab6bb47

-------------------------------------------------------------------------------
Build Cassandra-3.0 #360 Still Unstable
URL: https://ci-cassandra.apache.org/job/Cassandra-3.0/360/
-------------------------------------------------------------------------------
Changes:
No changes

-------------------------------------------------------------------------------
Failed Tests:
15 tests failed.
FAILED:  dtest-upgrade.upgrade_tests.upgrade_through_versions_test.TestUpgrade_current_2_1_x_To_indev_3_0_x.test_parallel_upgrade
FAILED:  dtest-upgrade.upgrade_tests.upgrade_through_versions_test.TestUpgrade_current_2_1_x_To_indev_3_0_x.test_parallel_upgrade
FAILED:  dtest-upgrade.upgrade_tests.upgrade_through_versions_test.TestUpgrade_current_2_1_x_To_indev_3_0_x.test_parallel_upgrade
FAILED:  dtest-upgrade.upgrade_tests.cql_tests.TestCQLNodes3RF3_Upgrade_indev_2_1_x_To_indev_3_0_x.test_range_with_deletes
FAILED:  dtest-upgrade.upgrade_tests.cql_tests.TestCQLNodes3RF3_Upgrade_indev_2_1_x_To_indev_3_0_x.test_static_with_limit
FAILED:  dtest-upgrade.upgrade_tests.cql_tests.TestCQLNodes2RF1_Upgrade_indev_2_1_x_To_indev_3_0_x.test_delete_row
FAILED:  dtest-upgrade.upgrade_tests.cql_tests.TestCQLNodes2RF1_Upgrade_indev_2_1_x_To_indev_3_0_x.test_function_with_null
FAILED:  dtest-upgrade.upgrade_tests.upgrade_through_versions_test.TestUpgrade_indev_2_1_x_To_indev_3_0_x.test_bootstrap_multidc
FAILED:  dtest.counter_test.TestCounters.test_counter_leader_with_partial_view
FAILED:  dtest.repair_tests.repair_test.TestRepair.test_failure_during_validation
FAILED:  org.apache.cassandra.db.KeyspaceTest.testLimitSSTables-compression
FAILED:  dtest.repair_tests.repair_test.TestRepair.test_dead_sync_initiator
FAILED:  dtest-novnode.repair_tests.repair_test.TestRepair.test_dead_sync_initiator
FAILED:  dtest-upgrade.upgrade_internal_auth_test.TestAuthUpgrade.test_upgrade_legacy_table
FAILED:  dtest-upgrade.upgrade_internal_auth_test.TestAuthUpgrade.test_upgrade_to_30

-------------------------------------------------------------------------------
For complete test report and logs see https://nightlies.apache.org/cassandra/Cassandra-3.0/360/