You are viewing a plain text version of this content. The canonical link for it is here.
Posted to yarn-dev@hadoop.apache.org by Apache Jenkins Server <je...@builds.apache.org> on 2014/11/04 08:07:33 UTC

Failed: YARN-2802 PreCommit Build #5719

Jira: https://issues.apache.org/jira/browse/YARN-2802
Build: https://builds.apache.org/job/PreCommit-YARN-Build/5719/

###################################################################################
########################## LAST 60 LINES OF THE CONSOLE ###########################
[...truncated 3408 lines...]
{color:green}+1 overall{color}.  Here are the results of testing the latest attachment 
  http://issues.apache.org/jira/secure/attachment/12679156/YARN-2802.001.patch
  against trunk revision 2bb327e.

    {color:green}+1 @author{color}.  The patch does not contain any @author tags.

    {color:green}+1 tests included{color}.  The patch appears to include 1 new or modified test files.

    {color:green}+1 javac{color}.  The applied patch does not increase the total number of javac compiler warnings.

    {color:green}+1 javadoc{color}.  There were no new javadoc warning messages.

    {color:green}+1 eclipse:eclipse{color}.  The patch built with eclipse:eclipse.

    {color:green}+1 findbugs{color}.  The patch does not introduce any new Findbugs (version 2.0.3) warnings.

    {color:green}+1 release audit{color}.  The applied patch does not increase the total number of release audit warnings.

    {color:green}+1 core tests{color}.  The patch passed unit tests in hadoop-tools/hadoop-sls hadoop-yarn-project/hadoop-yarn/hadoop-yarn-server/hadoop-yarn-server-resourcemanager.

    {color:green}+1 contrib tests{color}.  The patch passed contrib unit tests.

Test results: https://builds.apache.org/job/PreCommit-YARN-Build/5719//testReport/
Console output: https://builds.apache.org/job/PreCommit-YARN-Build/5719//console

This message is automatically generated.


======================================================================
======================================================================
    Adding comment to Jira.
======================================================================
======================================================================


Comment added.
a28d88ea6a5860fc64d7f2dc2719229f58a69aec logged out


======================================================================
======================================================================
    Finished build.
======================================================================
======================================================================


Archiving artifacts
Sending artifact delta relative to PreCommit-YARN-Build #4749
Archived 20 artifacts
Archive block size is 32768
Received 0 blocks and 9122274 bytes
Compression is 0.0%
Took 2.1 sec
Description set: YARN-2802
Recording test results
No test report files were found. Configuration error?
Build step 'Publish JUnit test result report' changed build result to FAILURE
Email was triggered for: Failure
Sending email for trigger: Failure



###################################################################################
############################## FAILED TESTS (if any) ##############################
No tests ran.

Failed: YARN-2786 PreCommit Build #5724

Posted by Apache Jenkins Server <je...@builds.apache.org>.
Jira: https://issues.apache.org/jira/browse/YARN-2786
Build: https://builds.apache.org/job/PreCommit-YARN-Build/5724/

###################################################################################
########################## LAST 60 LINES OF THE CONSOLE ###########################
[...truncated 8426 lines...]
  against trunk revision 1eed102.

    {color:green}+1 @author{color}.  The patch does not contain any @author tags.

    {color:green}+1 tests included{color}.  The patch appears to include 1 new or modified test files.

    {color:green}+1 javac{color}.  The applied patch does not increase the total number of javac compiler warnings.

    {color:red}-1 javadoc{color}.  The javadoc tool appears to have generated 13 warning messages.
        See https://builds.apache.org/job/PreCommit-YARN-Build/5724//artifact/patchprocess/diffJavadocWarnings.txt for details.

    {color:green}+1 eclipse:eclipse{color}.  The patch built with eclipse:eclipse.

    {color:green}+1 findbugs{color}.  The patch does not introduce any new Findbugs (version 2.0.3) warnings.

    {color:green}+1 release audit{color}.  The applied patch does not increase the total number of release audit warnings.

    {color:red}-1 core tests{color}.  The following test timeouts occurred in hadoop-hdfs-project/hadoop-hdfs:

org.apache.hadoop.hdfs.TestEncryptionZones

    {color:green}+1 contrib tests{color}.  The patch passed contrib unit tests.

Test results: https://builds.apache.org/job/PreCommit-YARN-Build/5724//testReport/
Console output: https://builds.apache.org/job/PreCommit-YARN-Build/5724//console

This message is automatically generated.


======================================================================
======================================================================
    Adding comment to Jira.
======================================================================
======================================================================


Comment added.
7990fa96e29d58839d76ab7d5b0f31db22575be5 logged out


======================================================================
======================================================================
    Finished build.
======================================================================
======================================================================


Build step 'Execute shell' marked build as failure
Archiving artifacts
Sending artifact delta relative to PreCommit-YARN-Build #4749
Archived 15 artifacts
Archive block size is 32768
Received 0 blocks and 10301187 bytes
Compression is 0.0%
Took 2.9 sec
[description-setter] Could not determine description.
Recording test results
Email was triggered for: Failure
Sending email for trigger: Failure



###################################################################################
############################## FAILED TESTS (if any) ##############################
No tests ran.

Failed: YARN-2010 PreCommit Build #5723

Posted by Apache Jenkins Server <je...@builds.apache.org>.
Jira: https://issues.apache.org/jira/browse/YARN-2010
Build: https://builds.apache.org/job/PreCommit-YARN-Build/5723/

###################################################################################
########################## LAST 60 LINES OF THE CONSOLE ###########################
[...truncated 3367 lines...]
  http://issues.apache.org/jira/secure/attachment/12679286/YARN-2010.12.patch
  against trunk revision 1eed102.

    {color:green}+1 @author{color}.  The patch does not contain any @author tags.

    {color:green}+1 tests included{color}.  The patch appears to include 2 new or modified test files.

    {color:green}+1 javac{color}.  The applied patch does not increase the total number of javac compiler warnings.

    {color:green}+1 javadoc{color}.  There were no new javadoc warning messages.

    {color:green}+1 eclipse:eclipse{color}.  The patch built with eclipse:eclipse.

    {color:green}+1 findbugs{color}.  The patch does not introduce any new Findbugs (version 2.0.3) warnings.

    {color:green}+1 release audit{color}.  The applied patch does not increase the total number of release audit warnings.

    {color:red}-1 core tests{color}.  The patch failed these unit tests in hadoop-yarn-project/hadoop-yarn/hadoop-yarn-server/hadoop-yarn-server-resourcemanager:

                  org.apache.hadoop.yarn.server.resourcemanager.rmapp.TestRMAppTransitions

    {color:green}+1 contrib tests{color}.  The patch passed contrib unit tests.

Test results: https://builds.apache.org/job/PreCommit-YARN-Build/5723//testReport/
Console output: https://builds.apache.org/job/PreCommit-YARN-Build/5723//console

This message is automatically generated.


======================================================================
======================================================================
    Adding comment to Jira.
======================================================================
======================================================================


Comment added.
17da6116bb393b891f7d47433af811c1472ab6a8 logged out


======================================================================
======================================================================
    Finished build.
======================================================================
======================================================================


Build step 'Execute shell' marked build as failure
Archiving artifacts
Sending artifact delta relative to PreCommit-YARN-Build #4749
Archived 15 artifacts
Archive block size is 32768
Received 0 blocks and 7157525 bytes
Compression is 0.0%
Took 4.8 sec
[description-setter] Could not determine description.
Recording test results
Email was triggered for: Failure
Sending email for trigger: Failure



###################################################################################
############################## FAILED TESTS (if any) ##############################
No tests ran.

Failed: YARN-2786 PreCommit Build #5722

Posted by Apache Jenkins Server <je...@builds.apache.org>.
Jira: https://issues.apache.org/jira/browse/YARN-2786
Build: https://builds.apache.org/job/PreCommit-YARN-Build/5722/

###################################################################################
########################## LAST 60 LINES OF THE CONSOLE ###########################
[...truncated 22 lines...]

======================================================================
======================================================================
    Testing patch for YARN-2786.
======================================================================
======================================================================


HEAD is now at 1eed102 HADOOP-10847. Remove the usage of sun.security.x509.* in testing code. Contributed by Pascal Oliva.
Previous HEAD position was 1eed102... HADOOP-10847. Remove the usage of sun.security.x509.* in testing code. Contributed by Pascal Oliva.
Switched to branch 'trunk'
Your branch is behind 'origin/trunk' by 2 commits, and can be fast-forwarded.
  (use "git pull" to update your local branch)
First, rewinding head to replay your work on top of it...
Fast-forwarded trunk to 1eed1020234b8b5e5444bbc88299bc6689e6b015.
YARN-2786 patch is being downloaded at Tue Nov  4 19:00:24 UTC 2014 from
http://issues.apache.org/jira/secure/attachment/12679277/YARN-2786-20141104-1-full.patch
cp: cannot stat '/home/jenkins/buildSupport/lib/*': No such file or directory
The patch does not appear to apply with p0 to p2
PATCH APPLICATION FAILED




{color:red}-1 overall{color}.  Here are the results of testing the latest attachment 
  http://issues.apache.org/jira/secure/attachment/12679277/YARN-2786-20141104-1-full.patch
  against trunk revision 1eed102.

    {color:red}-1 patch{color}.  The patch command could not apply the patch.

Console output: https://builds.apache.org/job/PreCommit-YARN-Build/5722//console

This message is automatically generated.


======================================================================
======================================================================
    Adding comment to Jira.
======================================================================
======================================================================


Comment added.
bb8060aad10c4565aeb93f036536cfe699a5b178 logged out


======================================================================
======================================================================
    Finished build.
======================================================================
======================================================================


Build step 'Execute shell' marked build as failure
Archiving artifacts
[description-setter] Could not determine description.
Recording test results
Email was triggered for: Failure
Sending email for trigger: Failure



###################################################################################
############################## FAILED TESTS (if any) ##############################
No tests ran.

Failed: YARN-2752 PreCommit Build #5721

Posted by Apache Jenkins Server <je...@builds.apache.org>.
Jira: https://issues.apache.org/jira/browse/YARN-2752
Build: https://builds.apache.org/job/PreCommit-YARN-Build/5721/

###################################################################################
########################## LAST 60 LINES OF THE CONSOLE ###########################
[...truncated 22 lines...]

======================================================================
======================================================================
    Testing patch for YARN-2752.
======================================================================
======================================================================


HEAD is now at 3dfd6e6 HDFS-7340. Make rollingUpgrade start/finalize idempotent. Contributed by Jing Zhao.
Previous HEAD position was 3dfd6e6... HDFS-7340. Make rollingUpgrade start/finalize idempotent. Contributed by Jing Zhao.
Switched to branch 'trunk'
Your branch is behind 'origin/trunk' by 3 commits, and can be fast-forwarded.
  (use "git pull" to update your local branch)
First, rewinding head to replay your work on top of it...
Fast-forwarded trunk to 3dfd6e68fe5028fe3766ae5056dc175c38cc97e1.
YARN-2752 patch is being downloaded at Tue Nov  4 18:20:33 UTC 2014 from
http://issues.apache.org/jira/secure/attachment/12679260/YARN-2752.2-branch-2.patch
cp: cannot stat '/home/jenkins/buildSupport/lib/*': No such file or directory
The patch does not appear to apply with p0 to p2
PATCH APPLICATION FAILED




{color:red}-1 overall{color}.  Here are the results of testing the latest attachment 
  http://issues.apache.org/jira/secure/attachment/12679260/YARN-2752.2-branch-2.patch
  against trunk revision 3dfd6e6.

    {color:red}-1 patch{color}.  The patch command could not apply the patch.

Console output: https://builds.apache.org/job/PreCommit-YARN-Build/5721//console

This message is automatically generated.


======================================================================
======================================================================
    Adding comment to Jira.
======================================================================
======================================================================


Comment added.
81c228111bc33ebe7e26672ca2195b7986a5c243 logged out


======================================================================
======================================================================
    Finished build.
======================================================================
======================================================================


Build step 'Execute shell' marked build as failure
Archiving artifacts
[description-setter] Could not determine description.
Recording test results
Email was triggered for: Failure
Sending email for trigger: Failure



###################################################################################
############################## FAILED TESTS (if any) ##############################
No tests ran.

Failed: YARN-2056 PreCommit Build #5720

Posted by Apache Jenkins Server <je...@builds.apache.org>.
Jira: https://issues.apache.org/jira/browse/YARN-2056
Build: https://builds.apache.org/job/PreCommit-YARN-Build/5720/

###################################################################################
########################## LAST 60 LINES OF THE CONSOLE ###########################
[...truncated 3302 lines...]
{color:green}+1 overall{color}.  Here are the results of testing the latest attachment 
  http://issues.apache.org/jira/secure/attachment/12679246/YARN-2056.201411041635.txt
  against trunk revision 2bb327e.

    {color:green}+1 @author{color}.  The patch does not contain any @author tags.

    {color:green}+1 tests included{color}.  The patch appears to include 1 new or modified test files.

    {color:green}+1 javac{color}.  The applied patch does not increase the total number of javac compiler warnings.

    {color:green}+1 javadoc{color}.  There were no new javadoc warning messages.

    {color:green}+1 eclipse:eclipse{color}.  The patch built with eclipse:eclipse.

    {color:green}+1 findbugs{color}.  The patch does not introduce any new Findbugs (version 2.0.3) warnings.

    {color:green}+1 release audit{color}.  The applied patch does not increase the total number of release audit warnings.

    {color:green}+1 core tests{color}.  The patch passed unit tests in hadoop-yarn-project/hadoop-yarn/hadoop-yarn-server/hadoop-yarn-server-resourcemanager.

    {color:green}+1 contrib tests{color}.  The patch passed contrib unit tests.

Test results: https://builds.apache.org/job/PreCommit-YARN-Build/5720//testReport/
Console output: https://builds.apache.org/job/PreCommit-YARN-Build/5720//console

This message is automatically generated.


======================================================================
======================================================================
    Adding comment to Jira.
======================================================================
======================================================================


Comment added.
cb5627cce44453fe42382423061b2defcb3767ab logged out


======================================================================
======================================================================
    Finished build.
======================================================================
======================================================================


Archiving artifacts
Sending artifact delta relative to PreCommit-YARN-Build #4749
Archived 15 artifacts
Archive block size is 32768
Received 0 blocks and 9039449 bytes
Compression is 0.0%
Took 2.8 sec
Description set: YARN-2056
Recording test results
No test report files were found. Configuration error?
Build step 'Publish JUnit test result report' changed build result to FAILURE
Email was triggered for: Failure
Sending email for trigger: Failure



###################################################################################
############################## FAILED TESTS (if any) ##############################
No tests ran.