You are viewing a plain text version of this content. The canonical link for it is here.
Posted to builds@beam.apache.org by Apache Jenkins Server <je...@builds.apache.org> on 2018/10/31 00:55:21 UTC
Build failed in Jenkins: beam_PerformanceTests_JDBC #1277
See <https://builds.apache.org/job/beam_PerformanceTests_JDBC/1277/display/redirect?page=changes>
Changes:
[migryz] Add script to sync data for Beam GitHub community metrics.
[migryz] Address PR comments.
[swegner] Add GitHub data to source freshness dashboard
[swegner] Set y axis limits to 0-100%
[migryz] Fix unittests
[aaltay] [BEAM-5617] Use bytes consistently for pcollection ids. (#6844)
[github] Merge pull request #6883: [BEAM-4461] Resubmit PR to switch SQL over to
[migryz] Address PR changes
[amyrvold] [BEAM-5735] Contributor guide improvements
[lcwik] [BEAM-5299] Define max timestamp for global window in proto (#6381)
[lcwik] Remove unintended comment in BeamFnLoggingClient (#6796)
[migryz] Add Code Velocity dashboard json
------------------------------------------
[...truncated 258.65 KB...]
... 21 more
Caused by: java.io.InvalidClassException: org.apache.beam.sdk.values.WindowingStrategy; local class incompatible: stream classdesc serialVersionUID = -6607512772692666907, local class serialVersionUID = -3616600070988263902
at java.io.ObjectStreamClass.initNonProxy(ObjectStreamClass.java:616)
at java.io.ObjectInputStream.readNonProxyDesc(ObjectInputStream.java:1630)
at java.io.ObjectInputStream.readClassDesc(ObjectInputStream.java:1521)
at java.io.ObjectInputStream.readOrdinaryObject(ObjectInputStream.java:1781)
at java.io.ObjectInputStream.readObject0(ObjectInputStream.java:1353)
at java.io.ObjectInputStream.defaultReadFields(ObjectInputStream.java:2018)
at java.io.ObjectInputStream.readSerialData(ObjectInputStream.java:1942)
at java.io.ObjectInputStream.readOrdinaryObject(ObjectInputStream.java:1808)
at java.io.ObjectInputStream.readObject0(ObjectInputStream.java:1353)
at java.io.ObjectInputStream.readObject(ObjectInputStream.java:373)
at org.apache.beam.sdk.util.SerializableUtils.deserializeFromByteArray(SerializableUtils.java:71)
... 28 more
java.lang.RuntimeException: com.google.cloud.dataflow.worker.repackaged.com.google.common.util.concurrent.UncheckedExecutionException: java.lang.IllegalArgumentException: unable to deserialize Serialized DoFnInfo
at com.google.cloud.dataflow.worker.IntrinsicMapTaskExecutorFactory$1.typedApply(IntrinsicMapTaskExecutorFactory.java:192)
at com.google.cloud.dataflow.worker.IntrinsicMapTaskExecutorFactory$1.typedApply(IntrinsicMapTaskExecutorFactory.java:163)
at com.google.cloud.dataflow.worker.graph.Networks$TypeSafeNodeFunction.apply(Networks.java:63)
at com.google.cloud.dataflow.worker.graph.Networks$TypeSafeNodeFunction.apply(Networks.java:50)
at com.google.cloud.dataflow.worker.graph.Networks.replaceDirectedNetworkNodes(Networks.java:87)
at com.google.cloud.dataflow.worker.IntrinsicMapTaskExecutorFactory.create(IntrinsicMapTaskExecutorFactory.java:123)
at com.google.cloud.dataflow.worker.BatchDataflowWorker.doWork(BatchDataflowWorker.java:336)
at com.google.cloud.dataflow.worker.BatchDataflowWorker.getAndPerformWork(BatchDataflowWorker.java:290)
at com.google.cloud.dataflow.worker.DataflowBatchWorkerHarness$WorkerThread.doWork(DataflowBatchWorkerHarness.java:134)
at com.google.cloud.dataflow.worker.DataflowBatchWorkerHarness$WorkerThread.call(DataflowBatchWorkerHarness.java:114)
at com.google.cloud.dataflow.worker.DataflowBatchWorkerHarness$WorkerThread.call(DataflowBatchWorkerHarness.java:101)
at java.util.concurrent.FutureTask.run(FutureTask.java:266)
at java.util.concurrent.ThreadPoolExecutor.runWorker(ThreadPoolExecutor.java:1142)
at java.util.concurrent.ThreadPoolExecutor$Worker.run(ThreadPoolExecutor.java:617)
at java.lang.Thread.run(Thread.java:745)
Caused by: com.google.cloud.dataflow.worker.repackaged.com.google.common.util.concurrent.UncheckedExecutionException: java.lang.IllegalArgumentException: unable to deserialize Serialized DoFnInfo
at com.google.cloud.dataflow.worker.repackaged.com.google.common.cache.LocalCache$Segment.get(LocalCache.java:2214)
at com.google.cloud.dataflow.worker.repackaged.com.google.common.cache.LocalCache.get(LocalCache.java:4053)
at com.google.cloud.dataflow.worker.repackaged.com.google.common.cache.LocalCache$LocalManualCache.get(LocalCache.java:4899)
at com.google.cloud.dataflow.worker.UserParDoFnFactory.create(UserParDoFnFactory.java:90)
at com.google.cloud.dataflow.worker.DefaultParDoFnFactory.create(DefaultParDoFnFactory.java:74)
at com.google.cloud.dataflow.worker.IntrinsicMapTaskExecutorFactory.createParDoOperation(IntrinsicMapTaskExecutorFactory.java:262)
at com.google.cloud.dataflow.worker.IntrinsicMapTaskExecutorFactory.access$000(IntrinsicMapTaskExecutorFactory.java:84)
at com.google.cloud.dataflow.worker.IntrinsicMapTaskExecutorFactory$1.typedApply(IntrinsicMapTaskExecutorFactory.java:181)
... 14 more
Caused by: java.lang.IllegalArgumentException: unable to deserialize Serialized DoFnInfo
at org.apache.beam.sdk.util.SerializableUtils.deserializeFromByteArray(SerializableUtils.java:74)
at com.google.cloud.dataflow.worker.UserParDoFnFactory$UserDoFnExtractor.getDoFnInfo(UserParDoFnFactory.java:61)
at com.google.cloud.dataflow.worker.UserParDoFnFactory.lambda$create$0(UserParDoFnFactory.java:92)
at com.google.cloud.dataflow.worker.repackaged.com.google.common.cache.LocalCache$LocalManualCache$1.load(LocalCache.java:4904)
at com.google.cloud.dataflow.worker.repackaged.com.google.common.cache.LocalCache$LoadingValueReference.loadFuture(LocalCache.java:3628)
at com.google.cloud.dataflow.worker.repackaged.com.google.common.cache.LocalCache$Segment.loadSync(LocalCache.java:2336)
at com.google.cloud.dataflow.worker.repackaged.com.google.common.cache.LocalCache$Segment.lockedGetOrLoad(LocalCache.java:2295)
at com.google.cloud.dataflow.worker.repackaged.com.google.common.cache.LocalCache$Segment.get(LocalCache.java:2208)
... 21 more
Caused by: java.io.InvalidClassException: org.apache.beam.sdk.values.WindowingStrategy; local class incompatible: stream classdesc serialVersionUID = -6607512772692666907, local class serialVersionUID = -3616600070988263902
at java.io.ObjectStreamClass.initNonProxy(ObjectStreamClass.java:616)
at java.io.ObjectInputStream.readNonProxyDesc(ObjectInputStream.java:1630)
at java.io.ObjectInputStream.readClassDesc(ObjectInputStream.java:1521)
at java.io.ObjectInputStream.readOrdinaryObject(ObjectInputStream.java:1781)
at java.io.ObjectInputStream.readObject0(ObjectInputStream.java:1353)
at java.io.ObjectInputStream.defaultReadFields(ObjectInputStream.java:2018)
at java.io.ObjectInputStream.readSerialData(ObjectInputStream.java:1942)
at java.io.ObjectInputStream.readOrdinaryObject(ObjectInputStream.java:1808)
at java.io.ObjectInputStream.readObject0(ObjectInputStream.java:1353)
at java.io.ObjectInputStream.readObject(ObjectInputStream.java:373)
at org.apache.beam.sdk.util.SerializableUtils.deserializeFromByteArray(SerializableUtils.java:71)
... 28 more
java.lang.RuntimeException: com.google.cloud.dataflow.worker.repackaged.com.google.common.util.concurrent.UncheckedExecutionException: java.lang.IllegalArgumentException: unable to deserialize Serialized DoFnInfo
at com.google.cloud.dataflow.worker.IntrinsicMapTaskExecutorFactory$1.typedApply(IntrinsicMapTaskExecutorFactory.java:192)
at com.google.cloud.dataflow.worker.IntrinsicMapTaskExecutorFactory$1.typedApply(IntrinsicMapTaskExecutorFactory.java:163)
at com.google.cloud.dataflow.worker.graph.Networks$TypeSafeNodeFunction.apply(Networks.java:63)
at com.google.cloud.dataflow.worker.graph.Networks$TypeSafeNodeFunction.apply(Networks.java:50)
at com.google.cloud.dataflow.worker.graph.Networks.replaceDirectedNetworkNodes(Networks.java:87)
at com.google.cloud.dataflow.worker.IntrinsicMapTaskExecutorFactory.create(IntrinsicMapTaskExecutorFactory.java:123)
at com.google.cloud.dataflow.worker.BatchDataflowWorker.doWork(BatchDataflowWorker.java:336)
at com.google.cloud.dataflow.worker.BatchDataflowWorker.getAndPerformWork(BatchDataflowWorker.java:290)
at com.google.cloud.dataflow.worker.DataflowBatchWorkerHarness$WorkerThread.doWork(DataflowBatchWorkerHarness.java:134)
at com.google.cloud.dataflow.worker.DataflowBatchWorkerHarness$WorkerThread.call(DataflowBatchWorkerHarness.java:114)
at com.google.cloud.dataflow.worker.DataflowBatchWorkerHarness$WorkerThread.call(DataflowBatchWorkerHarness.java:101)
at java.util.concurrent.FutureTask.run(FutureTask.java:266)
at java.util.concurrent.ThreadPoolExecutor.runWorker(ThreadPoolExecutor.java:1142)
at java.util.concurrent.ThreadPoolExecutor$Worker.run(ThreadPoolExecutor.java:617)
at java.lang.Thread.run(Thread.java:745)
Caused by: com.google.cloud.dataflow.worker.repackaged.com.google.common.util.concurrent.UncheckedExecutionException: java.lang.IllegalArgumentException: unable to deserialize Serialized DoFnInfo
at com.google.cloud.dataflow.worker.repackaged.com.google.common.cache.LocalCache$Segment.get(LocalCache.java:2214)
at com.google.cloud.dataflow.worker.repackaged.com.google.common.cache.LocalCache.get(LocalCache.java:4053)
at com.google.cloud.dataflow.worker.repackaged.com.google.common.cache.LocalCache$LocalManualCache.get(LocalCache.java:4899)
at com.google.cloud.dataflow.worker.UserParDoFnFactory.create(UserParDoFnFactory.java:90)
at com.google.cloud.dataflow.worker.DefaultParDoFnFactory.create(DefaultParDoFnFactory.java:74)
at com.google.cloud.dataflow.worker.IntrinsicMapTaskExecutorFactory.createParDoOperation(IntrinsicMapTaskExecutorFactory.java:262)
at com.google.cloud.dataflow.worker.IntrinsicMapTaskExecutorFactory.access$000(IntrinsicMapTaskExecutorFactory.java:84)
at com.google.cloud.dataflow.worker.IntrinsicMapTaskExecutorFactory$1.typedApply(IntrinsicMapTaskExecutorFactory.java:181)
... 14 more
Caused by: java.lang.IllegalArgumentException: unable to deserialize Serialized DoFnInfo
at org.apache.beam.sdk.util.SerializableUtils.deserializeFromByteArray(SerializableUtils.java:74)
at com.google.cloud.dataflow.worker.UserParDoFnFactory$UserDoFnExtractor.getDoFnInfo(UserParDoFnFactory.java:61)
at com.google.cloud.dataflow.worker.UserParDoFnFactory.lambda$create$0(UserParDoFnFactory.java:92)
at com.google.cloud.dataflow.worker.repackaged.com.google.common.cache.LocalCache$LocalManualCache$1.load(LocalCache.java:4904)
at com.google.cloud.dataflow.worker.repackaged.com.google.common.cache.LocalCache$LoadingValueReference.loadFuture(LocalCache.java:3628)
at com.google.cloud.dataflow.worker.repackaged.com.google.common.cache.LocalCache$Segment.loadSync(LocalCache.java:2336)
at com.google.cloud.dataflow.worker.repackaged.com.google.common.cache.LocalCache$Segment.lockedGetOrLoad(LocalCache.java:2295)
at com.google.cloud.dataflow.worker.repackaged.com.google.common.cache.LocalCache$Segment.get(LocalCache.java:2208)
... 21 more
Caused by: java.io.InvalidClassException: org.apache.beam.sdk.values.WindowingStrategy; local class incompatible: stream classdesc serialVersionUID = -6607512772692666907, local class serialVersionUID = -3616600070988263902
at java.io.ObjectStreamClass.initNonProxy(ObjectStreamClass.java:616)
at java.io.ObjectInputStream.readNonProxyDesc(ObjectInputStream.java:1630)
at java.io.ObjectInputStream.readClassDesc(ObjectInputStream.java:1521)
at java.io.ObjectInputStream.readOrdinaryObject(ObjectInputStream.java:1781)
at java.io.ObjectInputStream.readObject0(ObjectInputStream.java:1353)
at java.io.ObjectInputStream.defaultReadFields(ObjectInputStream.java:2018)
at java.io.ObjectInputStream.readSerialData(ObjectInputStream.java:1942)
at java.io.ObjectInputStream.readOrdinaryObject(ObjectInputStream.java:1808)
at java.io.ObjectInputStream.readObject0(ObjectInputStream.java:1353)
at java.io.ObjectInputStream.readObject(ObjectInputStream.java:373)
at org.apache.beam.sdk.util.SerializableUtils.deserializeFromByteArray(SerializableUtils.java:71)
... 28 more
Workflow failed. Causes: S01:GenerateSequence/Read(BoundedCountingSource)+ParDo(DeterministicallyConstructTestRow)+JdbcIO.Write/ParDo(Write) failed., A work item was attempted 4 times without success. Each time the worker eventually lost contact with the service. The work item was attempted on:
jdbcioit0testwritethenrea-10301748-vdl3-harness-9j84,
jdbcioit0testwritethenrea-10301748-vdl3-harness-9j84,
jdbcioit0testwritethenrea-10301748-vdl3-harness-9j84,
jdbcioit0testwritethenrea-10301748-vdl3-harness-9j84
at org.apache.beam.runners.dataflow.TestDataflowRunner.run(TestDataflowRunner.java:134)
at org.apache.beam.runners.dataflow.TestDataflowRunner.run(TestDataflowRunner.java:90)
at org.apache.beam.runners.dataflow.TestDataflowRunner.run(TestDataflowRunner.java:55)
at org.apache.beam.sdk.Pipeline.run(Pipeline.java:313)
at org.apache.beam.sdk.testing.TestPipeline.run(TestPipeline.java:350)
at org.apache.beam.sdk.testing.TestPipeline.run(TestPipeline.java:331)
at org.apache.beam.sdk.io.jdbc.JdbcIOIT.runWrite(JdbcIOIT.java:125)
at org.apache.beam.sdk.io.jdbc.JdbcIOIT.testWriteThenRead(JdbcIOIT.java:103)
Finished generating test XML results (0.035 secs) into: <https://builds.apache.org/job/beam_PerformanceTests_JDBC/ws/src/sdks/java/io/jdbc/build/test-results/integrationTest>
Generating HTML test report...
Finished generating test html results (0.043 secs) into: <https://builds.apache.org/job/beam_PerformanceTests_JDBC/ws/src/sdks/java/io/jdbc/build/reports/tests/integrationTest>
:beam-sdks-java-io-jdbc:integrationTest (Thread[Task worker for ':' Thread 11,5,main]) completed. Took 6 mins 47.903 secs.
Deprecated Gradle features were used in this build, making it incompatible with Gradle 5.0.
Use '--warning-mode all' to show the individual deprecation warnings.
See https://docs.gradle.org/4.10.2/userguide/command_line_interface.html#sec:command_line_warnings
66 actionable tasks: 14 executed, 52 up-to-date
Publishing build scan...
https://gradle.com/s/ppfrcw3vs3mr4
STDERR:
1 test completed, 1 failed
FAILURE: Build failed with an exception.
* What went wrong:
Execution failed for task ':beam-sdks-java-io-jdbc:integrationTest'.
> There were failing tests. See the report at: file://<https://builds.apache.org/job/beam_PerformanceTests_JDBC/ws/src/sdks/java/io/jdbc/build/reports/tests/integrationTest/index.html>
* Try:
Run with --debug option to get more log output. Run with --scan to get full insights.
* Exception is:
org.gradle.api.tasks.TaskExecutionException: Execution failed for task ':beam-sdks-java-io-jdbc:integrationTest'.
at org.gradle.api.internal.tasks.execution.ExecuteActionsTaskExecuter.executeActions(ExecuteActionsTaskExecuter.java:110)
at org.gradle.api.internal.tasks.execution.ExecuteActionsTaskExecuter.execute(ExecuteActionsTaskExecuter.java:77)
at org.gradle.api.internal.tasks.execution.OutputDirectoryCreatingTaskExecuter.execute(OutputDirectoryCreatingTaskExecuter.java:51)
at org.gradle.api.internal.tasks.execution.SkipCachedTaskExecuter.execute(SkipCachedTaskExecuter.java:105)
at org.gradle.api.internal.tasks.execution.SkipUpToDateTaskExecuter.execute(SkipUpToDateTaskExecuter.java:59)
at org.gradle.api.internal.tasks.execution.ResolveTaskOutputCachingStateExecuter.execute(ResolveTaskOutputCachingStateExecuter.java:54)
at org.gradle.api.internal.tasks.execution.ResolveBuildCacheKeyExecuter.execute(ResolveBuildCacheKeyExecuter.java:79)
at org.gradle.api.internal.tasks.execution.ValidatingTaskExecuter.execute(ValidatingTaskExecuter.java:59)
at org.gradle.api.internal.tasks.execution.SkipEmptySourceFilesTaskExecuter.execute(SkipEmptySourceFilesTaskExecuter.java:101)
at org.gradle.api.internal.tasks.execution.FinalizeInputFilePropertiesTaskExecuter.execute(FinalizeInputFilePropertiesTaskExecuter.java:44)
at org.gradle.api.internal.tasks.execution.CleanupStaleOutputsExecuter.execute(CleanupStaleOutputsExecuter.java:91)
at org.gradle.api.internal.tasks.execution.ResolveTaskArtifactStateTaskExecuter.execute(ResolveTaskArtifactStateTaskExecuter.java:62)
at org.gradle.api.internal.tasks.execution.SkipTaskWithNoActionsExecuter.execute(SkipTaskWithNoActionsExecuter.java:59)
at org.gradle.api.internal.tasks.execution.SkipOnlyIfTaskExecuter.execute(SkipOnlyIfTaskExecuter.java:54)
at org.gradle.api.internal.tasks.execution.ExecuteAtMostOnceTaskExecuter.execute(ExecuteAtMostOnceTaskExecuter.java:43)
at org.gradle.api.internal.tasks.execution.CatchExceptionTaskExecuter.execute(CatchExceptionTaskExecuter.java:34)
at org.gradle.api.internal.tasks.execution.EventFiringTaskExecuter$1.run(EventFiringTaskExecuter.java:51)
at org.gradle.internal.operations.DefaultBuildOperationExecutor$RunnableBuildOperationWorker.execute(DefaultBuildOperationExecutor.java:300)
at org.gradle.internal.operations.DefaultBuildOperationExecutor$RunnableBuildOperationWorker.execute(DefaultBuildOperationExecutor.java:292)
at org.gradle.internal.operations.DefaultBuildOperationExecutor.execute(DefaultBuildOperationExecutor.java:174)
at org.gradle.internal.operations.DefaultBuildOperationExecutor.run(DefaultBuildOperationExecutor.java:90)
at org.gradle.internal.operations.DelegatingBuildOperationExecutor.run(DelegatingBuildOperationExecutor.java:31)
at org.gradle.api.internal.tasks.execution.EventFiringTaskExecuter.execute(EventFiringTaskExecuter.java:46)
at org.gradle.execution.taskgraph.LocalTaskInfoExecutor.execute(LocalTaskInfoExecutor.java:42)
at org.gradle.execution.taskgraph.DefaultTaskExecutionGraph$BuildOperationAwareWorkItemExecutor.execute(DefaultTaskExecutionGraph.java:277)
at org.gradle.execution.taskgraph.DefaultTaskExecutionGraph$BuildOperationAwareWorkItemExecutor.execute(DefaultTaskExecutionGraph.java:262)
at org.gradle.execution.taskgraph.DefaultTaskPlanExecutor$ExecutorWorker$1.execute(DefaultTaskPlanExecutor.java:135)
at org.gradle.execution.taskgraph.DefaultTaskPlanExecutor$ExecutorWorker$1.execute(DefaultTaskPlanExecutor.java:130)
at org.gradle.execution.taskgraph.DefaultTaskPlanExecutor$ExecutorWorker.execute(DefaultTaskPlanExecutor.java:200)
at org.gradle.execution.taskgraph.DefaultTaskPlanExecutor$ExecutorWorker.executeWithWork(DefaultTaskPlanExecutor.java:191)
at org.gradle.execution.taskgraph.DefaultTaskPlanExecutor$ExecutorWorker.run(DefaultTaskPlanExecutor.java:130)
at org.gradle.internal.concurrent.ExecutorPolicy$CatchAndRecordFailures.onExecute(ExecutorPolicy.java:63)
at org.gradle.internal.concurrent.ManagedExecutorImpl$1.run(ManagedExecutorImpl.java:46)
at org.gradle.internal.concurrent.ThreadFactoryImpl$ManagedThreadRunnable.run(ThreadFactoryImpl.java:55)
Caused by: org.gradle.api.GradleException: There were failing tests. See the report at: file://<https://builds.apache.org/job/beam_PerformanceTests_JDBC/ws/src/sdks/java/io/jdbc/build/reports/tests/integrationTest/index.html>
at org.gradle.api.tasks.testing.AbstractTestTask.handleTestFailures(AbstractTestTask.java:612)
at org.gradle.api.tasks.testing.AbstractTestTask.executeTests(AbstractTestTask.java:484)
at org.gradle.api.tasks.testing.Test.executeTests(Test.java:603)
at org.gradle.internal.reflect.JavaMethod.invoke(JavaMethod.java:73)
at org.gradle.api.internal.project.taskfactory.StandardTaskAction.doExecute(StandardTaskAction.java:46)
at org.gradle.api.internal.project.taskfactory.StandardTaskAction.execute(StandardTaskAction.java:39)
at org.gradle.api.internal.project.taskfactory.StandardTaskAction.execute(StandardTaskAction.java:26)
at org.gradle.api.internal.AbstractTask$TaskActionWrapper.execute(AbstractTask.java:801)
at org.gradle.api.internal.AbstractTask$TaskActionWrapper.execute(AbstractTask.java:768)
at org.gradle.api.internal.tasks.execution.ExecuteActionsTaskExecuter$1.run(ExecuteActionsTaskExecuter.java:131)
at org.gradle.internal.operations.DefaultBuildOperationExecutor$RunnableBuildOperationWorker.execute(DefaultBuildOperationExecutor.java:300)
at org.gradle.internal.operations.DefaultBuildOperationExecutor$RunnableBuildOperationWorker.execute(DefaultBuildOperationExecutor.java:292)
at org.gradle.internal.operations.DefaultBuildOperationExecutor.execute(DefaultBuildOperationExecutor.java:174)
at org.gradle.internal.operations.DefaultBuildOperationExecutor.run(DefaultBuildOperationExecutor.java:90)
at org.gradle.internal.operations.DelegatingBuildOperationExecutor.run(DelegatingBuildOperationExecutor.java:31)
at org.gradle.api.internal.tasks.execution.ExecuteActionsTaskExecuter.executeAction(ExecuteActionsTaskExecuter.java:120)
at org.gradle.api.internal.tasks.execution.ExecuteActionsTaskExecuter.executeActions(ExecuteActionsTaskExecuter.java:99)
... 33 more
* Get more help at https://help.gradle.org
BUILD FAILED in 8m 26s
2018-10-31 00:55:19,988 126b68a4 MainThread beam_integration_benchmark(1/1) ERROR Error during benchmark beam_integration_benchmark
Traceback (most recent call last):
File "<https://builds.apache.org/job/beam_PerformanceTests_JDBC/ws/PerfKitBenchmarker/perfkitbenchmarker/pkb.py",> line 719, in RunBenchmark
DoRunPhase(spec, collector, detailed_timer)
File "<https://builds.apache.org/job/beam_PerformanceTests_JDBC/ws/PerfKitBenchmarker/perfkitbenchmarker/pkb.py",> line 580, in DoRunPhase
samples = spec.BenchmarkRun(spec)
File "<https://builds.apache.org/job/beam_PerformanceTests_JDBC/ws/PerfKitBenchmarker/perfkitbenchmarker/linux_benchmarks/beam_integration_benchmark.py",> line 160, in Run
job_type=job_type)
File "<https://builds.apache.org/job/beam_PerformanceTests_JDBC/ws/PerfKitBenchmarker/perfkitbenchmarker/providers/gcp/gcp_dpb_dataflow.py",> line 90, in SubmitJob
assert retcode == 0, "Integration Test Failed."
AssertionError: Integration Test Failed.
2018-10-31 00:55:19,990 126b68a4 MainThread beam_integration_benchmark(1/1) INFO Cleaning up benchmark beam_integration_benchmark
2018-10-31 00:55:19,990 126b68a4 MainThread beam_integration_benchmark(1/1) INFO Running: kubectl --kubeconfig=<https://builds.apache.org/job/beam_PerformanceTests_JDBC/ws/config-beam-performancetests-jdbc-1277> delete -f <https://builds.apache.org/job/beam_PerformanceTests_JDBC/ws/src/.test-infra/kubernetes/postgres/postgres-service-for-local-dev.yml> --ignore-not-found
2018-10-31 00:55:20,519 126b68a4 MainThread beam_integration_benchmark(1/1) ERROR Exception running benchmark
Traceback (most recent call last):
File "<https://builds.apache.org/job/beam_PerformanceTests_JDBC/ws/PerfKitBenchmarker/perfkitbenchmarker/pkb.py",> line 860, in RunBenchmarkTask
RunBenchmark(spec, collector)
File "<https://builds.apache.org/job/beam_PerformanceTests_JDBC/ws/PerfKitBenchmarker/perfkitbenchmarker/pkb.py",> line 719, in RunBenchmark
DoRunPhase(spec, collector, detailed_timer)
File "<https://builds.apache.org/job/beam_PerformanceTests_JDBC/ws/PerfKitBenchmarker/perfkitbenchmarker/pkb.py",> line 580, in DoRunPhase
samples = spec.BenchmarkRun(spec)
File "<https://builds.apache.org/job/beam_PerformanceTests_JDBC/ws/PerfKitBenchmarker/perfkitbenchmarker/linux_benchmarks/beam_integration_benchmark.py",> line 160, in Run
job_type=job_type)
File "<https://builds.apache.org/job/beam_PerformanceTests_JDBC/ws/PerfKitBenchmarker/perfkitbenchmarker/providers/gcp/gcp_dpb_dataflow.py",> line 90, in SubmitJob
assert retcode == 0, "Integration Test Failed."
AssertionError: Integration Test Failed.
2018-10-31 00:55:20,519 126b68a4 MainThread beam_integration_benchmark(1/1) ERROR Benchmark 1/1 beam_integration_benchmark (UID: beam_integration_benchmark0) failed. Execution will continue.
2018-10-31 00:55:20,566 126b68a4 MainThread INFO Benchmark run statuses:
---------------------------------------------------------------------------------
Name UID Status Failed Substatus
---------------------------------------------------------------------------------
beam_integration_benchmark beam_integration_benchmark0 FAILED
---------------------------------------------------------------------------------
Success rate: 0.00% (0/1)
2018-10-31 00:55:20,567 126b68a4 MainThread INFO Complete logs can be found at: <https://builds.apache.org/job/beam_PerformanceTests_JDBC/ws/runs/126b68a4/pkb.log>
2018-10-31 00:55:20,567 126b68a4 MainThread INFO Completion statuses can be found at: <https://builds.apache.org/job/beam_PerformanceTests_JDBC/ws/runs/126b68a4/completion_statuses.json>
Build step 'Execute shell' marked build as failure
---------------------------------------------------------------------
To unsubscribe, e-mail: builds-unsubscribe@beam.apache.org
For additional commands, e-mail: builds-help@beam.apache.org
Jenkins build is back to normal : beam_PerformanceTests_JDBC #1280
Posted by Apache Jenkins Server <je...@builds.apache.org>.
See <https://builds.apache.org/job/beam_PerformanceTests_JDBC/1280/display/redirect?page=changes>
---------------------------------------------------------------------
To unsubscribe, e-mail: builds-unsubscribe@beam.apache.org
For additional commands, e-mail: builds-help@beam.apache.org
Build failed in Jenkins: beam_PerformanceTests_JDBC #1279
Posted by Apache Jenkins Server <je...@builds.apache.org>.
See <https://builds.apache.org/job/beam_PerformanceTests_JDBC/1279/display/redirect>
------------------------------------------
[...truncated 258.78 KB...]
... 21 more
Caused by: java.io.InvalidClassException: org.apache.beam.sdk.values.WindowingStrategy; local class incompatible: stream classdesc serialVersionUID = -6607512772692666907, local class serialVersionUID = -3616600070988263902
at java.io.ObjectStreamClass.initNonProxy(ObjectStreamClass.java:616)
at java.io.ObjectInputStream.readNonProxyDesc(ObjectInputStream.java:1630)
at java.io.ObjectInputStream.readClassDesc(ObjectInputStream.java:1521)
at java.io.ObjectInputStream.readOrdinaryObject(ObjectInputStream.java:1781)
at java.io.ObjectInputStream.readObject0(ObjectInputStream.java:1353)
at java.io.ObjectInputStream.defaultReadFields(ObjectInputStream.java:2018)
at java.io.ObjectInputStream.readSerialData(ObjectInputStream.java:1942)
at java.io.ObjectInputStream.readOrdinaryObject(ObjectInputStream.java:1808)
at java.io.ObjectInputStream.readObject0(ObjectInputStream.java:1353)
at java.io.ObjectInputStream.readObject(ObjectInputStream.java:373)
at org.apache.beam.sdk.util.SerializableUtils.deserializeFromByteArray(SerializableUtils.java:71)
... 28 more
java.lang.RuntimeException: com.google.cloud.dataflow.worker.repackaged.com.google.common.util.concurrent.UncheckedExecutionException: java.lang.IllegalArgumentException: unable to deserialize Serialized DoFnInfo
at com.google.cloud.dataflow.worker.IntrinsicMapTaskExecutorFactory$1.typedApply(IntrinsicMapTaskExecutorFactory.java:192)
at com.google.cloud.dataflow.worker.IntrinsicMapTaskExecutorFactory$1.typedApply(IntrinsicMapTaskExecutorFactory.java:163)
at com.google.cloud.dataflow.worker.graph.Networks$TypeSafeNodeFunction.apply(Networks.java:63)
at com.google.cloud.dataflow.worker.graph.Networks$TypeSafeNodeFunction.apply(Networks.java:50)
at com.google.cloud.dataflow.worker.graph.Networks.replaceDirectedNetworkNodes(Networks.java:87)
at com.google.cloud.dataflow.worker.IntrinsicMapTaskExecutorFactory.create(IntrinsicMapTaskExecutorFactory.java:123)
at com.google.cloud.dataflow.worker.BatchDataflowWorker.doWork(BatchDataflowWorker.java:336)
at com.google.cloud.dataflow.worker.BatchDataflowWorker.getAndPerformWork(BatchDataflowWorker.java:290)
at com.google.cloud.dataflow.worker.DataflowBatchWorkerHarness$WorkerThread.doWork(DataflowBatchWorkerHarness.java:134)
at com.google.cloud.dataflow.worker.DataflowBatchWorkerHarness$WorkerThread.call(DataflowBatchWorkerHarness.java:114)
at com.google.cloud.dataflow.worker.DataflowBatchWorkerHarness$WorkerThread.call(DataflowBatchWorkerHarness.java:101)
at java.util.concurrent.FutureTask.run(FutureTask.java:266)
at java.util.concurrent.ThreadPoolExecutor.runWorker(ThreadPoolExecutor.java:1142)
at java.util.concurrent.ThreadPoolExecutor$Worker.run(ThreadPoolExecutor.java:617)
at java.lang.Thread.run(Thread.java:745)
Caused by: com.google.cloud.dataflow.worker.repackaged.com.google.common.util.concurrent.UncheckedExecutionException: java.lang.IllegalArgumentException: unable to deserialize Serialized DoFnInfo
at com.google.cloud.dataflow.worker.repackaged.com.google.common.cache.LocalCache$Segment.get(LocalCache.java:2214)
at com.google.cloud.dataflow.worker.repackaged.com.google.common.cache.LocalCache.get(LocalCache.java:4053)
at com.google.cloud.dataflow.worker.repackaged.com.google.common.cache.LocalCache$LocalManualCache.get(LocalCache.java:4899)
at com.google.cloud.dataflow.worker.UserParDoFnFactory.create(UserParDoFnFactory.java:90)
at com.google.cloud.dataflow.worker.DefaultParDoFnFactory.create(DefaultParDoFnFactory.java:74)
at com.google.cloud.dataflow.worker.IntrinsicMapTaskExecutorFactory.createParDoOperation(IntrinsicMapTaskExecutorFactory.java:262)
at com.google.cloud.dataflow.worker.IntrinsicMapTaskExecutorFactory.access$000(IntrinsicMapTaskExecutorFactory.java:84)
at com.google.cloud.dataflow.worker.IntrinsicMapTaskExecutorFactory$1.typedApply(IntrinsicMapTaskExecutorFactory.java:181)
... 14 more
Caused by: java.lang.IllegalArgumentException: unable to deserialize Serialized DoFnInfo
at org.apache.beam.sdk.util.SerializableUtils.deserializeFromByteArray(SerializableUtils.java:74)
at com.google.cloud.dataflow.worker.UserParDoFnFactory$UserDoFnExtractor.getDoFnInfo(UserParDoFnFactory.java:61)
at com.google.cloud.dataflow.worker.UserParDoFnFactory.lambda$create$0(UserParDoFnFactory.java:92)
at com.google.cloud.dataflow.worker.repackaged.com.google.common.cache.LocalCache$LocalManualCache$1.load(LocalCache.java:4904)
at com.google.cloud.dataflow.worker.repackaged.com.google.common.cache.LocalCache$LoadingValueReference.loadFuture(LocalCache.java:3628)
at com.google.cloud.dataflow.worker.repackaged.com.google.common.cache.LocalCache$Segment.loadSync(LocalCache.java:2336)
at com.google.cloud.dataflow.worker.repackaged.com.google.common.cache.LocalCache$Segment.lockedGetOrLoad(LocalCache.java:2295)
at com.google.cloud.dataflow.worker.repackaged.com.google.common.cache.LocalCache$Segment.get(LocalCache.java:2208)
... 21 more
Caused by: java.io.InvalidClassException: org.apache.beam.sdk.values.WindowingStrategy; local class incompatible: stream classdesc serialVersionUID = -6607512772692666907, local class serialVersionUID = -3616600070988263902
at java.io.ObjectStreamClass.initNonProxy(ObjectStreamClass.java:616)
at java.io.ObjectInputStream.readNonProxyDesc(ObjectInputStream.java:1630)
at java.io.ObjectInputStream.readClassDesc(ObjectInputStream.java:1521)
at java.io.ObjectInputStream.readOrdinaryObject(ObjectInputStream.java:1781)
at java.io.ObjectInputStream.readObject0(ObjectInputStream.java:1353)
at java.io.ObjectInputStream.defaultReadFields(ObjectInputStream.java:2018)
at java.io.ObjectInputStream.readSerialData(ObjectInputStream.java:1942)
at java.io.ObjectInputStream.readOrdinaryObject(ObjectInputStream.java:1808)
at java.io.ObjectInputStream.readObject0(ObjectInputStream.java:1353)
at java.io.ObjectInputStream.readObject(ObjectInputStream.java:373)
at org.apache.beam.sdk.util.SerializableUtils.deserializeFromByteArray(SerializableUtils.java:71)
... 28 more
java.lang.RuntimeException: com.google.cloud.dataflow.worker.repackaged.com.google.common.util.concurrent.UncheckedExecutionException: java.lang.IllegalArgumentException: unable to deserialize Serialized DoFnInfo
at com.google.cloud.dataflow.worker.IntrinsicMapTaskExecutorFactory$1.typedApply(IntrinsicMapTaskExecutorFactory.java:192)
at com.google.cloud.dataflow.worker.IntrinsicMapTaskExecutorFactory$1.typedApply(IntrinsicMapTaskExecutorFactory.java:163)
at com.google.cloud.dataflow.worker.graph.Networks$TypeSafeNodeFunction.apply(Networks.java:63)
at com.google.cloud.dataflow.worker.graph.Networks$TypeSafeNodeFunction.apply(Networks.java:50)
at com.google.cloud.dataflow.worker.graph.Networks.replaceDirectedNetworkNodes(Networks.java:87)
at com.google.cloud.dataflow.worker.IntrinsicMapTaskExecutorFactory.create(IntrinsicMapTaskExecutorFactory.java:123)
at com.google.cloud.dataflow.worker.BatchDataflowWorker.doWork(BatchDataflowWorker.java:336)
at com.google.cloud.dataflow.worker.BatchDataflowWorker.getAndPerformWork(BatchDataflowWorker.java:290)
at com.google.cloud.dataflow.worker.DataflowBatchWorkerHarness$WorkerThread.doWork(DataflowBatchWorkerHarness.java:134)
at com.google.cloud.dataflow.worker.DataflowBatchWorkerHarness$WorkerThread.call(DataflowBatchWorkerHarness.java:114)
at com.google.cloud.dataflow.worker.DataflowBatchWorkerHarness$WorkerThread.call(DataflowBatchWorkerHarness.java:101)
at java.util.concurrent.FutureTask.run(FutureTask.java:266)
at java.util.concurrent.ThreadPoolExecutor.runWorker(ThreadPoolExecutor.java:1142)
at java.util.concurrent.ThreadPoolExecutor$Worker.run(ThreadPoolExecutor.java:617)
at java.lang.Thread.run(Thread.java:745)
Caused by: com.google.cloud.dataflow.worker.repackaged.com.google.common.util.concurrent.UncheckedExecutionException: java.lang.IllegalArgumentException: unable to deserialize Serialized DoFnInfo
at com.google.cloud.dataflow.worker.repackaged.com.google.common.cache.LocalCache$Segment.get(LocalCache.java:2214)
at com.google.cloud.dataflow.worker.repackaged.com.google.common.cache.LocalCache.get(LocalCache.java:4053)
at com.google.cloud.dataflow.worker.repackaged.com.google.common.cache.LocalCache$LocalManualCache.get(LocalCache.java:4899)
at com.google.cloud.dataflow.worker.UserParDoFnFactory.create(UserParDoFnFactory.java:90)
at com.google.cloud.dataflow.worker.DefaultParDoFnFactory.create(DefaultParDoFnFactory.java:74)
at com.google.cloud.dataflow.worker.IntrinsicMapTaskExecutorFactory.createParDoOperation(IntrinsicMapTaskExecutorFactory.java:262)
at com.google.cloud.dataflow.worker.IntrinsicMapTaskExecutorFactory.access$000(IntrinsicMapTaskExecutorFactory.java:84)
at com.google.cloud.dataflow.worker.IntrinsicMapTaskExecutorFactory$1.typedApply(IntrinsicMapTaskExecutorFactory.java:181)
... 14 more
Caused by: java.lang.IllegalArgumentException: unable to deserialize Serialized DoFnInfo
at org.apache.beam.sdk.util.SerializableUtils.deserializeFromByteArray(SerializableUtils.java:74)
at com.google.cloud.dataflow.worker.UserParDoFnFactory$UserDoFnExtractor.getDoFnInfo(UserParDoFnFactory.java:61)
at com.google.cloud.dataflow.worker.UserParDoFnFactory.lambda$create$0(UserParDoFnFactory.java:92)
at com.google.cloud.dataflow.worker.repackaged.com.google.common.cache.LocalCache$LocalManualCache$1.load(LocalCache.java:4904)
at com.google.cloud.dataflow.worker.repackaged.com.google.common.cache.LocalCache$LoadingValueReference.loadFuture(LocalCache.java:3628)
at com.google.cloud.dataflow.worker.repackaged.com.google.common.cache.LocalCache$Segment.loadSync(LocalCache.java:2336)
at com.google.cloud.dataflow.worker.repackaged.com.google.common.cache.LocalCache$Segment.lockedGetOrLoad(LocalCache.java:2295)
at com.google.cloud.dataflow.worker.repackaged.com.google.common.cache.LocalCache$Segment.get(LocalCache.java:2208)
... 21 more
Caused by: java.io.InvalidClassException: org.apache.beam.sdk.values.WindowingStrategy; local class incompatible: stream classdesc serialVersionUID = -6607512772692666907, local class serialVersionUID = -3616600070988263902
at java.io.ObjectStreamClass.initNonProxy(ObjectStreamClass.java:616)
at java.io.ObjectInputStream.readNonProxyDesc(ObjectInputStream.java:1630)
at java.io.ObjectInputStream.readClassDesc(ObjectInputStream.java:1521)
at java.io.ObjectInputStream.readOrdinaryObject(ObjectInputStream.java:1781)
at java.io.ObjectInputStream.readObject0(ObjectInputStream.java:1353)
at java.io.ObjectInputStream.defaultReadFields(ObjectInputStream.java:2018)
at java.io.ObjectInputStream.readSerialData(ObjectInputStream.java:1942)
at java.io.ObjectInputStream.readOrdinaryObject(ObjectInputStream.java:1808)
at java.io.ObjectInputStream.readObject0(ObjectInputStream.java:1353)
at java.io.ObjectInputStream.readObject(ObjectInputStream.java:373)
at org.apache.beam.sdk.util.SerializableUtils.deserializeFromByteArray(SerializableUtils.java:71)
... 28 more
Workflow failed. Causes: S01:GenerateSequence/Read(BoundedCountingSource)+ParDo(DeterministicallyConstructTestRow)+JdbcIO.Write/ParDo(Write) failed., A work item was attempted 4 times without success. Each time the worker eventually lost contact with the service. The work item was attempted on:
jdbcioit0testwritethenrea-10310513-k3io-harness-zdlr,
jdbcioit0testwritethenrea-10310513-k3io-harness-zdlr,
jdbcioit0testwritethenrea-10310513-k3io-harness-zdlr,
jdbcioit0testwritethenrea-10310513-k3io-harness-zdlr
at org.apache.beam.runners.dataflow.TestDataflowRunner.run(TestDataflowRunner.java:134)
at org.apache.beam.runners.dataflow.TestDataflowRunner.run(TestDataflowRunner.java:90)
at org.apache.beam.runners.dataflow.TestDataflowRunner.run(TestDataflowRunner.java:55)
at org.apache.beam.sdk.Pipeline.run(Pipeline.java:313)
at org.apache.beam.sdk.testing.TestPipeline.run(TestPipeline.java:350)
at org.apache.beam.sdk.testing.TestPipeline.run(TestPipeline.java:331)
at org.apache.beam.sdk.io.jdbc.JdbcIOIT.runWrite(JdbcIOIT.java:125)
at org.apache.beam.sdk.io.jdbc.JdbcIOIT.testWriteThenRead(JdbcIOIT.java:103)
Finished generating test XML results (0.032 secs) into: <https://builds.apache.org/job/beam_PerformanceTests_JDBC/ws/src/sdks/java/io/jdbc/build/test-results/integrationTest>
Generating HTML test report...
Finished generating test html results (0.032 secs) into: <https://builds.apache.org/job/beam_PerformanceTests_JDBC/ws/src/sdks/java/io/jdbc/build/reports/tests/integrationTest>
:beam-sdks-java-io-jdbc:integrationTest (Thread[Task worker for ':' Thread 6,5,main]) completed. Took 5 mins 4.212 secs.
Deprecated Gradle features were used in this build, making it incompatible with Gradle 5.0.
Use '--warning-mode all' to show the individual deprecation warnings.
See https://docs.gradle.org/4.10.2/userguide/command_line_interface.html#sec:command_line_warnings
66 actionable tasks: 14 executed, 52 up-to-date
Publishing build scan...
https://gradle.com/s/xrrktruk2je6u
STDERR:
1 test completed, 1 failed
FAILURE: Build failed with an exception.
* What went wrong:
Execution failed for task ':beam-sdks-java-io-jdbc:integrationTest'.
> There were failing tests. See the report at: file://<https://builds.apache.org/job/beam_PerformanceTests_JDBC/ws/src/sdks/java/io/jdbc/build/reports/tests/integrationTest/index.html>
* Try:
Run with --debug option to get more log output. Run with --scan to get full insights.
* Exception is:
org.gradle.api.tasks.TaskExecutionException: Execution failed for task ':beam-sdks-java-io-jdbc:integrationTest'.
at org.gradle.api.internal.tasks.execution.ExecuteActionsTaskExecuter.executeActions(ExecuteActionsTaskExecuter.java:110)
at org.gradle.api.internal.tasks.execution.ExecuteActionsTaskExecuter.execute(ExecuteActionsTaskExecuter.java:77)
at org.gradle.api.internal.tasks.execution.OutputDirectoryCreatingTaskExecuter.execute(OutputDirectoryCreatingTaskExecuter.java:51)
at org.gradle.api.internal.tasks.execution.SkipCachedTaskExecuter.execute(SkipCachedTaskExecuter.java:105)
at org.gradle.api.internal.tasks.execution.SkipUpToDateTaskExecuter.execute(SkipUpToDateTaskExecuter.java:59)
at org.gradle.api.internal.tasks.execution.ResolveTaskOutputCachingStateExecuter.execute(ResolveTaskOutputCachingStateExecuter.java:54)
at org.gradle.api.internal.tasks.execution.ResolveBuildCacheKeyExecuter.execute(ResolveBuildCacheKeyExecuter.java:79)
at org.gradle.api.internal.tasks.execution.ValidatingTaskExecuter.execute(ValidatingTaskExecuter.java:59)
at org.gradle.api.internal.tasks.execution.SkipEmptySourceFilesTaskExecuter.execute(SkipEmptySourceFilesTaskExecuter.java:101)
at org.gradle.api.internal.tasks.execution.FinalizeInputFilePropertiesTaskExecuter.execute(FinalizeInputFilePropertiesTaskExecuter.java:44)
at org.gradle.api.internal.tasks.execution.CleanupStaleOutputsExecuter.execute(CleanupStaleOutputsExecuter.java:91)
at org.gradle.api.internal.tasks.execution.ResolveTaskArtifactStateTaskExecuter.execute(ResolveTaskArtifactStateTaskExecuter.java:62)
at org.gradle.api.internal.tasks.execution.SkipTaskWithNoActionsExecuter.execute(SkipTaskWithNoActionsExecuter.java:59)
at org.gradle.api.internal.tasks.execution.SkipOnlyIfTaskExecuter.execute(SkipOnlyIfTaskExecuter.java:54)
at org.gradle.api.internal.tasks.execution.ExecuteAtMostOnceTaskExecuter.execute(ExecuteAtMostOnceTaskExecuter.java:43)
at org.gradle.api.internal.tasks.execution.CatchExceptionTaskExecuter.execute(CatchExceptionTaskExecuter.java:34)
at org.gradle.api.internal.tasks.execution.EventFiringTaskExecuter$1.run(EventFiringTaskExecuter.java:51)
at org.gradle.internal.operations.DefaultBuildOperationExecutor$RunnableBuildOperationWorker.execute(DefaultBuildOperationExecutor.java:300)
at org.gradle.internal.operations.DefaultBuildOperationExecutor$RunnableBuildOperationWorker.execute(DefaultBuildOperationExecutor.java:292)
at org.gradle.internal.operations.DefaultBuildOperationExecutor.execute(DefaultBuildOperationExecutor.java:174)
at org.gradle.internal.operations.DefaultBuildOperationExecutor.run(DefaultBuildOperationExecutor.java:90)
at org.gradle.internal.operations.DelegatingBuildOperationExecutor.run(DelegatingBuildOperationExecutor.java:31)
at org.gradle.api.internal.tasks.execution.EventFiringTaskExecuter.execute(EventFiringTaskExecuter.java:46)
at org.gradle.execution.taskgraph.LocalTaskInfoExecutor.execute(LocalTaskInfoExecutor.java:42)
at org.gradle.execution.taskgraph.DefaultTaskExecutionGraph$BuildOperationAwareWorkItemExecutor.execute(DefaultTaskExecutionGraph.java:277)
at org.gradle.execution.taskgraph.DefaultTaskExecutionGraph$BuildOperationAwareWorkItemExecutor.execute(DefaultTaskExecutionGraph.java:262)
at org.gradle.execution.taskgraph.DefaultTaskPlanExecutor$ExecutorWorker$1.execute(DefaultTaskPlanExecutor.java:135)
at org.gradle.execution.taskgraph.DefaultTaskPlanExecutor$ExecutorWorker$1.execute(DefaultTaskPlanExecutor.java:130)
at org.gradle.execution.taskgraph.DefaultTaskPlanExecutor$ExecutorWorker.execute(DefaultTaskPlanExecutor.java:200)
at org.gradle.execution.taskgraph.DefaultTaskPlanExecutor$ExecutorWorker.executeWithWork(DefaultTaskPlanExecutor.java:191)
at org.gradle.execution.taskgraph.DefaultTaskPlanExecutor$ExecutorWorker.run(DefaultTaskPlanExecutor.java:130)
at org.gradle.internal.concurrent.ExecutorPolicy$CatchAndRecordFailures.onExecute(ExecutorPolicy.java:63)
at org.gradle.internal.concurrent.ManagedExecutorImpl$1.run(ManagedExecutorImpl.java:46)
at org.gradle.internal.concurrent.ThreadFactoryImpl$ManagedThreadRunnable.run(ThreadFactoryImpl.java:55)
Caused by: org.gradle.api.GradleException: There were failing tests. See the report at: file://<https://builds.apache.org/job/beam_PerformanceTests_JDBC/ws/src/sdks/java/io/jdbc/build/reports/tests/integrationTest/index.html>
at org.gradle.api.tasks.testing.AbstractTestTask.handleTestFailures(AbstractTestTask.java:612)
at org.gradle.api.tasks.testing.AbstractTestTask.executeTests(AbstractTestTask.java:484)
at org.gradle.api.tasks.testing.Test.executeTests(Test.java:603)
at org.gradle.internal.reflect.JavaMethod.invoke(JavaMethod.java:73)
at org.gradle.api.internal.project.taskfactory.StandardTaskAction.doExecute(StandardTaskAction.java:46)
at org.gradle.api.internal.project.taskfactory.StandardTaskAction.execute(StandardTaskAction.java:39)
at org.gradle.api.internal.project.taskfactory.StandardTaskAction.execute(StandardTaskAction.java:26)
at org.gradle.api.internal.AbstractTask$TaskActionWrapper.execute(AbstractTask.java:801)
at org.gradle.api.internal.AbstractTask$TaskActionWrapper.execute(AbstractTask.java:768)
at org.gradle.api.internal.tasks.execution.ExecuteActionsTaskExecuter$1.run(ExecuteActionsTaskExecuter.java:131)
at org.gradle.internal.operations.DefaultBuildOperationExecutor$RunnableBuildOperationWorker.execute(DefaultBuildOperationExecutor.java:300)
at org.gradle.internal.operations.DefaultBuildOperationExecutor$RunnableBuildOperationWorker.execute(DefaultBuildOperationExecutor.java:292)
at org.gradle.internal.operations.DefaultBuildOperationExecutor.execute(DefaultBuildOperationExecutor.java:174)
at org.gradle.internal.operations.DefaultBuildOperationExecutor.run(DefaultBuildOperationExecutor.java:90)
at org.gradle.internal.operations.DelegatingBuildOperationExecutor.run(DelegatingBuildOperationExecutor.java:31)
at org.gradle.api.internal.tasks.execution.ExecuteActionsTaskExecuter.executeAction(ExecuteActionsTaskExecuter.java:120)
at org.gradle.api.internal.tasks.execution.ExecuteActionsTaskExecuter.executeActions(ExecuteActionsTaskExecuter.java:99)
... 33 more
* Get more help at https://help.gradle.org
BUILD FAILED in 6m 27s
2018-10-31 12:18:19,990 9dc7e3c9 MainThread beam_integration_benchmark(1/1) ERROR Error during benchmark beam_integration_benchmark
Traceback (most recent call last):
File "<https://builds.apache.org/job/beam_PerformanceTests_JDBC/ws/PerfKitBenchmarker/perfkitbenchmarker/pkb.py",> line 719, in RunBenchmark
DoRunPhase(spec, collector, detailed_timer)
File "<https://builds.apache.org/job/beam_PerformanceTests_JDBC/ws/PerfKitBenchmarker/perfkitbenchmarker/pkb.py",> line 580, in DoRunPhase
samples = spec.BenchmarkRun(spec)
File "<https://builds.apache.org/job/beam_PerformanceTests_JDBC/ws/PerfKitBenchmarker/perfkitbenchmarker/linux_benchmarks/beam_integration_benchmark.py",> line 160, in Run
job_type=job_type)
File "<https://builds.apache.org/job/beam_PerformanceTests_JDBC/ws/PerfKitBenchmarker/perfkitbenchmarker/providers/gcp/gcp_dpb_dataflow.py",> line 90, in SubmitJob
assert retcode == 0, "Integration Test Failed."
AssertionError: Integration Test Failed.
2018-10-31 12:18:19,991 9dc7e3c9 MainThread beam_integration_benchmark(1/1) INFO Cleaning up benchmark beam_integration_benchmark
2018-10-31 12:18:19,992 9dc7e3c9 MainThread beam_integration_benchmark(1/1) INFO Running: kubectl --kubeconfig=<https://builds.apache.org/job/beam_PerformanceTests_JDBC/ws/config-beam-performancetests-jdbc-1279> delete -f <https://builds.apache.org/job/beam_PerformanceTests_JDBC/ws/src/.test-infra/kubernetes/postgres/postgres-service-for-local-dev.yml> --ignore-not-found
2018-10-31 12:18:20,831 9dc7e3c9 MainThread beam_integration_benchmark(1/1) ERROR Exception running benchmark
Traceback (most recent call last):
File "<https://builds.apache.org/job/beam_PerformanceTests_JDBC/ws/PerfKitBenchmarker/perfkitbenchmarker/pkb.py",> line 860, in RunBenchmarkTask
RunBenchmark(spec, collector)
File "<https://builds.apache.org/job/beam_PerformanceTests_JDBC/ws/PerfKitBenchmarker/perfkitbenchmarker/pkb.py",> line 719, in RunBenchmark
DoRunPhase(spec, collector, detailed_timer)
File "<https://builds.apache.org/job/beam_PerformanceTests_JDBC/ws/PerfKitBenchmarker/perfkitbenchmarker/pkb.py",> line 580, in DoRunPhase
samples = spec.BenchmarkRun(spec)
File "<https://builds.apache.org/job/beam_PerformanceTests_JDBC/ws/PerfKitBenchmarker/perfkitbenchmarker/linux_benchmarks/beam_integration_benchmark.py",> line 160, in Run
job_type=job_type)
File "<https://builds.apache.org/job/beam_PerformanceTests_JDBC/ws/PerfKitBenchmarker/perfkitbenchmarker/providers/gcp/gcp_dpb_dataflow.py",> line 90, in SubmitJob
assert retcode == 0, "Integration Test Failed."
AssertionError: Integration Test Failed.
2018-10-31 12:18:20,831 9dc7e3c9 MainThread beam_integration_benchmark(1/1) ERROR Benchmark 1/1 beam_integration_benchmark (UID: beam_integration_benchmark0) failed. Execution will continue.
2018-10-31 12:18:20,871 9dc7e3c9 MainThread INFO Benchmark run statuses:
---------------------------------------------------------------------------------
Name UID Status Failed Substatus
---------------------------------------------------------------------------------
beam_integration_benchmark beam_integration_benchmark0 FAILED
---------------------------------------------------------------------------------
Success rate: 0.00% (0/1)
2018-10-31 12:18:20,872 9dc7e3c9 MainThread INFO Complete logs can be found at: <https://builds.apache.org/job/beam_PerformanceTests_JDBC/ws/runs/9dc7e3c9/pkb.log>
2018-10-31 12:18:20,872 9dc7e3c9 MainThread INFO Completion statuses can be found at: <https://builds.apache.org/job/beam_PerformanceTests_JDBC/ws/runs/9dc7e3c9/completion_statuses.json>
Build step 'Execute shell' marked build as failure
---------------------------------------------------------------------
To unsubscribe, e-mail: builds-unsubscribe@beam.apache.org
For additional commands, e-mail: builds-help@beam.apache.org
Build failed in Jenkins: beam_PerformanceTests_JDBC #1278
Posted by Apache Jenkins Server <je...@builds.apache.org>.
See <https://builds.apache.org/job/beam_PerformanceTests_JDBC/1278/display/redirect>
------------------------------------------
[...truncated 258.77 KB...]
... 21 more
Caused by: java.io.InvalidClassException: org.apache.beam.sdk.values.WindowingStrategy; local class incompatible: stream classdesc serialVersionUID = -6607512772692666907, local class serialVersionUID = -3616600070988263902
at java.io.ObjectStreamClass.initNonProxy(ObjectStreamClass.java:616)
at java.io.ObjectInputStream.readNonProxyDesc(ObjectInputStream.java:1630)
at java.io.ObjectInputStream.readClassDesc(ObjectInputStream.java:1521)
at java.io.ObjectInputStream.readOrdinaryObject(ObjectInputStream.java:1781)
at java.io.ObjectInputStream.readObject0(ObjectInputStream.java:1353)
at java.io.ObjectInputStream.defaultReadFields(ObjectInputStream.java:2018)
at java.io.ObjectInputStream.readSerialData(ObjectInputStream.java:1942)
at java.io.ObjectInputStream.readOrdinaryObject(ObjectInputStream.java:1808)
at java.io.ObjectInputStream.readObject0(ObjectInputStream.java:1353)
at java.io.ObjectInputStream.readObject(ObjectInputStream.java:373)
at org.apache.beam.sdk.util.SerializableUtils.deserializeFromByteArray(SerializableUtils.java:71)
... 28 more
java.lang.RuntimeException: com.google.cloud.dataflow.worker.repackaged.com.google.common.util.concurrent.UncheckedExecutionException: java.lang.IllegalArgumentException: unable to deserialize Serialized DoFnInfo
at com.google.cloud.dataflow.worker.IntrinsicMapTaskExecutorFactory$1.typedApply(IntrinsicMapTaskExecutorFactory.java:192)
at com.google.cloud.dataflow.worker.IntrinsicMapTaskExecutorFactory$1.typedApply(IntrinsicMapTaskExecutorFactory.java:163)
at com.google.cloud.dataflow.worker.graph.Networks$TypeSafeNodeFunction.apply(Networks.java:63)
at com.google.cloud.dataflow.worker.graph.Networks$TypeSafeNodeFunction.apply(Networks.java:50)
at com.google.cloud.dataflow.worker.graph.Networks.replaceDirectedNetworkNodes(Networks.java:87)
at com.google.cloud.dataflow.worker.IntrinsicMapTaskExecutorFactory.create(IntrinsicMapTaskExecutorFactory.java:123)
at com.google.cloud.dataflow.worker.BatchDataflowWorker.doWork(BatchDataflowWorker.java:336)
at com.google.cloud.dataflow.worker.BatchDataflowWorker.getAndPerformWork(BatchDataflowWorker.java:290)
at com.google.cloud.dataflow.worker.DataflowBatchWorkerHarness$WorkerThread.doWork(DataflowBatchWorkerHarness.java:134)
at com.google.cloud.dataflow.worker.DataflowBatchWorkerHarness$WorkerThread.call(DataflowBatchWorkerHarness.java:114)
at com.google.cloud.dataflow.worker.DataflowBatchWorkerHarness$WorkerThread.call(DataflowBatchWorkerHarness.java:101)
at java.util.concurrent.FutureTask.run(FutureTask.java:266)
at java.util.concurrent.ThreadPoolExecutor.runWorker(ThreadPoolExecutor.java:1142)
at java.util.concurrent.ThreadPoolExecutor$Worker.run(ThreadPoolExecutor.java:617)
at java.lang.Thread.run(Thread.java:745)
Caused by: com.google.cloud.dataflow.worker.repackaged.com.google.common.util.concurrent.UncheckedExecutionException: java.lang.IllegalArgumentException: unable to deserialize Serialized DoFnInfo
at com.google.cloud.dataflow.worker.repackaged.com.google.common.cache.LocalCache$Segment.get(LocalCache.java:2214)
at com.google.cloud.dataflow.worker.repackaged.com.google.common.cache.LocalCache.get(LocalCache.java:4053)
at com.google.cloud.dataflow.worker.repackaged.com.google.common.cache.LocalCache$LocalManualCache.get(LocalCache.java:4899)
at com.google.cloud.dataflow.worker.UserParDoFnFactory.create(UserParDoFnFactory.java:90)
at com.google.cloud.dataflow.worker.DefaultParDoFnFactory.create(DefaultParDoFnFactory.java:74)
at com.google.cloud.dataflow.worker.IntrinsicMapTaskExecutorFactory.createParDoOperation(IntrinsicMapTaskExecutorFactory.java:262)
at com.google.cloud.dataflow.worker.IntrinsicMapTaskExecutorFactory.access$000(IntrinsicMapTaskExecutorFactory.java:84)
at com.google.cloud.dataflow.worker.IntrinsicMapTaskExecutorFactory$1.typedApply(IntrinsicMapTaskExecutorFactory.java:181)
... 14 more
Caused by: java.lang.IllegalArgumentException: unable to deserialize Serialized DoFnInfo
at org.apache.beam.sdk.util.SerializableUtils.deserializeFromByteArray(SerializableUtils.java:74)
at com.google.cloud.dataflow.worker.UserParDoFnFactory$UserDoFnExtractor.getDoFnInfo(UserParDoFnFactory.java:61)
at com.google.cloud.dataflow.worker.UserParDoFnFactory.lambda$create$0(UserParDoFnFactory.java:92)
at com.google.cloud.dataflow.worker.repackaged.com.google.common.cache.LocalCache$LocalManualCache$1.load(LocalCache.java:4904)
at com.google.cloud.dataflow.worker.repackaged.com.google.common.cache.LocalCache$LoadingValueReference.loadFuture(LocalCache.java:3628)
at com.google.cloud.dataflow.worker.repackaged.com.google.common.cache.LocalCache$Segment.loadSync(LocalCache.java:2336)
at com.google.cloud.dataflow.worker.repackaged.com.google.common.cache.LocalCache$Segment.lockedGetOrLoad(LocalCache.java:2295)
at com.google.cloud.dataflow.worker.repackaged.com.google.common.cache.LocalCache$Segment.get(LocalCache.java:2208)
... 21 more
Caused by: java.io.InvalidClassException: org.apache.beam.sdk.values.WindowingStrategy; local class incompatible: stream classdesc serialVersionUID = -6607512772692666907, local class serialVersionUID = -3616600070988263902
at java.io.ObjectStreamClass.initNonProxy(ObjectStreamClass.java:616)
at java.io.ObjectInputStream.readNonProxyDesc(ObjectInputStream.java:1630)
at java.io.ObjectInputStream.readClassDesc(ObjectInputStream.java:1521)
at java.io.ObjectInputStream.readOrdinaryObject(ObjectInputStream.java:1781)
at java.io.ObjectInputStream.readObject0(ObjectInputStream.java:1353)
at java.io.ObjectInputStream.defaultReadFields(ObjectInputStream.java:2018)
at java.io.ObjectInputStream.readSerialData(ObjectInputStream.java:1942)
at java.io.ObjectInputStream.readOrdinaryObject(ObjectInputStream.java:1808)
at java.io.ObjectInputStream.readObject0(ObjectInputStream.java:1353)
at java.io.ObjectInputStream.readObject(ObjectInputStream.java:373)
at org.apache.beam.sdk.util.SerializableUtils.deserializeFromByteArray(SerializableUtils.java:71)
... 28 more
java.lang.RuntimeException: com.google.cloud.dataflow.worker.repackaged.com.google.common.util.concurrent.UncheckedExecutionException: java.lang.IllegalArgumentException: unable to deserialize Serialized DoFnInfo
at com.google.cloud.dataflow.worker.IntrinsicMapTaskExecutorFactory$1.typedApply(IntrinsicMapTaskExecutorFactory.java:192)
at com.google.cloud.dataflow.worker.IntrinsicMapTaskExecutorFactory$1.typedApply(IntrinsicMapTaskExecutorFactory.java:163)
at com.google.cloud.dataflow.worker.graph.Networks$TypeSafeNodeFunction.apply(Networks.java:63)
at com.google.cloud.dataflow.worker.graph.Networks$TypeSafeNodeFunction.apply(Networks.java:50)
at com.google.cloud.dataflow.worker.graph.Networks.replaceDirectedNetworkNodes(Networks.java:87)
at com.google.cloud.dataflow.worker.IntrinsicMapTaskExecutorFactory.create(IntrinsicMapTaskExecutorFactory.java:123)
at com.google.cloud.dataflow.worker.BatchDataflowWorker.doWork(BatchDataflowWorker.java:336)
at com.google.cloud.dataflow.worker.BatchDataflowWorker.getAndPerformWork(BatchDataflowWorker.java:290)
at com.google.cloud.dataflow.worker.DataflowBatchWorkerHarness$WorkerThread.doWork(DataflowBatchWorkerHarness.java:134)
at com.google.cloud.dataflow.worker.DataflowBatchWorkerHarness$WorkerThread.call(DataflowBatchWorkerHarness.java:114)
at com.google.cloud.dataflow.worker.DataflowBatchWorkerHarness$WorkerThread.call(DataflowBatchWorkerHarness.java:101)
at java.util.concurrent.FutureTask.run(FutureTask.java:266)
at java.util.concurrent.ThreadPoolExecutor.runWorker(ThreadPoolExecutor.java:1142)
at java.util.concurrent.ThreadPoolExecutor$Worker.run(ThreadPoolExecutor.java:617)
at java.lang.Thread.run(Thread.java:745)
Caused by: com.google.cloud.dataflow.worker.repackaged.com.google.common.util.concurrent.UncheckedExecutionException: java.lang.IllegalArgumentException: unable to deserialize Serialized DoFnInfo
at com.google.cloud.dataflow.worker.repackaged.com.google.common.cache.LocalCache$Segment.get(LocalCache.java:2214)
at com.google.cloud.dataflow.worker.repackaged.com.google.common.cache.LocalCache.get(LocalCache.java:4053)
at com.google.cloud.dataflow.worker.repackaged.com.google.common.cache.LocalCache$LocalManualCache.get(LocalCache.java:4899)
at com.google.cloud.dataflow.worker.UserParDoFnFactory.create(UserParDoFnFactory.java:90)
at com.google.cloud.dataflow.worker.DefaultParDoFnFactory.create(DefaultParDoFnFactory.java:74)
at com.google.cloud.dataflow.worker.IntrinsicMapTaskExecutorFactory.createParDoOperation(IntrinsicMapTaskExecutorFactory.java:262)
at com.google.cloud.dataflow.worker.IntrinsicMapTaskExecutorFactory.access$000(IntrinsicMapTaskExecutorFactory.java:84)
at com.google.cloud.dataflow.worker.IntrinsicMapTaskExecutorFactory$1.typedApply(IntrinsicMapTaskExecutorFactory.java:181)
... 14 more
Caused by: java.lang.IllegalArgumentException: unable to deserialize Serialized DoFnInfo
at org.apache.beam.sdk.util.SerializableUtils.deserializeFromByteArray(SerializableUtils.java:74)
at com.google.cloud.dataflow.worker.UserParDoFnFactory$UserDoFnExtractor.getDoFnInfo(UserParDoFnFactory.java:61)
at com.google.cloud.dataflow.worker.UserParDoFnFactory.lambda$create$0(UserParDoFnFactory.java:92)
at com.google.cloud.dataflow.worker.repackaged.com.google.common.cache.LocalCache$LocalManualCache$1.load(LocalCache.java:4904)
at com.google.cloud.dataflow.worker.repackaged.com.google.common.cache.LocalCache$LoadingValueReference.loadFuture(LocalCache.java:3628)
at com.google.cloud.dataflow.worker.repackaged.com.google.common.cache.LocalCache$Segment.loadSync(LocalCache.java:2336)
at com.google.cloud.dataflow.worker.repackaged.com.google.common.cache.LocalCache$Segment.lockedGetOrLoad(LocalCache.java:2295)
at com.google.cloud.dataflow.worker.repackaged.com.google.common.cache.LocalCache$Segment.get(LocalCache.java:2208)
... 21 more
Caused by: java.io.InvalidClassException: org.apache.beam.sdk.values.WindowingStrategy; local class incompatible: stream classdesc serialVersionUID = -6607512772692666907, local class serialVersionUID = -3616600070988263902
at java.io.ObjectStreamClass.initNonProxy(ObjectStreamClass.java:616)
at java.io.ObjectInputStream.readNonProxyDesc(ObjectInputStream.java:1630)
at java.io.ObjectInputStream.readClassDesc(ObjectInputStream.java:1521)
at java.io.ObjectInputStream.readOrdinaryObject(ObjectInputStream.java:1781)
at java.io.ObjectInputStream.readObject0(ObjectInputStream.java:1353)
at java.io.ObjectInputStream.defaultReadFields(ObjectInputStream.java:2018)
at java.io.ObjectInputStream.readSerialData(ObjectInputStream.java:1942)
at java.io.ObjectInputStream.readOrdinaryObject(ObjectInputStream.java:1808)
at java.io.ObjectInputStream.readObject0(ObjectInputStream.java:1353)
at java.io.ObjectInputStream.readObject(ObjectInputStream.java:373)
at org.apache.beam.sdk.util.SerializableUtils.deserializeFromByteArray(SerializableUtils.java:71)
... 28 more
Workflow failed. Causes: S01:GenerateSequence/Read(BoundedCountingSource)+ParDo(DeterministicallyConstructTestRow)+JdbcIO.Write/ParDo(Write) failed., A work item was attempted 4 times without success. Each time the worker eventually lost contact with the service. The work item was attempted on:
jdbcioit0testwritethenrea-10302313-avcj-harness-m1ld,
jdbcioit0testwritethenrea-10302313-avcj-harness-m1ld,
jdbcioit0testwritethenrea-10302313-avcj-harness-m1ld,
jdbcioit0testwritethenrea-10302313-avcj-harness-m1ld
at org.apache.beam.runners.dataflow.TestDataflowRunner.run(TestDataflowRunner.java:134)
at org.apache.beam.runners.dataflow.TestDataflowRunner.run(TestDataflowRunner.java:90)
at org.apache.beam.runners.dataflow.TestDataflowRunner.run(TestDataflowRunner.java:55)
at org.apache.beam.sdk.Pipeline.run(Pipeline.java:313)
at org.apache.beam.sdk.testing.TestPipeline.run(TestPipeline.java:350)
at org.apache.beam.sdk.testing.TestPipeline.run(TestPipeline.java:331)
at org.apache.beam.sdk.io.jdbc.JdbcIOIT.runWrite(JdbcIOIT.java:125)
at org.apache.beam.sdk.io.jdbc.JdbcIOIT.testWriteThenRead(JdbcIOIT.java:103)
Finished generating test XML results (0.024 secs) into: <https://builds.apache.org/job/beam_PerformanceTests_JDBC/ws/src/sdks/java/io/jdbc/build/test-results/integrationTest>
Generating HTML test report...
Finished generating test html results (0.03 secs) into: <https://builds.apache.org/job/beam_PerformanceTests_JDBC/ws/src/sdks/java/io/jdbc/build/reports/tests/integrationTest>
:beam-sdks-java-io-jdbc:integrationTest (Thread[Task worker for ':' Thread 9,5,main]) completed. Took 5 mins 5.252 secs.
Deprecated Gradle features were used in this build, making it incompatible with Gradle 5.0.
Use '--warning-mode all' to show the individual deprecation warnings.
See https://docs.gradle.org/4.10.2/userguide/command_line_interface.html#sec:command_line_warnings
66 actionable tasks: 14 executed, 52 up-to-date
Publishing build scan...
https://gradle.com/s/do3hc3axekyr4
STDERR:
1 test completed, 1 failed
FAILURE: Build failed with an exception.
* What went wrong:
Execution failed for task ':beam-sdks-java-io-jdbc:integrationTest'.
> There were failing tests. See the report at: file://<https://builds.apache.org/job/beam_PerformanceTests_JDBC/ws/src/sdks/java/io/jdbc/build/reports/tests/integrationTest/index.html>
* Try:
Run with --debug option to get more log output. Run with --scan to get full insights.
* Exception is:
org.gradle.api.tasks.TaskExecutionException: Execution failed for task ':beam-sdks-java-io-jdbc:integrationTest'.
at org.gradle.api.internal.tasks.execution.ExecuteActionsTaskExecuter.executeActions(ExecuteActionsTaskExecuter.java:110)
at org.gradle.api.internal.tasks.execution.ExecuteActionsTaskExecuter.execute(ExecuteActionsTaskExecuter.java:77)
at org.gradle.api.internal.tasks.execution.OutputDirectoryCreatingTaskExecuter.execute(OutputDirectoryCreatingTaskExecuter.java:51)
at org.gradle.api.internal.tasks.execution.SkipCachedTaskExecuter.execute(SkipCachedTaskExecuter.java:105)
at org.gradle.api.internal.tasks.execution.SkipUpToDateTaskExecuter.execute(SkipUpToDateTaskExecuter.java:59)
at org.gradle.api.internal.tasks.execution.ResolveTaskOutputCachingStateExecuter.execute(ResolveTaskOutputCachingStateExecuter.java:54)
at org.gradle.api.internal.tasks.execution.ResolveBuildCacheKeyExecuter.execute(ResolveBuildCacheKeyExecuter.java:79)
at org.gradle.api.internal.tasks.execution.ValidatingTaskExecuter.execute(ValidatingTaskExecuter.java:59)
at org.gradle.api.internal.tasks.execution.SkipEmptySourceFilesTaskExecuter.execute(SkipEmptySourceFilesTaskExecuter.java:101)
at org.gradle.api.internal.tasks.execution.FinalizeInputFilePropertiesTaskExecuter.execute(FinalizeInputFilePropertiesTaskExecuter.java:44)
at org.gradle.api.internal.tasks.execution.CleanupStaleOutputsExecuter.execute(CleanupStaleOutputsExecuter.java:91)
at org.gradle.api.internal.tasks.execution.ResolveTaskArtifactStateTaskExecuter.execute(ResolveTaskArtifactStateTaskExecuter.java:62)
at org.gradle.api.internal.tasks.execution.SkipTaskWithNoActionsExecuter.execute(SkipTaskWithNoActionsExecuter.java:59)
at org.gradle.api.internal.tasks.execution.SkipOnlyIfTaskExecuter.execute(SkipOnlyIfTaskExecuter.java:54)
at org.gradle.api.internal.tasks.execution.ExecuteAtMostOnceTaskExecuter.execute(ExecuteAtMostOnceTaskExecuter.java:43)
at org.gradle.api.internal.tasks.execution.CatchExceptionTaskExecuter.execute(CatchExceptionTaskExecuter.java:34)
at org.gradle.api.internal.tasks.execution.EventFiringTaskExecuter$1.run(EventFiringTaskExecuter.java:51)
at org.gradle.internal.operations.DefaultBuildOperationExecutor$RunnableBuildOperationWorker.execute(DefaultBuildOperationExecutor.java:300)
at org.gradle.internal.operations.DefaultBuildOperationExecutor$RunnableBuildOperationWorker.execute(DefaultBuildOperationExecutor.java:292)
at org.gradle.internal.operations.DefaultBuildOperationExecutor.execute(DefaultBuildOperationExecutor.java:174)
at org.gradle.internal.operations.DefaultBuildOperationExecutor.run(DefaultBuildOperationExecutor.java:90)
at org.gradle.internal.operations.DelegatingBuildOperationExecutor.run(DelegatingBuildOperationExecutor.java:31)
at org.gradle.api.internal.tasks.execution.EventFiringTaskExecuter.execute(EventFiringTaskExecuter.java:46)
at org.gradle.execution.taskgraph.LocalTaskInfoExecutor.execute(LocalTaskInfoExecutor.java:42)
at org.gradle.execution.taskgraph.DefaultTaskExecutionGraph$BuildOperationAwareWorkItemExecutor.execute(DefaultTaskExecutionGraph.java:277)
at org.gradle.execution.taskgraph.DefaultTaskExecutionGraph$BuildOperationAwareWorkItemExecutor.execute(DefaultTaskExecutionGraph.java:262)
at org.gradle.execution.taskgraph.DefaultTaskPlanExecutor$ExecutorWorker$1.execute(DefaultTaskPlanExecutor.java:135)
at org.gradle.execution.taskgraph.DefaultTaskPlanExecutor$ExecutorWorker$1.execute(DefaultTaskPlanExecutor.java:130)
at org.gradle.execution.taskgraph.DefaultTaskPlanExecutor$ExecutorWorker.execute(DefaultTaskPlanExecutor.java:200)
at org.gradle.execution.taskgraph.DefaultTaskPlanExecutor$ExecutorWorker.executeWithWork(DefaultTaskPlanExecutor.java:191)
at org.gradle.execution.taskgraph.DefaultTaskPlanExecutor$ExecutorWorker.run(DefaultTaskPlanExecutor.java:130)
at org.gradle.internal.concurrent.ExecutorPolicy$CatchAndRecordFailures.onExecute(ExecutorPolicy.java:63)
at org.gradle.internal.concurrent.ManagedExecutorImpl$1.run(ManagedExecutorImpl.java:46)
at org.gradle.internal.concurrent.ThreadFactoryImpl$ManagedThreadRunnable.run(ThreadFactoryImpl.java:55)
Caused by: org.gradle.api.GradleException: There were failing tests. See the report at: file://<https://builds.apache.org/job/beam_PerformanceTests_JDBC/ws/src/sdks/java/io/jdbc/build/reports/tests/integrationTest/index.html>
at org.gradle.api.tasks.testing.AbstractTestTask.handleTestFailures(AbstractTestTask.java:612)
at org.gradle.api.tasks.testing.AbstractTestTask.executeTests(AbstractTestTask.java:484)
at org.gradle.api.tasks.testing.Test.executeTests(Test.java:603)
at org.gradle.internal.reflect.JavaMethod.invoke(JavaMethod.java:73)
at org.gradle.api.internal.project.taskfactory.StandardTaskAction.doExecute(StandardTaskAction.java:46)
at org.gradle.api.internal.project.taskfactory.StandardTaskAction.execute(StandardTaskAction.java:39)
at org.gradle.api.internal.project.taskfactory.StandardTaskAction.execute(StandardTaskAction.java:26)
at org.gradle.api.internal.AbstractTask$TaskActionWrapper.execute(AbstractTask.java:801)
at org.gradle.api.internal.AbstractTask$TaskActionWrapper.execute(AbstractTask.java:768)
at org.gradle.api.internal.tasks.execution.ExecuteActionsTaskExecuter$1.run(ExecuteActionsTaskExecuter.java:131)
at org.gradle.internal.operations.DefaultBuildOperationExecutor$RunnableBuildOperationWorker.execute(DefaultBuildOperationExecutor.java:300)
at org.gradle.internal.operations.DefaultBuildOperationExecutor$RunnableBuildOperationWorker.execute(DefaultBuildOperationExecutor.java:292)
at org.gradle.internal.operations.DefaultBuildOperationExecutor.execute(DefaultBuildOperationExecutor.java:174)
at org.gradle.internal.operations.DefaultBuildOperationExecutor.run(DefaultBuildOperationExecutor.java:90)
at org.gradle.internal.operations.DelegatingBuildOperationExecutor.run(DelegatingBuildOperationExecutor.java:31)
at org.gradle.api.internal.tasks.execution.ExecuteActionsTaskExecuter.executeAction(ExecuteActionsTaskExecuter.java:120)
at org.gradle.api.internal.tasks.execution.ExecuteActionsTaskExecuter.executeActions(ExecuteActionsTaskExecuter.java:99)
... 33 more
* Get more help at https://help.gradle.org
BUILD FAILED in 6m 28s
2018-10-31 06:18:32,169 9e5bbccb MainThread beam_integration_benchmark(1/1) ERROR Error during benchmark beam_integration_benchmark
Traceback (most recent call last):
File "<https://builds.apache.org/job/beam_PerformanceTests_JDBC/ws/PerfKitBenchmarker/perfkitbenchmarker/pkb.py",> line 719, in RunBenchmark
DoRunPhase(spec, collector, detailed_timer)
File "<https://builds.apache.org/job/beam_PerformanceTests_JDBC/ws/PerfKitBenchmarker/perfkitbenchmarker/pkb.py",> line 580, in DoRunPhase
samples = spec.BenchmarkRun(spec)
File "<https://builds.apache.org/job/beam_PerformanceTests_JDBC/ws/PerfKitBenchmarker/perfkitbenchmarker/linux_benchmarks/beam_integration_benchmark.py",> line 160, in Run
job_type=job_type)
File "<https://builds.apache.org/job/beam_PerformanceTests_JDBC/ws/PerfKitBenchmarker/perfkitbenchmarker/providers/gcp/gcp_dpb_dataflow.py",> line 90, in SubmitJob
assert retcode == 0, "Integration Test Failed."
AssertionError: Integration Test Failed.
2018-10-31 06:18:32,170 9e5bbccb MainThread beam_integration_benchmark(1/1) INFO Cleaning up benchmark beam_integration_benchmark
2018-10-31 06:18:32,171 9e5bbccb MainThread beam_integration_benchmark(1/1) INFO Running: kubectl --kubeconfig=<https://builds.apache.org/job/beam_PerformanceTests_JDBC/ws/config-beam-performancetests-jdbc-1278> delete -f <https://builds.apache.org/job/beam_PerformanceTests_JDBC/ws/src/.test-infra/kubernetes/postgres/postgres-service-for-local-dev.yml> --ignore-not-found
2018-10-31 06:18:32,942 9e5bbccb MainThread beam_integration_benchmark(1/1) ERROR Exception running benchmark
Traceback (most recent call last):
File "<https://builds.apache.org/job/beam_PerformanceTests_JDBC/ws/PerfKitBenchmarker/perfkitbenchmarker/pkb.py",> line 860, in RunBenchmarkTask
RunBenchmark(spec, collector)
File "<https://builds.apache.org/job/beam_PerformanceTests_JDBC/ws/PerfKitBenchmarker/perfkitbenchmarker/pkb.py",> line 719, in RunBenchmark
DoRunPhase(spec, collector, detailed_timer)
File "<https://builds.apache.org/job/beam_PerformanceTests_JDBC/ws/PerfKitBenchmarker/perfkitbenchmarker/pkb.py",> line 580, in DoRunPhase
samples = spec.BenchmarkRun(spec)
File "<https://builds.apache.org/job/beam_PerformanceTests_JDBC/ws/PerfKitBenchmarker/perfkitbenchmarker/linux_benchmarks/beam_integration_benchmark.py",> line 160, in Run
job_type=job_type)
File "<https://builds.apache.org/job/beam_PerformanceTests_JDBC/ws/PerfKitBenchmarker/perfkitbenchmarker/providers/gcp/gcp_dpb_dataflow.py",> line 90, in SubmitJob
assert retcode == 0, "Integration Test Failed."
AssertionError: Integration Test Failed.
2018-10-31 06:18:32,943 9e5bbccb MainThread beam_integration_benchmark(1/1) ERROR Benchmark 1/1 beam_integration_benchmark (UID: beam_integration_benchmark0) failed. Execution will continue.
2018-10-31 06:18:32,979 9e5bbccb MainThread INFO Benchmark run statuses:
---------------------------------------------------------------------------------
Name UID Status Failed Substatus
---------------------------------------------------------------------------------
beam_integration_benchmark beam_integration_benchmark0 FAILED
---------------------------------------------------------------------------------
Success rate: 0.00% (0/1)
2018-10-31 06:18:32,980 9e5bbccb MainThread INFO Complete logs can be found at: <https://builds.apache.org/job/beam_PerformanceTests_JDBC/ws/runs/9e5bbccb/pkb.log>
2018-10-31 06:18:32,980 9e5bbccb MainThread INFO Completion statuses can be found at: <https://builds.apache.org/job/beam_PerformanceTests_JDBC/ws/runs/9e5bbccb/completion_statuses.json>
Build step 'Execute shell' marked build as failure
---------------------------------------------------------------------
To unsubscribe, e-mail: builds-unsubscribe@beam.apache.org
For additional commands, e-mail: builds-help@beam.apache.org