You are viewing a plain text version of this content. The canonical link for it is here.
Posted to dev@zookeeper.apache.org by Apache Jenkins Server <je...@builds.apache.org> on 2015/07/09 12:37:45 UTC
ZooKeeper-trunk - Build # 2748 - Failure
See https://builds.apache.org/job/ZooKeeper-trunk/2748/
###################################################################################
########################## LAST 60 LINES OF THE CONSOLE ###########################
[...truncated 373875 lines...]
[junit] 2015-07-09 10:37:42,302 [myid:] - INFO [QuorumPeer[myid=5](plain=/0:0:0:0:0:0:0:0:30211)(secure=disabled):MBeanRegistry@119] - Unregister MBean [org.apache.ZooKeeperService:name0=ReplicatedServer_id5,name1=replica.5,name2=LeaderElection]
[junit] 2015-07-09 10:37:42,302 [myid:] - WARN [QuorumPeer[myid=5](plain=/0:0:0:0:0:0:0:0:30211)(secure=disabled):QuorumPeer@1042] - Unexpected exception
[junit] java.lang.InterruptedException
[junit] at java.util.concurrent.locks.AbstractQueuedSynchronizer$ConditionObject.reportInterruptAfterWait(AbstractQueuedSynchronizer.java:2017)
[junit] at java.util.concurrent.locks.AbstractQueuedSynchronizer$ConditionObject.awaitNanos(AbstractQueuedSynchronizer.java:2095)
[junit] at java.util.concurrent.LinkedBlockingQueue.poll(LinkedBlockingQueue.java:467)
[junit] at org.apache.zookeeper.server.quorum.FastLeaderElection.lookForLeader(FastLeaderElection.java:908)
[junit] at org.apache.zookeeper.server.quorum.QuorumPeer.run(QuorumPeer.java:1040)
[junit] 2015-07-09 10:37:42,303 [myid:] - WARN [QuorumPeer[myid=5](plain=/0:0:0:0:0:0:0:0:30211)(secure=disabled):QuorumPeer@1093] - QuorumPeer main thread exited
[junit] 2015-07-09 10:37:42,303 [myid:] - INFO [/127.0.0.1:30213:QuorumCnxManager$Listener@659] - Leaving listener
[junit] 2015-07-09 10:37:42,303 [myid:] - INFO [QuorumPeer[myid=5](plain=/0:0:0:0:0:0:0:0:30211)(secure=disabled):MBeanRegistry@119] - Unregister MBean [org.apache.ZooKeeperService:name0=ReplicatedServer_id5]
[junit] 2015-07-09 10:37:42,304 [myid:] - INFO [main:QuorumUtil@254] - Shutting down leader election QuorumPeer[myid=5](plain=/0:0:0:0:0:0:0:0:30211)(secure=disabled)
[junit] 2015-07-09 10:37:42,304 [myid:] - INFO [QuorumPeer[myid=5](plain=/0:0:0:0:0:0:0:0:30211)(secure=disabled):MBeanRegistry@119] - Unregister MBean [org.apache.ZooKeeperService:name0=ReplicatedServer_id5,name1=replica.5]
[junit] 2015-07-09 10:37:42,304 [myid:] - INFO [main:QuorumUtil@259] - Waiting for QuorumPeer[myid=5](plain=/0:0:0:0:0:0:0:0:30211)(secure=disabled) to exit thread
[junit] 2015-07-09 10:37:42,304 [myid:] - INFO [QuorumPeer[myid=5](plain=/0:0:0:0:0:0:0:0:30211)(secure=disabled):MBeanRegistry@119] - Unregister MBean [org.apache.ZooKeeperService:name0=ReplicatedServer_id5,name1=replica.1]
[junit] 2015-07-09 10:37:42,304 [myid:] - INFO [QuorumPeer[myid=5](plain=/0:0:0:0:0:0:0:0:30211)(secure=disabled):MBeanRegistry@119] - Unregister MBean [org.apache.ZooKeeperService:name0=ReplicatedServer_id5,name1=replica.2]
[junit] 2015-07-09 10:37:42,304 [myid:] - INFO [QuorumPeer[myid=5](plain=/0:0:0:0:0:0:0:0:30211)(secure=disabled):MBeanRegistry@119] - Unregister MBean [org.apache.ZooKeeperService:name0=ReplicatedServer_id5,name1=replica.3]
[junit] 2015-07-09 10:37:42,304 [myid:] - INFO [main:FourLetterWordMain@84] - connecting to 127.0.0.1 30199
[junit] 2015-07-09 10:37:42,305 [myid:] - INFO [main:QuorumUtil@243] - 127.0.0.1:30199 is no longer accepting client connections
[junit] 2015-07-09 10:37:42,305 [myid:] - INFO [main:FourLetterWordMain@84] - connecting to 127.0.0.1 30202
[junit] 2015-07-09 10:37:42,305 [myid:] - INFO [main:QuorumUtil@243] - 127.0.0.1:30202 is no longer accepting client connections
[junit] 2015-07-09 10:37:42,305 [myid:] - INFO [main:FourLetterWordMain@84] - connecting to 127.0.0.1 30205
[junit] 2015-07-09 10:37:42,306 [myid:] - INFO [main:QuorumUtil@243] - 127.0.0.1:30205 is no longer accepting client connections
[junit] 2015-07-09 10:37:42,306 [myid:] - INFO [main:FourLetterWordMain@84] - connecting to 127.0.0.1 30208
[junit] 2015-07-09 10:37:42,306 [myid:] - INFO [main:QuorumUtil@243] - 127.0.0.1:30208 is no longer accepting client connections
[junit] 2015-07-09 10:37:42,306 [myid:] - INFO [main:FourLetterWordMain@84] - connecting to 127.0.0.1 30211
[junit] 2015-07-09 10:37:42,307 [myid:] - INFO [main:QuorumUtil@243] - 127.0.0.1:30211 is no longer accepting client connections
[junit] 2015-07-09 10:37:42,308 [myid:] - INFO [main:ZKTestCase$1@65] - SUCCEEDED testRemoveOneAsynchronous
[junit] 2015-07-09 10:37:42,308 [myid:] - INFO [main:ZKTestCase$1@60] - FINISHED testRemoveOneAsynchronous
[junit] Tests run: 11, Failures: 1, Errors: 0, Skipped: 0, Time elapsed: 105.857 sec, Thread: 8, Class: org.apache.zookeeper.test.ReconfigTest
[junit] 2015-07-09 10:37:42,351 [myid:] - INFO [WorkerReceiver[myid=4]:FastLeaderElection$Messenger$WorkerReceiver@440] - WorkerReceiver is down
[junit] 2015-07-09 10:37:42,352 [myid:] - INFO [WorkerSender[myid=3]:FastLeaderElection$Messenger$WorkerSender@470] - WorkerSender is down
[junit] 2015-07-09 10:37:42,352 [myid:] - INFO [WorkerReceiver[myid=3]:FastLeaderElection$Messenger$WorkerReceiver@440] - WorkerReceiver is down
[junit] 2015-07-09 10:37:42,355 [myid:] - INFO [WorkerSender[myid=1]:FastLeaderElection$Messenger$WorkerSender@470] - WorkerSender is down
[junit] 2015-07-09 10:37:42,355 [myid:] - INFO [WorkerReceiver[myid=1]:FastLeaderElection$Messenger$WorkerReceiver@440] - WorkerReceiver is down
[junit] 2015-07-09 10:37:42,360 [myid:] - INFO [WorkerSender[myid=2]:FastLeaderElection$Messenger$WorkerSender@470] - WorkerSender is down
[junit] 2015-07-09 10:37:42,361 [myid:] - INFO [WorkerReceiver[myid=2]:FastLeaderElection$Messenger$WorkerReceiver@440] - WorkerReceiver is down
[junit] Test org.apache.zookeeper.test.ReconfigTest FAILED
BUILD FAILED
/home/jenkins/jenkins-slave/workspace/ZooKeeper-trunk/trunk/build.xml:1490: The following error occurred while executing this line:
/home/jenkins/jenkins-slave/workspace/ZooKeeper-trunk/trunk/build.xml:1375: Tests failed!
Total time: 5 minutes 45 seconds
Build step 'Execute shell' marked build as failure
[FINDBUGS] Skipping publisher since build result is FAILURE
[WARNINGS] Skipping publisher since build result is FAILURE
Archiving artifacts
Sending artifact delta relative to ZooKeeper-trunk #2747
Archived 3 artifacts
Archive block size is 32768
Received 2 blocks and 18199354 bytes
Compression is 0.4%
Took 6.1 sec
Recording fingerprints
Recording test results
Publishing Javadoc
Email was triggered for: Failure
Sending email for trigger: Failure
###################################################################################
############################## FAILED TESTS (if any) ##############################
1 tests failed.
REGRESSION: org.apache.zookeeper.test.ReconfigTest.testPortChange
Error Message:
expected:<test[1]> but was:<test[0]>
Stack Trace:
junit.framework.AssertionFailedError: expected:<test[1]> but was:<test[0]>
at org.apache.zookeeper.test.ReconfigTest.testNormalOperation(ReconfigTest.java:150)
at org.apache.zookeeper.test.ReconfigTest.testPortChange(ReconfigTest.java:598)
at org.apache.zookeeper.JUnit4ZKTestRunner$LoggedInvokeMethod.evaluate(JUnit4ZKTestRunner.java:79)