You are viewing a plain text version of this content. The canonical link for it is here.
Posted to c-user@axis.apache.org by Shiraz Muthalif <sh...@opensource.lk> on 2004/07/28 11:40:20 UTC
Current CVS chechout does not compile
Hi All,
I tried compiling the current CVS checkout and got the following error
message(as given below).However if I remove libwww entry from the
src/transport/Makefile.am it is working. So the problem seems to be with
libwww build.
------------ Error Message ----------------------------
g++ -DHAVE_CONFIG_H -I. -I. -I../../.. -I/home/shiraz/axis_c/include
-I/usr/local/include -I/usr/local/include/w3c-libwww -DHAVE_CONFIG_H -Wall
-Wshadow -DENABLE_AXISTRACE -DHT_EXT_CONTINUE -Wall -Wshadow
-DENABLE_AXISTRACE -g -O2 -c LibWWWTransport.cpp -MT LibWWWTransport.lo
-MD -MP -MF .deps/LibWWWTransport.TPlo -fPIC -DPIC -o
.libs/LibWWWTransport.lo
cc1plus: warning: changing search order for system directory
"/usr/local/include"
cc1plus: warning: as it has already been specified as a non-system
directory
LibWWWTransport.cpp: In member function `virtual AXIS_TRANSPORT_STATUS
LibWWWTransport::flushOutput()':
LibWWWTransport.cpp:304: `METHOD_EXT_0' undeclared (first use this function)
LibWWWTransport.cpp:304: (Each undeclared identifier is reported only once
for
each function it appears in.)
make[3]: *** [LibWWWTransport.lo] Error 1
make[3]: Leaving directory `/home/shiraz/axis_c/src/transport/libwww'
make[2]: *** [install-recursive] Error 1
make[2]: Leaving directory `/home/shiraz/axis_c/src/transport'
make[1]: *** [install-recursive] Error 1
make[1]: Leaving directory `/home/shiraz/axis_c/src'
make: *** [install-recursive] Error
------------ End - Error Message -------------------
Hope this information is useful.
Thanks and reagards,
Shiraz
Re: Current CVS chechout does not compile
Posted by Samisa Abeysinghe <sa...@yahoo.com>.
Cool! Thanks Damitha.
Samisa...
--- damitha kumarage <da...@opensource.lk> wrote:
> Hi,
> On Wed, 2004-07-28 at 16:13, Samisa Abeysinghe wrote:
> > The latest build process have not included enable/disable option for LibWWW transport.
> I added that option into configure. By default it will try to build
> libwww. But if you don't want it
> configure --enable-libwww=no
>
> thanks
> damitha
> >
> > In case you do not wish to use LibWWW trasport, you could solve the problem for the time being
> by
> > removing 'libwww' in
> > src/transport/Makefile.am
> >
> > Thanks,
> > Samisa...
> >
> >
> >
> > --- Shiraz Muthalif <sh...@opensource.lk> wrote:
> > > Hi All,
> > >
> > > I tried compiling the current CVS checkout and got the following error
> > > message(as given below).However if I remove libwww entry from the
> > > src/transport/Makefile.am it is working. So the problem seems to be with
> > > libwww build.
> > >
> > > ------------ Error Message ----------------------------
> > >
> > > g++ -DHAVE_CONFIG_H -I. -I. -I../../.. -I/home/shiraz/axis_c/include
> > > -I/usr/local/include -I/usr/local/include/w3c-libwww -DHAVE_CONFIG_H -Wall
> > > -Wshadow -DENABLE_AXISTRACE -DHT_EXT_CONTINUE -Wall -Wshadow
> > > -DENABLE_AXISTRACE -g -O2 -c LibWWWTransport.cpp -MT LibWWWTransport.lo
> > > -MD -MP -MF .deps/LibWWWTransport.TPlo -fPIC -DPIC -o
> > > .libs/LibWWWTransport.lo
> > > cc1plus: warning: changing search order for system directory
> > > "/usr/local/include"
> > > cc1plus: warning: as it has already been specified as a non-system
> > > directory
> > > LibWWWTransport.cpp: In member function `virtual AXIS_TRANSPORT_STATUS
> > > LibWWWTransport::flushOutput()':
> > > LibWWWTransport.cpp:304: `METHOD_EXT_0' undeclared (first use this function)
> > > LibWWWTransport.cpp:304: (Each undeclared identifier is reported only once
> > > for
> > > each function it appears in.)
> > > make[3]: *** [LibWWWTransport.lo] Error 1
> > > make[3]: Leaving directory `/home/shiraz/axis_c/src/transport/libwww'
> > > make[2]: *** [install-recursive] Error 1
> > > make[2]: Leaving directory `/home/shiraz/axis_c/src/transport'
> > > make[1]: *** [install-recursive] Error 1
> > > make[1]: Leaving directory `/home/shiraz/axis_c/src'
> > > make: *** [install-recursive] Error
> > >
> > > ------------ End - Error Message -------------------
> > >
> > > Hope this information is useful.
> > >
> > > Thanks and reagards,
> > >
> > > Shiraz
> > >
> >
> >
> > __________________________________________________
> > Do You Yahoo!?
> > Tired of spam? Yahoo! Mail has the best spam protection around
> > http://mail.yahoo.com
> >
>
>
__________________________________
Do you Yahoo!?
Yahoo! Mail - 50x more storage than other providers!
http://promotions.yahoo.com/new_mail
Re: Current CVS chechout does not compile
Posted by damitha kumarage <da...@opensource.lk>.
Hi,
On Wed, 2004-07-28 at 16:13, Samisa Abeysinghe wrote:
> The latest build process have not included enable/disable option for LibWWW transport.
I added that option into configure. By default it will try to build
libwww. But if you don't want it
configure --enable-libwww=no
thanks
damitha
>
> In case you do not wish to use LibWWW trasport, you could solve the problem for the time being by
> removing 'libwww' in
> src/transport/Makefile.am
>
> Thanks,
> Samisa...
>
>
>
> --- Shiraz Muthalif <sh...@opensource.lk> wrote:
> > Hi All,
> >
> > I tried compiling the current CVS checkout and got the following error
> > message(as given below).However if I remove libwww entry from the
> > src/transport/Makefile.am it is working. So the problem seems to be with
> > libwww build.
> >
> > ------------ Error Message ----------------------------
> >
> > g++ -DHAVE_CONFIG_H -I. -I. -I../../.. -I/home/shiraz/axis_c/include
> > -I/usr/local/include -I/usr/local/include/w3c-libwww -DHAVE_CONFIG_H -Wall
> > -Wshadow -DENABLE_AXISTRACE -DHT_EXT_CONTINUE -Wall -Wshadow
> > -DENABLE_AXISTRACE -g -O2 -c LibWWWTransport.cpp -MT LibWWWTransport.lo
> > -MD -MP -MF .deps/LibWWWTransport.TPlo -fPIC -DPIC -o
> > .libs/LibWWWTransport.lo
> > cc1plus: warning: changing search order for system directory
> > "/usr/local/include"
> > cc1plus: warning: as it has already been specified as a non-system
> > directory
> > LibWWWTransport.cpp: In member function `virtual AXIS_TRANSPORT_STATUS
> > LibWWWTransport::flushOutput()':
> > LibWWWTransport.cpp:304: `METHOD_EXT_0' undeclared (first use this function)
> > LibWWWTransport.cpp:304: (Each undeclared identifier is reported only once
> > for
> > each function it appears in.)
> > make[3]: *** [LibWWWTransport.lo] Error 1
> > make[3]: Leaving directory `/home/shiraz/axis_c/src/transport/libwww'
> > make[2]: *** [install-recursive] Error 1
> > make[2]: Leaving directory `/home/shiraz/axis_c/src/transport'
> > make[1]: *** [install-recursive] Error 1
> > make[1]: Leaving directory `/home/shiraz/axis_c/src'
> > make: *** [install-recursive] Error
> >
> > ------------ End - Error Message -------------------
> >
> > Hope this information is useful.
> >
> > Thanks and reagards,
> >
> > Shiraz
> >
>
>
> __________________________________________________
> Do You Yahoo!?
> Tired of spam? Yahoo! Mail has the best spam protection around
> http://mail.yahoo.com
>
Re: Current CVS chechout does not compile
Posted by Samisa Abeysinghe <sa...@yahoo.com>.
The latest build process have not included enable/disable option for LibWWW transport.
In case you do not wish to use LibWWW trasport, you could solve the problem for the time being by
removing 'libwww' in
src/transport/Makefile.am
Thanks,
Samisa...
--- Shiraz Muthalif <sh...@opensource.lk> wrote:
> Hi All,
>
> I tried compiling the current CVS checkout and got the following error
> message(as given below).However if I remove libwww entry from the
> src/transport/Makefile.am it is working. So the problem seems to be with
> libwww build.
>
> ------------ Error Message ----------------------------
>
> g++ -DHAVE_CONFIG_H -I. -I. -I../../.. -I/home/shiraz/axis_c/include
> -I/usr/local/include -I/usr/local/include/w3c-libwww -DHAVE_CONFIG_H -Wall
> -Wshadow -DENABLE_AXISTRACE -DHT_EXT_CONTINUE -Wall -Wshadow
> -DENABLE_AXISTRACE -g -O2 -c LibWWWTransport.cpp -MT LibWWWTransport.lo
> -MD -MP -MF .deps/LibWWWTransport.TPlo -fPIC -DPIC -o
> .libs/LibWWWTransport.lo
> cc1plus: warning: changing search order for system directory
> "/usr/local/include"
> cc1plus: warning: as it has already been specified as a non-system
> directory
> LibWWWTransport.cpp: In member function `virtual AXIS_TRANSPORT_STATUS
> LibWWWTransport::flushOutput()':
> LibWWWTransport.cpp:304: `METHOD_EXT_0' undeclared (first use this function)
> LibWWWTransport.cpp:304: (Each undeclared identifier is reported only once
> for
> each function it appears in.)
> make[3]: *** [LibWWWTransport.lo] Error 1
> make[3]: Leaving directory `/home/shiraz/axis_c/src/transport/libwww'
> make[2]: *** [install-recursive] Error 1
> make[2]: Leaving directory `/home/shiraz/axis_c/src/transport'
> make[1]: *** [install-recursive] Error 1
> make[1]: Leaving directory `/home/shiraz/axis_c/src'
> make: *** [install-recursive] Error
>
> ------------ End - Error Message -------------------
>
> Hope this information is useful.
>
> Thanks and reagards,
>
> Shiraz
>
__________________________________________________
Do You Yahoo!?
Tired of spam? Yahoo! Mail has the best spam protection around
http://mail.yahoo.com