You are viewing a plain text version of this content. The canonical link for it is here.
Posted to builds@beam.apache.org by Apache Jenkins Server <je...@builds.apache.org> on 2020/02/22 12:42:09 UTC

Build failed in Jenkins: beam_PreCommit_Python_Cron #2429

See <https://builds.apache.org/job/beam_PreCommit_Python_Cron/2429/display/redirect>

Changes:


------------------------------------------
[...truncated 7.97 MB...]
apache_beam/runners/portability/fn_api_runner_test.py:1261
apache_beam/runners/portability/fn_api_runner_test.py:1261
apache_beam/runners/portability/fn_api_runner_test.py:1261
apache_beam/runners/portability/fn_api_runner_test.py:1261
apache_beam/runners/portability/fn_api_runner_test.py:1261
apache_beam/runners/portability/fn_api_runner_test.py:1261
apache_beam/runners/portability/fn_api_runner_test.py:1261
apache_beam/runners/portability/fn_api_runner_test.py:1261
apache_beam/runners/portability/fn_api_runner_test.py:1261
apache_beam/runners/portability/fn_api_runner_test.py:1261
apache_beam/runners/portability/fn_api_runner_test.py:1261
  <https://builds.apache.org/job/beam_PreCommit_Python_Cron/ws/src/sdks/python/test-suites/tox/py36/build/srcs/sdks/python/apache_beam/runners/portability/fn_api_runner_test.py>:1261: BeamDeprecationWarning: options is deprecated since First stable release. References to <pipeline>.options will not be supported
    p.options.view_as(DebugOptions).experiments.remove('beam_fn_api')

apache_beam/runners/portability/fn_api_runner_test.py:1241
apache_beam/runners/portability/fn_api_runner_test.py:1241
apache_beam/runners/portability/fn_api_runner_test.py:1241
apache_beam/runners/portability/fn_api_runner_test.py:1241
apache_beam/runners/portability/fn_api_runner_test.py:1241
apache_beam/runners/portability/fn_api_runner_test.py:1241
apache_beam/runners/portability/fn_api_runner_test.py:1241
apache_beam/runners/portability/fn_api_runner_test.py:1241
apache_beam/runners/portability/fn_api_runner_test.py:1241
apache_beam/runners/portability/fn_api_runner_test.py:1241
apache_beam/runners/portability/fn_api_runner_test.py:1241
apache_beam/runners/portability/fn_api_runner_test.py:1241
apache_beam/runners/portability/fn_api_runner_test.py:1241
apache_beam/runners/portability/fn_api_runner_test.py:1241
apache_beam/runners/portability/fn_api_runner_test.py:1241
apache_beam/runners/portability/fn_api_runner_test.py:1241
apache_beam/runners/portability/fn_api_runner_test.py:1241
apache_beam/runners/portability/fn_api_runner_test.py:1241
apache_beam/runners/portability/fn_api_runner_test.py:1241
apache_beam/runners/portability/fn_api_runner_test.py:1241
apache_beam/runners/portability/fn_api_runner_test.py:1241
apache_beam/runners/portability/fn_api_runner_test.py:1241
apache_beam/runners/portability/fn_api_runner_test.py:1241
apache_beam/runners/portability/fn_api_runner_test.py:1241
apache_beam/runners/portability/fn_api_runner_test.py:1241
apache_beam/runners/portability/fn_api_runner_test.py:1241
apache_beam/runners/portability/fn_api_runner_test.py:1241
apache_beam/runners/portability/fn_api_runner_test.py:1241
apache_beam/runners/portability/fn_api_runner_test.py:1241
apache_beam/runners/portability/fn_api_runner_test.py:1241
apache_beam/runners/portability/fn_api_runner_test.py:1241
apache_beam/runners/portability/fn_api_runner_test.py:1241
apache_beam/runners/portability/fn_api_runner_test.py:1241
  <https://builds.apache.org/job/beam_PreCommit_Python_Cron/ws/src/sdks/python/test-suites/tox/py36/build/srcs/sdks/python/apache_beam/runners/portability/fn_api_runner_test.py>:1241: BeamDeprecationWarning: options is deprecated since First stable release. References to <pipeline>.options will not be supported
    p.options.view_as(DebugOptions).experiments.remove('beam_fn_api')

/usr/lib/python3.6/unittest/case.py:1126
/usr/lib/python3.6/unittest/case.py:1126
/usr/lib/python3.6/unittest/case.py:1126
/usr/lib/python3.6/unittest/case.py:1126
/usr/lib/python3.6/unittest/case.py:1126
/usr/lib/python3.6/unittest/case.py:1126
/usr/lib/python3.6/unittest/case.py:1126
/usr/lib/python3.6/unittest/case.py:1126
/usr/lib/python3.6/unittest/case.py:1126
/usr/lib/python3.6/unittest/case.py:1126
/usr/lib/python3.6/unittest/case.py:1126
/usr/lib/python3.6/unittest/case.py:1126
/usr/lib/python3.6/unittest/case.py:1126
/usr/lib/python3.6/unittest/case.py:1126
/usr/lib/python3.6/unittest/case.py:1126
/usr/lib/python3.6/unittest/case.py:1126
/usr/lib/python3.6/unittest/case.py:1126
/usr/lib/python3.6/unittest/case.py:1126
/usr/lib/python3.6/unittest/case.py:1126
/usr/lib/python3.6/unittest/case.py:1126
/usr/lib/python3.6/unittest/case.py:1126
/usr/lib/python3.6/unittest/case.py:1126
/usr/lib/python3.6/unittest/case.py:1126
  /usr/lib/python3.6/unittest/case.py:1126: DeprecationWarning: assertDictContainsSubset is deprecated
    DeprecationWarning)

apache_beam/runners/portability/fn_api_runner_test.py:1288
apache_beam/runners/portability/fn_api_runner_test.py:1288
apache_beam/runners/portability/fn_api_runner_test.py:1288
apache_beam/runners/portability/fn_api_runner_test.py:1288
apache_beam/runners/portability/fn_api_runner_test.py:1288
apache_beam/runners/portability/fn_api_runner_test.py:1288
apache_beam/runners/portability/fn_api_runner_test.py:1288
apache_beam/runners/portability/fn_api_runner_test.py:1288
apache_beam/runners/portability/fn_api_runner_test.py:1288
apache_beam/runners/portability/fn_api_runner_test.py:1288
apache_beam/runners/portability/fn_api_runner_test.py:1288
apache_beam/runners/portability/fn_api_runner_test.py:1288
apache_beam/runners/portability/fn_api_runner_test.py:1288
apache_beam/runners/portability/fn_api_runner_test.py:1288
apache_beam/runners/portability/fn_api_runner_test.py:1288
apache_beam/runners/portability/fn_api_runner_test.py:1288
apache_beam/runners/portability/fn_api_runner_test.py:1288
apache_beam/runners/portability/fn_api_runner_test.py:1288
apache_beam/runners/portability/fn_api_runner_test.py:1288
apache_beam/runners/portability/fn_api_runner_test.py:1288
apache_beam/runners/portability/fn_api_runner_test.py:1288
apache_beam/runners/portability/fn_api_runner_test.py:1288
apache_beam/runners/portability/fn_api_runner_test.py:1288
apache_beam/runners/portability/fn_api_runner_test.py:1288
apache_beam/runners/portability/fn_api_runner_test.py:1288
apache_beam/runners/portability/fn_api_runner_test.py:1288
apache_beam/runners/portability/fn_api_runner_test.py:1288
apache_beam/runners/portability/fn_api_runner_test.py:1288
apache_beam/runners/portability/fn_api_runner_test.py:1288
apache_beam/runners/portability/fn_api_runner_test.py:1288
apache_beam/runners/portability/fn_api_runner_test.py:1288
apache_beam/runners/portability/fn_api_runner_test.py:1288
  <https://builds.apache.org/job/beam_PreCommit_Python_Cron/ws/src/sdks/python/test-suites/tox/py36/build/srcs/sdks/python/apache_beam/runners/portability/fn_api_runner_test.py>:1288: BeamDeprecationWarning: options is deprecated since First stable release. References to <pipeline>.options will not be supported
    p.options.view_as(DebugOptions).experiments.remove('beam_fn_api')

apache_beam/runners/portability/fn_api_runner_test.py:1614
apache_beam/runners/portability/fn_api_runner_test.py:1614
apache_beam/runners/portability/fn_api_runner_test.py:1614
apache_beam/runners/portability/fn_api_runner_test.py:1614
  <https://builds.apache.org/job/beam_PreCommit_Python_Cron/ws/src/sdks/python/test-suites/tox/py36/build/srcs/sdks/python/apache_beam/runners/portability/fn_api_runner_test.py>:1614: BeamDeprecationWarning: options is deprecated since First stable release. References to <pipeline>.options will not be supported
    p.options.view_as(DebugOptions).experiments.remove('beam_fn_api')

apache_beam/transforms/trigger_test.py:974
apache_beam/transforms/trigger_test.py:974
apache_beam/transforms/trigger_test.py:974
apache_beam/transforms/trigger_test.py:974
apache_beam/transforms/trigger_test.py:974
apache_beam/transforms/trigger_test.py:974
apache_beam/transforms/trigger_test.py:974
apache_beam/transforms/trigger_test.py:974
apache_beam/transforms/trigger_test.py:974
apache_beam/transforms/trigger_test.py:974
apache_beam/transforms/trigger_test.py:974
apache_beam/transforms/trigger_test.py:974
apache_beam/transforms/trigger_test.py:974
apache_beam/transforms/trigger_test.py:974
apache_beam/transforms/trigger_test.py:974
apache_beam/transforms/trigger_test.py:974
apache_beam/transforms/trigger_test.py:974
apache_beam/transforms/trigger_test.py:974
apache_beam/transforms/trigger_test.py:974
apache_beam/transforms/trigger_test.py:974
apache_beam/transforms/trigger_test.py:974
apache_beam/transforms/trigger_test.py:974
apache_beam/transforms/trigger_test.py:974
apache_beam/transforms/trigger_test.py:974
apache_beam/transforms/trigger_test.py:974
apache_beam/transforms/trigger_test.py:974
  <https://builds.apache.org/job/beam_PreCommit_Python_Cron/ws/src/sdks/python/test-suites/tox/py36/build/srcs/sdks/python/apache_beam/transforms/trigger_test.py>:974: BeamDeprecationWarning: options is deprecated since First stable release. References to <pipeline>.options will not be supported
    p.options.view_as(StandardOptions).streaming = True

apache_beam/transforms/ptransform_test.py:717
  <https://builds.apache.org/job/beam_PreCommit_Python_Cron/ws/src/sdks/python/test-suites/tox/py36/build/srcs/sdks/python/apache_beam/transforms/ptransform_test.py>:717: BeamDeprecationWarning: RemoveDuplicates is deprecated since 2.12. Use Distinct instead.
    result = pcoll.apply(beam.RemoveDuplicates())

apache_beam/transforms/util_test.py:651
  <https://builds.apache.org/job/beam_PreCommit_Python_Cron/ws/src/sdks/python/test-suites/tox/py36/build/srcs/sdks/python/apache_beam/transforms/util_test.py>:651: FutureWarning: GroupIntoBatches is experimental.
    | util.GroupIntoBatches(GroupIntoBatchesTest.BATCH_SIZE)

apache_beam/transforms/util.py:760
  <https://builds.apache.org/job/beam_PreCommit_Python_Cron/ws/src/sdks/python/test-suites/tox/py36/build/srcs/sdks/python/apache_beam/transforms/util.py>:760: UserWarning: Use of GroupIntoBatches transform requires State/Timer support from the runner
    'Use of GroupIntoBatches transform requires State/Timer '

-- Docs: https://docs.pytest.org/en/latest/warnings.html
- generated xml file: <https://builds.apache.org/job/beam_PreCommit_Python_Cron/ws/src/sdks/python/test-suites/tox/py36/build/srcs/sdks/python/pytest_py36-cython-pytest.xml> -
=========== 2538 passed, 642 skipped, 993 warnings in 598.18 seconds ===========
============================= test session starts ==============================
platform linux -- Python 3.6.8, pytest-4.6.9, py-1.8.1, pluggy-0.13.1
cachedir: target/.tox-py36-cython-pytest/py36-cython-pytest/.pytest_cache
rootdir: <https://builds.apache.org/job/beam_PreCommit_Python_Cron/ws/src/sdks/python/test-suites/tox/py36/build/srcs/sdks/python,> inifile: pytest.ini
plugins: requests-mock-1.7.0, forked-1.1.3, xdist-1.31.0, timeout-1.3.4
timeout: 600.0s
timeout method: signal
timeout func_only: False
collected 3238 items / 3180 deselected / 58 selected

apache_beam/coders/fast_coders_test.py ............................      [ 48%]
apache_beam/coders/slow_coders_test.py ............................      [ 96%]
apache_beam/io/gcp/tests/bigquery_matcher_test.py s                      [ 98%]
apache_beam/runners/portability/stager_test.py .                         [100%]

=============================== warnings summary ===============================
apache_beam/io/gcp/datastore/v1/datastoreio.py:64
  <https://builds.apache.org/job/beam_PreCommit_Python_Cron/ws/src/sdks/python/test-suites/tox/py36/build/srcs/sdks/python/apache_beam/io/gcp/datastore/v1/datastoreio.py>:64: UserWarning: Datastore IO will support Python 3 after replacing googledatastore by google-cloud-datastore, see: BEAM-4543.
    'Datastore IO will support Python 3 after replacing '

apache_beam/io/vcfio.py:50
  <https://builds.apache.org/job/beam_PreCommit_Python_Cron/ws/src/sdks/python/test-suites/tox/py36/build/srcs/sdks/python/apache_beam/io/vcfio.py>:50: UserWarning: VCF IO will support Python 3 after migration to Nucleus, see: BEAM-5628.
    "VCF IO will support Python 3 after migration to Nucleus, "

apache_beam/transforms/trigger_test.py:541
  <https://builds.apache.org/job/beam_PreCommit_Python_Cron/ws/src/sdks/python/test-suites/tox/py36/build/srcs/sdks/python/apache_beam/transforms/trigger_test.py>:541: YAMLLoadWarning: calling yaml.load_all() without Loader=... is deprecated, as the default Loader is unsafe. Please read https://msg.pyyaml.org/load for full details.
    for spec in yaml.load_all(open(transcript_filename)):

-- Docs: https://docs.pytest.org/en/latest/warnings.html
- generated xml file: <https://builds.apache.org/job/beam_PreCommit_Python_Cron/ws/src/sdks/python/test-suites/tox/py36/build/srcs/sdks/python/pytest_py36-cython-pytest_no_xdist.xml> -
====== 57 passed, 1 skipped, 3180 deselected, 3 warnings in 7.01 seconds =======
py36-cython-pytest run-test-post: commands[0] | <https://builds.apache.org/job/beam_PreCommit_Python_Cron/ws/src/sdks/python/test-suites/tox/py36/build/srcs/sdks/python/scripts/run_tox_cleanup.sh>
___________________________________ summary ____________________________________
  py36-cython-pytest: commands succeeded
  congratulations :)

> Task :sdks:python:test-suites:tox:py36:preCommitPy36

FAILURE: Build completed with 3 failures.

1: Task failed with an exception.
-----------
* Where:
Build file '<https://builds.apache.org/job/beam_PreCommit_Python_Cron/ws/src/sdks/python/test-suites/dataflow/py2/build.gradle'> line: 62

* What went wrong:
Execution failed for task ':sdks:python:test-suites:dataflow:py2:preCommitIT'.
> Process 'command 'sh'' finished with non-zero exit value 1

* Try:
Run with --stacktrace option to get the stack trace. Run with --info or --debug option to get more log output. Run with --scan to get full insights.
==============================================================================

2: Task failed with an exception.
-----------
* What went wrong:
Execution failed for task ':sdks:python:test-suites:tox:py2:testPy2Gcp'.
> Process 'command 'sh'' finished with non-zero exit value 1

* Try:
Run with --stacktrace option to get the stack trace. Run with --info or --debug option to get more log output. Run with --scan to get full insights.
==============================================================================

3: Task failed with an exception.
-----------
* What went wrong:
Execution failed for task ':sdks:python:test-suites:tox:py2:testPy2Cython'.
> Process 'command 'sh'' finished with non-zero exit value 1

* Try:
Run with --stacktrace option to get the stack trace. Run with --info or --debug option to get more log output. Run with --scan to get full insights.
==============================================================================

* Get more help at https://help.gradle.org

Deprecated Gradle features were used in this build, making it incompatible with Gradle 6.0.
Use '--warning-mode all' to show the individual deprecation warnings.
See https://docs.gradle.org/5.2.1/userguide/command_line_interface.html#sec:command_line_warnings

BUILD FAILED in 27m 29s
78 actionable tasks: 61 executed, 17 from cache

Publishing build scan...
https://gradle.com/s/abkpoxavczxta

Build step 'Invoke Gradle script' changed build result to FAILURE
Build step 'Invoke Gradle script' marked build as failure

---------------------------------------------------------------------
To unsubscribe, e-mail: builds-unsubscribe@beam.apache.org
For additional commands, e-mail: builds-help@beam.apache.org


Jenkins build is back to normal : beam_PreCommit_Python_Cron #2430

Posted by Apache Jenkins Server <je...@builds.apache.org>.
See <https://builds.apache.org/job/beam_PreCommit_Python_Cron/2430/display/redirect>


---------------------------------------------------------------------
To unsubscribe, e-mail: builds-unsubscribe@beam.apache.org
For additional commands, e-mail: builds-help@beam.apache.org