You are viewing a plain text version of this content. The canonical link for it is here.
Posted to dev@poi.apache.org by Apache Jenkins Server <je...@builds.apache.org> on 2021/07/05 21:48:48 UTC
Build failed in Jenkins: POI » POI-DSL-Windows-1.16 #16
See <https://ci-builds.apache.org/job/POI/job/POI-DSL-Windows-1.16/16/display/redirect?page=changes>
Changes:
[Andreas Beeker] deactivate TestSignatureInfo on Jdk 1.8.0 PatchLevel 292
------------------------------------------
[...truncated 1.79 KB...]
At revision 1891289
No changes for https://svn.apache.org/repos/asf/poi/site/forrest.properties since the previous build
No changes for https://svn.apache.org/repos/asf/poi/site/src/documentation since the previous build
[POI-DSL-Windows-1.16] $ cmd /c call F:\jenkins\jenkins-slave\temp\jenkins9223039037811952957.bat
X forrest.properties
M poi-ooxml-lite-agent\src\main\java9\module-info.class
X src\documentation
Performing status on external item at 'src\documentation':
svn: E155010: The node 'F:\jenkins\jenkins-slave\712657a4\workspace\POI\POI-DSL-Windows-1.16\poi*\src\*' was not found.
Java-Home: f:\\jenkins\\tools\\java\\latest16
Volume in drive F is data
Volume Serial Number is 928C-27F2
Directory of f:\jenkins\tools\java\latest16
12/18/2020 01:30 PM <DIR> .
12/18/2020 01:30 PM <DIR> ..
12/18/2020 01:29 PM <DIR> bin
12/18/2020 01:29 PM <DIR> conf
12/18/2020 01:29 PM <DIR> include
12/18/2020 01:29 PM <DIR> jmods
12/18/2020 01:29 PM <DIR> legal
12/18/2020 01:30 PM <DIR> lib
11/11/2020 09:41 PM 1,165 release
1 File(s) 1,165 bytes
8 Dir(s) 1,838,263,410,688 bytes free
openjdk version "16-ea" 2021-03-16
OpenJDK Runtime Environment (build 16-ea+24-1553)
OpenJDK 64-Bit Server VM (build 16-ea+24-1553, mixed mode, sharing)
[POI-DSL-Windows-1.16] $ cmd.exe /C "F:\jenkins\tools\ant\latest1.10\bin\ant.bat -Dcoverage.enabled=true clean jenkins && exit %%ERRORLEVEL%%"
Buildfile: <https://ci-builds.apache.org/job/POI/job/POI-DSL-Windows-1.16/ws/build.xml>
[mkdir] Created dir: <https://ci-builds.apache.org/job/POI/job/POI-DSL-Windows-1.16/ws/poi-excelant\build\poi-ant-contrib>
[javac] Compiling 3 source files to <https://ci-builds.apache.org/job/POI/job/POI-DSL-Windows-1.16/ws/poi-excelant\build\poi-ant-contrib>
clean:
[delete] Deleting directory <https://ci-builds.apache.org/job/POI/job/POI-DSL-Windows-1.16/ws/build>
[delete] Deleting directory <https://ci-builds.apache.org/job/POI/job/POI-DSL-Windows-1.16/ws/poi-examples\build>
[delete] Deleting directory <https://ci-builds.apache.org/job/POI/job/POI-DSL-Windows-1.16/ws/poi-excelant\build>
[delete] Deleting directory <https://ci-builds.apache.org/job/POI/job/POI-DSL-Windows-1.16/ws/poi-integration\build>
[delete] Deleting directory <https://ci-builds.apache.org/job/POI/job/POI-DSL-Windows-1.16/ws/poi\build>
[delete] Deleting directory <https://ci-builds.apache.org/job/POI/job/POI-DSL-Windows-1.16/ws/poi-ooxml\build>
[delete] Deleting directory <https://ci-builds.apache.org/job/POI/job/POI-DSL-Windows-1.16/ws/poi-ooxml-full\build>
[delete] Deleting directory <https://ci-builds.apache.org/job/POI/job/POI-DSL-Windows-1.16/ws/poi-scratchpad\build>
replaceVersion:
check-jars:
fetch-jars:
check-ooxml-jars:
fetch-ooxml-jars:
[get] Destination already exists (skipping): <https://ci-builds.apache.org/job/POI/job/POI-DSL-Windows-1.16/ws/lib\ooxml\curvesapi-1.06.jar>
[get] Getting: https://repo1.maven.org/maven2/org/apache/xmlbeans/xmlbeans/5.0.0/xmlbeans-5.0.0.jar
[get] To: <https://ci-builds.apache.org/job/POI/job/POI-DSL-Windows-1.16/ws/lib\ooxml\xmlbeans-5.0.0.jar>
[get] Destination already exists (skipping): <https://ci-builds.apache.org/job/POI/job/POI-DSL-Windows-1.16/ws/lib\ooxml\commons-compress-1.20.jar>
[get] Destination already exists (skipping): <https://ci-builds.apache.org/job/POI/job/POI-DSL-Windows-1.16/ws/lib\ooxml-tests\reflections-0.9.12.jar>
[get] Destination already exists (skipping): <https://ci-builds.apache.org/job/POI/job/POI-DSL-Windows-1.16/ws/lib\ooxml-tests\guava-30.1-jre.jar>
[get] Destination already exists (skipping): <https://ci-builds.apache.org/job/POI/job/POI-DSL-Windows-1.16/ws/lib\ooxml-tests\javassist-3.27.0-GA.jar>
[get] Destination already exists (skipping): <https://ci-builds.apache.org/job/POI/job/POI-DSL-Windows-1.16/ws/lib\ooxml-tests\slf4j-api-1.7.31.jar>
[get] Destination already exists (skipping): <https://ci-builds.apache.org/job/POI/job/POI-DSL-Windows-1.16/ws/lib\ooxml-batik\batik-anim-1.14.jar>
[get] Destination already exists (skipping): <https://ci-builds.apache.org/job/POI/job/POI-DSL-Windows-1.16/ws/lib\ooxml-batik\batik-awt-util-1.14.jar>
[get] Destination already exists (skipping): <https://ci-builds.apache.org/job/POI/job/POI-DSL-Windows-1.16/ws/lib\ooxml-batik\batik-bridge-1.14.jar>
[get] Destination already exists (skipping): <https://ci-builds.apache.org/job/POI/job/POI-DSL-Windows-1.16/ws/lib\ooxml-batik\batik-codec-1.14.jar>
[get] Destination already exists (skipping): <https://ci-builds.apache.org/job/POI/job/POI-DSL-Windows-1.16/ws/lib\ooxml-batik\batik-constants-1.14.jar>
[get] Destination already exists (skipping): <https://ci-builds.apache.org/job/POI/job/POI-DSL-Windows-1.16/ws/lib\ooxml-batik\batik-css-1.14.jar>
[get] Destination already exists (skipping): <https://ci-builds.apache.org/job/POI/job/POI-DSL-Windows-1.16/ws/lib\ooxml-batik\batik-dom-1.14.jar>
[get] Destination already exists (skipping): <https://ci-builds.apache.org/job/POI/job/POI-DSL-Windows-1.16/ws/lib\ooxml-batik\batik-ext-1.14.jar>
[get] Destination already exists (skipping): <https://ci-builds.apache.org/job/POI/job/POI-DSL-Windows-1.16/ws/lib\ooxml-batik\batik-gvt-1.14.jar>
[get] Destination already exists (skipping): <https://ci-builds.apache.org/job/POI/job/POI-DSL-Windows-1.16/ws/lib\ooxml-batik\batik-i18n-1.14.jar>
[get] Destination already exists (skipping): <https://ci-builds.apache.org/job/POI/job/POI-DSL-Windows-1.16/ws/lib\ooxml-batik\batik-parser-1.14.jar>
[get] Destination already exists (skipping): <https://ci-builds.apache.org/job/POI/job/POI-DSL-Windows-1.16/ws/lib\ooxml-batik\batik-script-1.14.jar>
[get] Destination already exists (skipping): <https://ci-builds.apache.org/job/POI/job/POI-DSL-Windows-1.16/ws/lib\ooxml-batik\batik-shared-resources-1.14.jar>
[get] Destination already exists (skipping): <https://ci-builds.apache.org/job/POI/job/POI-DSL-Windows-1.16/ws/lib\ooxml-batik\batik-svg-dom-1.14.jar>
[get] Destination already exists (skipping): <https://ci-builds.apache.org/job/POI/job/POI-DSL-Windows-1.16/ws/lib\ooxml-batik\batik-svggen-1.14.jar>
[get] Destination already exists (skipping): <https://ci-builds.apache.org/job/POI/job/POI-DSL-Windows-1.16/ws/lib\ooxml-batik\batik-svgrasterizer-1.14.jar>
[get] Destination already exists (skipping): <https://ci-builds.apache.org/job/POI/job/POI-DSL-Windows-1.16/ws/lib\ooxml-batik\batik-transcoder-1.14.jar>
[get] Destination already exists (skipping): <https://ci-builds.apache.org/job/POI/job/POI-DSL-Windows-1.16/ws/lib\ooxml-batik\batik-util-1.14.jar>
[get] Destination already exists (skipping): <https://ci-builds.apache.org/job/POI/job/POI-DSL-Windows-1.16/ws/lib\ooxml-batik\batik-xml-1.14.jar>
[get] Destination already exists (skipping): <https://ci-builds.apache.org/job/POI/job/POI-DSL-Windows-1.16/ws/lib\ooxml-batik\xml-apis-ext-1.3.04.jar>
[get] Destination already exists (skipping): <https://ci-builds.apache.org/job/POI/job/POI-DSL-Windows-1.16/ws/lib\ooxml-batik\xmlgraphics-commons-2.4.jar>
[get] Destination already exists (skipping): <https://ci-builds.apache.org/job/POI/job/POI-DSL-Windows-1.16/ws/lib\ooxml-provided\pdfbox-2.0.24.jar>
[get] Destination already exists (skipping): <https://ci-builds.apache.org/job/POI/job/POI-DSL-Windows-1.16/ws/lib\ooxml-provided\fontbox-2.0.24.jar>
[get] Destination already exists (skipping): <https://ci-builds.apache.org/job/POI/job/POI-DSL-Windows-1.16/ws/lib\ooxml-provided\graphics2d-0.32.jar>
init:
[mkdir] Created dir: <https://ci-builds.apache.org/job/POI/job/POI-DSL-Windows-1.16/ws/build>
[mkdir] Created dir: <https://ci-builds.apache.org/job/POI/job/POI-DSL-Windows-1.16/ws/poi\build\classes\ant\java>
[mkdir] Created dir: <https://ci-builds.apache.org/job/POI/job/POI-DSL-Windows-1.16/ws/poi\build\test-classes>
[mkdir] Created dir: <https://ci-builds.apache.org/job/POI/job/POI-DSL-Windows-1.16/ws/poi\build\test-results>
[mkdir] Created dir: <https://ci-builds.apache.org/job/POI/job/POI-DSL-Windows-1.16/ws/poi-scratchpad\build\classes\ant\java>
[mkdir] Created dir: <https://ci-builds.apache.org/job/POI/job/POI-DSL-Windows-1.16/ws/poi-scratchpad\build\test-classes>
[mkdir] Created dir: <https://ci-builds.apache.org/job/POI/job/POI-DSL-Windows-1.16/ws/poi-scratchpad\build\test-results>
[mkdir] Created dir: <https://ci-builds.apache.org/job/POI/job/POI-DSL-Windows-1.16/ws/poi-ooxml\build\classes\ant\java>
[mkdir] Created dir: <https://ci-builds.apache.org/job/POI/job/POI-DSL-Windows-1.16/ws/poi-ooxml\build\test-classes>
[mkdir] Created dir: <https://ci-builds.apache.org/job/POI/job/POI-DSL-Windows-1.16/ws/poi-ooxml-full\build\classes\ant\java>
[mkdir] Created dir: <https://ci-builds.apache.org/job/POI/job/POI-DSL-Windows-1.16/ws/poi-ooxml-full\build\test-classes>
[mkdir] Created dir: <https://ci-builds.apache.org/job/POI/job/POI-DSL-Windows-1.16/ws/poi-ooxml-full\build\generated-sources>
[mkdir] Created dir: <https://ci-builds.apache.org/job/POI/job/POI-DSL-Windows-1.16/ws/poi-ooxml-full\build\generated-classes>
[mkdir] Created dir: <https://ci-builds.apache.org/job/POI/job/POI-DSL-Windows-1.16/ws/poi-ooxml\build\test-results>
[mkdir] Created dir: <https://ci-builds.apache.org/job/POI/job/POI-DSL-Windows-1.16/ws/poi-excelant\build\classes\ant\java>
[mkdir] Created dir: <https://ci-builds.apache.org/job/POI/job/POI-DSL-Windows-1.16/ws/poi-excelant\build\test-classes>
[mkdir] Created dir: <https://ci-builds.apache.org/job/POI/job/POI-DSL-Windows-1.16/ws/poi-excelant\build\test-results>
[mkdir] Created dir: <https://ci-builds.apache.org/job/POI/job/POI-DSL-Windows-1.16/ws/poi-examples\build\classes\ant\java>
[mkdir] Created dir: <https://ci-builds.apache.org/job/POI/job/POI-DSL-Windows-1.16/ws/poi-integration\build\test-classes>
[mkdir] Created dir: <https://ci-builds.apache.org/job/POI/job/POI-DSL-Windows-1.16/ws/poi-integration\build\test-results>
[mkdir] Created dir: <https://ci-builds.apache.org/job/POI/job/POI-DSL-Windows-1.16/ws/build\dist>
[mkdir] Created dir: <https://ci-builds.apache.org/job/POI/job/POI-DSL-Windows-1.16/ws/build\site>
[echo] Using Ant: Apache Ant(TM) version 1.10.9 compiled on September 27 2020 from F:\\jenkins\\tools\\ant\\latest1.10, Ant detected Java 16 (may be different than actual Java sometimes...)
[echo] Using Java: 16-ea/16-ea+24-1553/16-ea+24-1553/OpenJDK 64-Bit Server VM from Oracle Corporation on Windows Server 2016: 10.0
[echo] Building Apache POI version 5.0.1-SNAPSHOT and RC: RC1, isJava8: false
[echo] Compiling for Java 9+
-version-java-check:
compile-version:
[mkdir] Created dir: <https://ci-builds.apache.org/job/POI/job/POI-DSL-Windows-1.16/ws/poi\build\generated-sources\org\apache\poi>
[copy] Copying 1 file to <https://ci-builds.apache.org/job/POI/job/POI-DSL-Windows-1.16/ws/poi\build\generated-sources\org\apache\poi>
[javac] Compiling 1 source file to <https://ci-builds.apache.org/job/POI/job/POI-DSL-Windows-1.16/ws/poi\build\classes\ant\java>
[javac] warning: [options] bootstrap class path not set in conjunction with -source 8
[javac] 1 warning
compile-main:
[javac] Compiling 1171 source files to <https://ci-builds.apache.org/job/POI/job/POI-DSL-Windows-1.16/ws/poi\build\classes\ant\java>
[javac] Ignoring source, target and bootclasspath as release has been set
[javac] Note: Some input files use or override a deprecated API.
[javac] Note: Recompile with -Xlint:deprecation for details.
[javac] Note: Some input files use unchecked or unsafe operations.
[javac] Note: Recompile with -Xlint:unchecked for details.
[javac] Creating empty <https://ci-builds.apache.org/job/POI/job/POI-DSL-Windows-1.16/ws/poi\build\classes\ant\java\org\apache\poi\ddf\package-info.class>
[javac] Creating empty <https://ci-builds.apache.org/job/POI/job/POI-DSL-Windows-1.16/ws/poi\build\classes\ant\java\org\apache\poi\hssf\package-info.class>
[javac] Creating empty <https://ci-builds.apache.org/job/POI/job/POI-DSL-Windows-1.16/ws/poi\build\classes\ant\java\org\apache\poi\poifs\dev\package-info.class>
[javac] Creating empty <https://ci-builds.apache.org/job/POI/job/POI-DSL-Windows-1.16/ws/poi\build\classes\ant\java\org\apache\poi\util\package-info.class>
[javac] Creating empty <https://ci-builds.apache.org/job/POI/job/POI-DSL-Windows-1.16/ws/poi\build\classes\ant\java\org\apache\poi\poifs\common\package-info.class>
[javac] Creating empty <https://ci-builds.apache.org/job/POI/job/POI-DSL-Windows-1.16/ws/poi\build\classes\ant\java\org\apache\poi\hssf\record\package-info.class>
[javac] Creating empty <https://ci-builds.apache.org/job/POI/job/POI-DSL-Windows-1.16/ws/poi\build\classes\ant\java\org\apache\poi\poifs\package-info.class>
[javac] Creating empty <https://ci-builds.apache.org/job/POI/job/POI-DSL-Windows-1.16/ws/poi\build\classes\ant\java\org\apache\poi\poifs\crypt\package-info.class>
[javac] Creating empty <https://ci-builds.apache.org/job/POI/job/POI-DSL-Windows-1.16/ws/poi\build\classes\ant\java\org\apache\poi\hpsf\wellknown\package-info.class>
[javac] Creating empty <https://ci-builds.apache.org/job/POI/job/POI-DSL-Windows-1.16/ws/poi\build\classes\ant\java\org\apache\poi\hssf\dev\package-info.class>
[javac] Creating empty <https://ci-builds.apache.org/job/POI/job/POI-DSL-Windows-1.16/ws/poi\build\classes\ant\java\org\apache\poi\ss\formula\package-info.class>
[javac] Creating empty <https://ci-builds.apache.org/job/POI/job/POI-DSL-Windows-1.16/ws/poi\build\classes\ant\java\org\apache\poi\hpsf\package-info.class>
[javac] Creating empty <https://ci-builds.apache.org/job/POI/job/POI-DSL-Windows-1.16/ws/poi\build\classes\ant\java\org\apache\poi\poifs\property\package-info.class>
[javac] Creating empty <https://ci-builds.apache.org/job/POI/job/POI-DSL-Windows-1.16/ws/poi\build\classes\ant\java\org\apache\poi\poifs\filesystem\package-info.class>
[javac] Creating empty <https://ci-builds.apache.org/job/POI/job/POI-DSL-Windows-1.16/ws/poi\build\classes\ant\java\org\apache\poi\ss\formula\ptg\package-info.class>
[javac] Creating empty <https://ci-builds.apache.org/job/POI/job/POI-DSL-Windows-1.16/ws/poi\build\classes\ant\java\org\apache\poi\poifs\storage\package-info.class>
[javac] Creating empty <https://ci-builds.apache.org/job/POI/job/POI-DSL-Windows-1.16/ws/poi\build\classes\ant\java\org\apache\poi\hssf\eventusermodel\package-info.class>
[javac] Creating empty <https://ci-builds.apache.org/job/POI/job/POI-DSL-Windows-1.16/ws/poi\build\classes\ant\java\org\apache\poi\hssf\record\aggregates\package-info.class>
[javac] Creating empty <https://ci-builds.apache.org/job/POI/job/POI-DSL-Windows-1.16/ws/poi\build\classes\ant\java\org\apache\poi\ss\format\package-info.class>
[javac] Creating empty <https://ci-builds.apache.org/job/POI/job/POI-DSL-Windows-1.16/ws/poi\build\classes\ant\java\org\apache\poi\hssf\model\package-info.class>
[javac] Creating empty <https://ci-builds.apache.org/job/POI/job/POI-DSL-Windows-1.16/ws/poi\build\classes\ant\java\org\apache\poi\hssf\usermodel\package-info.class>
[javac] Creating empty <https://ci-builds.apache.org/job/POI/job/POI-DSL-Windows-1.16/ws/poi\build\classes\ant\java\org\apache\poi\hssf\util\package-info.class>
[javac] Creating empty <https://ci-builds.apache.org/job/POI/job/POI-DSL-Windows-1.16/ws/poi\build\classes\ant\java\org\apache\poi\poifs\eventfilesystem\package-info.class>
[mkdir] Created dir: <https://ci-builds.apache.org/job/POI/job/POI-DSL-Windows-1.16/ws/build\dist\maven\poi>
[echo] Building jar for poi, module-name: poi with isJava8: false
[jar] Building jar: <https://ci-builds.apache.org/job/POI/job/POI-DSL-Windows-1.16/ws/build\dist\maven\poi\poi-5.0.1-SNAPSHOT.jar>
[javac] Compiling 517 source files to <https://ci-builds.apache.org/job/POI/job/POI-DSL-Windows-1.16/ws/poi\build\test-classes>
[javac] Ignoring source, target and bootclasspath as release has been set
[javac] Note: Some input files use or override a deprecated API.
[javac] Note: Recompile with -Xlint:deprecation for details.
[echo] Building test-jar for poi, module-name: poi with isJava8: false
[jar] Building jar: <https://ci-builds.apache.org/job/POI/job/POI-DSL-Windows-1.16/ws/build\dist\maven\poi-tests\poi-5.0.1-SNAPSHOT-tests.jar>
[jar] Building jar: <https://ci-builds.apache.org/job/POI/job/POI-DSL-Windows-1.16/ws/build\dist\maven\poi\poi-5.0.1-SNAPSHOT-sources.jar>
compile-scratchpad:
[javac] Compiling 514 source files to <https://ci-builds.apache.org/job/POI/job/POI-DSL-Windows-1.16/ws/poi-scratchpad\build\classes\ant\java>
[javac] Ignoring source, target and bootclasspath as release has been set
[javac] Note: Some input files use or override a deprecated API.
[javac] Note: Recompile with -Xlint:deprecation for details.
[javac] Note: <https://ci-builds.apache.org/job/POI/job/POI-DSL-Windows-1.16/ws/poi-scratchpad\src\main\java\org\apache\poi\hwpf\model\BytePropertyNode.java> uses unchecked or unsafe operations.
[javac] Note: Recompile with -Xlint:unchecked for details.
[mkdir] Created dir: <https://ci-builds.apache.org/job/POI/job/POI-DSL-Windows-1.16/ws/build\dist\maven\poi-scratchpad>
[echo] Building jar for poi-scratchpad, module-name: scratchpad with isJava8: false
[jar] Building jar: <https://ci-builds.apache.org/job/POI/job/POI-DSL-Windows-1.16/ws/build\dist\maven\poi-scratchpad\poi-scratchpad-5.0.1-SNAPSHOT.jar>
[javac] Compiling 197 source files to <https://ci-builds.apache.org/job/POI/job/POI-DSL-Windows-1.16/ws/poi-scratchpad\build\test-classes>
[javac] Ignoring source, target and bootclasspath as release has been set
[javac] Note: Some input files use or override a deprecated API.
[javac] Note: Recompile with -Xlint:deprecation for details.
[echo] Building test-jar for poi-scratchpad, module-name: scratchpad with isJava8: false
[jar] Building jar: <https://ci-builds.apache.org/job/POI/job/POI-DSL-Windows-1.16/ws/build\dist\maven\poi-scratchpad-tests\poi-scratchpad-5.0.1-SNAPSHOT-tests.jar>
[jar] Building jar: <https://ci-builds.apache.org/job/POI/job/POI-DSL-Windows-1.16/ws/build\dist\maven\poi-scratchpad\poi-scratchpad-5.0.1-SNAPSHOT-sources.jar>
check-compiled-ooxml-xsds:
compile-ooxml-xsds:
[mkdir] Created dir: <https://ci-builds.apache.org/job/POI/job/POI-DSL-Windows-1.16/ws/poi-ooxml-full\build\xsds>
[copy] Copying 8 files to <https://ci-builds.apache.org/job/POI/job/POI-DSL-Windows-1.16/ws/poi-ooxml-full\build\xsds>
[copy] Copying 28 resources to <https://ci-builds.apache.org/job/POI/job/POI-DSL-Windows-1.16/ws/poi-ooxml-full\build\xsds>
[xmlbean] SchemaCompiler Metadata LOAD:org/apache/xmlbeans/metadata GEN:org/apache/poi/schemas/ooxml
[xmlbean] Time to build schema type system: 2.776 seconds
[xmlbean] Time to generate code: 11.926 seconds
[javac] Compiling 5064 source files to <https://ci-builds.apache.org/job/POI/job/POI-DSL-Windows-1.16/ws/poi-ooxml-full\build\classes\ant\java>
[javac] Ignoring source, target and bootclasspath as release has been set
[mkdir] Created dir: <https://ci-builds.apache.org/job/POI/job/POI-DSL-Windows-1.16/ws/build\dist\maven\poi-ooxml-full>
[jar] Building jar: <https://ci-builds.apache.org/job/POI/job/POI-DSL-Windows-1.16/ws/build\dist\maven\poi-ooxml-full\poi-ooxml-full-5.0.1-SNAPSHOT.jar>
[jar] Building jar: <https://ci-builds.apache.org/job/POI/job/POI-DSL-Windows-1.16/ws/build\dist\maven\poi-ooxml-full\poi-ooxml-full-5.0.1-SNAPSHOT-sources.jar>
compile-ooxml:
[javac] Compiling 620 source files to <https://ci-builds.apache.org/job/POI/job/POI-DSL-Windows-1.16/ws/poi-ooxml\build\classes\ant\java>
[javac] Ignoring source, target and bootclasspath as release has been set
[javac] Note: Some input files use or override a deprecated API.
[javac] Note: Recompile with -Xlint:deprecation for details.
[javac] Note: <https://ci-builds.apache.org/job/POI/job/POI-DSL-Windows-1.16/ws/poi-ooxml\src\main\java\org\apache\poi\xslf\draw\SVGImageRenderer.java> uses unchecked or unsafe operations.
[javac] Note: Recompile with -Xlint:unchecked for details.
[javac] Creating empty <https://ci-builds.apache.org/job/POI/job/POI-DSL-Windows-1.16/ws/poi-ooxml\build\classes\ant\java\org\apache\poi\xwpf\package-info.class>
[javac] Creating empty <https://ci-builds.apache.org/job/POI/job/POI-DSL-Windows-1.16/ws/poi-ooxml\build\classes\ant\java\org\apache\poi\xssf\binary\package-info.class>
[mkdir] Created dir: <https://ci-builds.apache.org/job/POI/job/POI-DSL-Windows-1.16/ws/build\dist\maven\poi-ooxml>
[echo] Building jar for poi-ooxml, module-name: ooxml with isJava8: false
[jar] Building jar: <https://ci-builds.apache.org/job/POI/job/POI-DSL-Windows-1.16/ws/build\dist\maven\poi-ooxml\poi-ooxml-5.0.1-SNAPSHOT.jar>
[javac] Compiling 272 source files to <https://ci-builds.apache.org/job/POI/job/POI-DSL-Windows-1.16/ws/poi-ooxml\build\test-classes>
[javac] Ignoring source, target and bootclasspath as release has been set
[javac] Note: Some input files use or override a deprecated API.
[javac] Note: Recompile with -Xlint:deprecation for details.
[echo] Building test-jar for poi-ooxml, module-name: ooxml with isJava8: false
[jar] Building jar: <https://ci-builds.apache.org/job/POI/job/POI-DSL-Windows-1.16/ws/build\dist\maven\poi-ooxml-tests\poi-ooxml-5.0.1-SNAPSHOT-tests.jar>
[jar] Building jar: <https://ci-builds.apache.org/job/POI/job/POI-DSL-Windows-1.16/ws/build\dist\maven\poi-ooxml\poi-ooxml-5.0.1-SNAPSHOT-sources.jar>
[jar] Building jar: <https://ci-builds.apache.org/job/POI/job/POI-DSL-Windows-1.16/ws/build\dist\maven\poi-ooxml-lite-agent\poi-ooxml-lite-agent-5.0.1-SNAPSHOT.jar>
compile-examples:
[javac] Compiling 138 source files to <https://ci-builds.apache.org/job/POI/job/POI-DSL-Windows-1.16/ws/poi-examples\build\classes\ant\java>
[javac] Ignoring source, target and bootclasspath as release has been set
[javac] Creating empty <https://ci-builds.apache.org/job/POI/job/POI-DSL-Windows-1.16/ws/poi-examples\build\classes\ant\java\org\apache\poi\examples\ss\html\package-info.class>
[mkdir] Created dir: <https://ci-builds.apache.org/job/POI/job/POI-DSL-Windows-1.16/ws/build\dist\maven\poi-examples>
[echo] Building jar for poi-examples, module-name: examples with isJava8: false
[jar] Building jar: <https://ci-builds.apache.org/job/POI/job/POI-DSL-Windows-1.16/ws/build\dist\maven\poi-examples\poi-examples-5.0.1-SNAPSHOT.jar>
[echo] Building test-jar for poi-examples, module-name: examples with isJava8: false
[jar] Building jar: <https://ci-builds.apache.org/job/POI/job/POI-DSL-Windows-1.16/ws/build\dist\maven\poi-examples\poi-examples-5.0.1-SNAPSHOT-sources.jar>
compile-excelant:
[javac] Compiling 14 source files to <https://ci-builds.apache.org/job/POI/job/POI-DSL-Windows-1.16/ws/poi-excelant\build\classes\ant\java>
[javac] Ignoring source, target and bootclasspath as release has been set
[javac] Compiling 1 source file to <https://ci-builds.apache.org/job/POI/job/POI-DSL-Windows-1.16/ws/poi-excelant\src\main\java9>
[javac] error: module not found: org.apache.poi.ooxml.schemas
[javac] error: module not found: org.apache.xmlbeans
[javac] 2 errors
BUILD FAILED
<https://ci-builds.apache.org/job/POI/job/POI-DSL-Windows-1.16/ws/build.xml>:1462: The following error occurred while executing this line:
<https://ci-builds.apache.org/job/POI/job/POI-DSL-Windows-1.16/ws/build.xml>:1093: Compile failed; see the compiler error output for details.
Total time: 3 minutes 10 seconds
Build step 'Invoke Ant' marked build as failure
[SpotBugs] Skipping execution of recorder since overall result is 'FAILURE'
Archiving artifacts
Skipping publisher since build result is FAILURE
Recording test results
ERROR: Step ‘Publish JUnit test result report’ failed: No test report files were found. Configuration error?
---------------------------------------------------------------------
To unsubscribe, e-mail: dev-unsubscribe@poi.apache.org
For additional commands, e-mail: dev-help@poi.apache.org
Jenkins build is back to normal : POI » POI-DSL-Windows-1.16 #22
Posted by Apache Jenkins Server <je...@builds.apache.org>.
See <https://ci-builds.apache.org/job/POI/job/POI-DSL-Windows-1.16/22/display/redirect>
---------------------------------------------------------------------
To unsubscribe, e-mail: dev-unsubscribe@poi.apache.org
For additional commands, e-mail: dev-help@poi.apache.org
Build failed in Jenkins: POI » POI-DSL-Windows-1.16 #21
Posted by Apache Jenkins Server <je...@builds.apache.org>.
See <https://ci-builds.apache.org/job/POI/job/POI-DSL-Windows-1.16/21/display/redirect>
Changes:
------------------------------------------
[...truncated 34.64 KB...]
at org.tmatesoft.svn.core.internal.wc.SVNErrorManager.error(SVNErrorManager.java:57)
at org.tmatesoft.svn.core.internal.wc.admin.SVNTranslator.checkWrappedException(SVNTranslator.java:436)
at org.tmatesoft.svn.core.internal.wc.admin.SVNTranslator.copyAndTranslate(SVNTranslator.java:420)
at org.tmatesoft.svn.core.internal.wc17.SVNWCContext.getTranslatedFile(SVNWCContext.java:3099)
at org.tmatesoft.svn.core.internal.wc17.SVNWCContext.preservePreMergeFiles(SVNWCContext.java:3515)
at org.tmatesoft.svn.core.internal.wc17.SVNWCContext.mergeTextFile(SVNWCContext.java:3404)
at org.tmatesoft.svn.core.internal.wc17.SVNWCContext.merge(SVNWCContext.java:3200)
at org.tmatesoft.svn.core.internal.wc17.SVNUpdateEditor17.performFileMerge(SVNUpdateEditor17.java:2220)
at org.tmatesoft.svn.core.internal.wc17.SVNUpdateEditor17.mergeFile(SVNUpdateEditor17.java:2260)
at org.tmatesoft.svn.core.internal.wc17.SVNUpdateEditor17.closeFile(SVNUpdateEditor17.java:1588)
at org.tmatesoft.svn.core.internal.wc.SVNCancellableEditor.closeFile(SVNCancellableEditor.java:142)
at org.tmatesoft.svn.core.internal.io.dav.handlers.DAVEditorHandler.endElement(DAVEditorHandler.java:513)
at org.tmatesoft.svn.core.internal.io.dav.handlers.BasicDAVHandler.endElement(BasicDAVHandler.java:103)
at com.sun.org.apache.xerces.internal.parsers.AbstractSAXParser.endElement(Unknown Source)
at com.sun.org.apache.xerces.internal.impl.XMLDocumentFragmentScannerImpl.scanEndElement(Unknown Source)
at com.sun.org.apache.xerces.internal.impl.XMLDocumentFragmentScannerImpl$FragmentContentDriver.next(Unknown Source)
at com.sun.org.apache.xerces.internal.impl.XMLDocumentScannerImpl.next(Unknown Source)
at com.sun.org.apache.xerces.internal.impl.XMLNSDocumentScannerImpl.next(Unknown Source)
at com.sun.org.apache.xerces.internal.impl.XMLDocumentFragmentScannerImpl.scanDocument(Unknown Source)
at com.sun.org.apache.xerces.internal.parsers.XML11Configuration.parse(Unknown Source)
at com.sun.org.apache.xerces.internal.parsers.XML11Configuration.parse(Unknown Source)
at com.sun.org.apache.xerces.internal.parsers.XMLParser.parse(Unknown Source)
at com.sun.org.apache.xerces.internal.parsers.AbstractSAXParser.parse(Unknown Source)
at com.sun.org.apache.xerces.internal.jaxp.SAXParserImpl$JAXPSAXParser.parse(Unknown Source)
at org.tmatesoft.svn.core.internal.io.dav.http.HTTPConnection.readData(HTTPConnection.java:898)
at org.tmatesoft.svn.core.internal.io.dav.http.HTTPConnection.readData(HTTPConnection.java:863)
at org.tmatesoft.svn.core.internal.io.dav.http.HTTPRequest.dispatch(HTTPRequest.java:220)
at org.tmatesoft.svn.core.internal.io.dav.http.HTTPConnection.request(HTTPConnection.java:451)
Caused: org.tmatesoft.svn.core.SVNException: svn: E135000: File 'F:/jenkins/jenkins-slave/712657a4/workspace/POI/POI-DSL-Windows-1.16/poi-ooxml-lite/src/main/java9/module-info.java' has inconsistent newlines
at org.tmatesoft.svn.core.internal.wc.SVNErrorManager.error(SVNErrorManager.java:70)
at org.tmatesoft.svn.core.internal.wc.SVNErrorManager.error(SVNErrorManager.java:57)
at org.tmatesoft.svn.core.internal.io.dav.http.HTTPConnection.request(HTTPConnection.java:760)
at org.tmatesoft.svn.core.internal.io.dav.http.HTTPConnection.request(HTTPConnection.java:352)
at org.tmatesoft.svn.core.internal.io.dav.http.HTTPConnection.request(HTTPConnection.java:340)
at org.tmatesoft.svn.core.internal.io.dav.DAVConnection.performHttpRequest(DAVConnection.java:910)
at org.tmatesoft.svn.core.internal.io.dav.DAVConnection.doReport(DAVConnection.java:363)
at org.tmatesoft.svn.core.internal.io.dav.DAVRepository.runReport(DAVRepository.java:1361)
at org.tmatesoft.svn.core.internal.io.dav.DAVRepository.update(DAVRepository.java:859)
at org.tmatesoft.svn.core.internal.wc2.ng.SvnNgAbstractUpdate.updateInternal(SvnNgAbstractUpdate.java:263)
at org.tmatesoft.svn.core.internal.wc2.ng.SvnNgAbstractUpdate.update(SvnNgAbstractUpdate.java:115)
at org.tmatesoft.svn.core.internal.wc2.ng.SvnNgUpdate.run(SvnNgUpdate.java:40)
at org.tmatesoft.svn.core.internal.wc2.ng.SvnNgUpdate.run(SvnNgUpdate.java:18)
at org.tmatesoft.svn.core.internal.wc2.ng.SvnNgOperationRunner.run(SvnNgOperationRunner.java:20)
at org.tmatesoft.svn.core.internal.wc2.SvnOperationRunner.run(SvnOperationRunner.java:21)
at org.tmatesoft.svn.core.wc2.SvnOperationFactory.run(SvnOperationFactory.java:1239)
at org.tmatesoft.svn.core.wc2.SvnOperation.run(SvnOperation.java:294)
at org.tmatesoft.svn.core.wc.SVNUpdateClient.doUpdate(SVNUpdateClient.java:311)
at org.tmatesoft.svn.core.wc.SVNUpdateClient.doUpdate(SVNUpdateClient.java:291)
at org.tmatesoft.svn.core.wc.SVNUpdateClient.doUpdate(SVNUpdateClient.java:387)
at hudson.scm.subversion.UpdateUpdater$TaskImpl.perform(UpdateUpdater.java:159)
Caused: hudson.scm.subversion.UpdaterException: failed to perform svn update
Also: hudson.remoting.Channel$CallSiteStackTrace: Remote call to JNLP4-connect connection from jenkins-win-he-de-2.apache.org/144.76.15.28:57294
at hudson.remoting.Channel.attachCallSiteStackTrace(Channel.java:1800)
at hudson.remoting.UserRequest$ExceptionResponse.retrieve(UserRequest.java:357)
at hudson.remoting.Channel.call(Channel.java:1001)
at hudson.FilePath.act(FilePath.java:1157)
at hudson.FilePath.act(FilePath.java:1146)
at hudson.scm.SubversionSCM.checkout(SubversionSCM.java:945)
at hudson.scm.SubversionSCM.checkout(SubversionSCM.java:876)
at hudson.scm.SCM.checkout(SCM.java:505)
at hudson.model.AbstractProject.checkout(AbstractProject.java:1206)
at hudson.model.AbstractBuild$AbstractBuildExecution.defaultCheckout(AbstractBuild.java:637)
at jenkins.scm.SCMCheckoutStrategy.checkout(SCMCheckoutStrategy.java:86)
at hudson.model.AbstractBuild$AbstractBuildExecution.run(AbstractBuild.java:509)
at hudson.model.Run.execute(Run.java:1907)
at hudson.model.FreeStyleBuild.run(FreeStyleBuild.java:43)
at hudson.model.ResourceController.execute(ResourceController.java:97)
at hudson.model.Executor.run(Executor.java:429)
Caused: java.io.IOException
at hudson.scm.subversion.UpdateUpdater$TaskImpl.perform(UpdateUpdater.java:214)
at hudson.scm.subversion.WorkspaceUpdater$UpdateTask.delegateTo(WorkspaceUpdater.java:168)
at hudson.scm.SubversionSCM$CheckOutTask.perform(SubversionSCM.java:1049)
at hudson.scm.SubversionSCM$CheckOutTask.invoke(SubversionSCM.java:1025)
at hudson.scm.SubversionSCM$CheckOutTask.invoke(SubversionSCM.java:998)
at hudson.FilePath$FileCallableWrapper.call(FilePath.java:3313)
at hudson.remoting.UserRequest.perform(UserRequest.java:211)
at hudson.remoting.UserRequest.perform(UserRequest.java:54)
at hudson.remoting.Request$2.run(Request.java:375)
at hudson.remoting.InterceptingExecutorService$1.call(InterceptingExecutorService.java:73)
at java.util.concurrent.FutureTask.run(Unknown Source)
at java.util.concurrent.ThreadPoolExecutor.runWorker(Unknown Source)
at java.util.concurrent.ThreadPoolExecutor$Worker.run(Unknown Source)
at hudson.remoting.Engine$1.lambda$newThread$0(Engine.java:118)
at java.lang.Thread.run(Unknown Source)
Retrying after 10 seconds
Updating https://svn.apache.org/repos/asf/poi/trunk at revision '2021-07-07T03:17:25.576 -0700'
ERROR: Failed to update https://svn.apache.org/repos/asf/poi/trunk
org.tmatesoft.svn.core.SVNException: svn: E135000: File 'F:\jenkins\jenkins-slave\712657a4\workspace\POI\POI-DSL-Windows-1.16\poi-ooxml-lite\src\main\java9\module-info.java' has inconsistent newlines
at org.tmatesoft.svn.core.internal.wc.SVNErrorManager.error(SVNErrorManager.java:70)
at org.tmatesoft.svn.core.internal.wc.SVNErrorManager.error(SVNErrorManager.java:57)
at org.tmatesoft.svn.core.internal.io.dav.http.HTTPConnection.request(HTTPConnection.java:760)
at org.tmatesoft.svn.core.internal.io.dav.http.HTTPConnection.request(HTTPConnection.java:352)
at org.tmatesoft.svn.core.internal.io.dav.http.HTTPConnection.request(HTTPConnection.java:340)
at org.tmatesoft.svn.core.internal.io.dav.DAVConnection.performHttpRequest(DAVConnection.java:910)
at org.tmatesoft.svn.core.internal.io.dav.DAVConnection.doReport(DAVConnection.java:363)
at org.tmatesoft.svn.core.internal.io.dav.DAVRepository.runReport(DAVRepository.java:1361)
at org.tmatesoft.svn.core.internal.io.dav.DAVRepository.update(DAVRepository.java:859)
at org.tmatesoft.svn.core.internal.wc2.ng.SvnNgAbstractUpdate.updateInternal(SvnNgAbstractUpdate.java:263)
at org.tmatesoft.svn.core.internal.wc2.ng.SvnNgAbstractUpdate.update(SvnNgAbstractUpdate.java:115)
at org.tmatesoft.svn.core.internal.wc2.ng.SvnNgUpdate.run(SvnNgUpdate.java:40)
at org.tmatesoft.svn.core.internal.wc2.ng.SvnNgUpdate.run(SvnNgUpdate.java:18)
at org.tmatesoft.svn.core.internal.wc2.ng.SvnNgOperationRunner.run(SvnNgOperationRunner.java:20)
at org.tmatesoft.svn.core.internal.wc2.SvnOperationRunner.run(SvnOperationRunner.java:21)
at org.tmatesoft.svn.core.wc2.SvnOperationFactory.run(SvnOperationFactory.java:1239)
at org.tmatesoft.svn.core.wc2.SvnOperation.run(SvnOperation.java:294)
at org.tmatesoft.svn.core.wc.SVNUpdateClient.doUpdate(SVNUpdateClient.java:311)
at org.tmatesoft.svn.core.wc.SVNUpdateClient.doUpdate(SVNUpdateClient.java:291)
at org.tmatesoft.svn.core.wc.SVNUpdateClient.doUpdate(SVNUpdateClient.java:387)
at hudson.scm.subversion.UpdateUpdater$TaskImpl.perform(UpdateUpdater.java:159)
at hudson.scm.subversion.WorkspaceUpdater$UpdateTask.delegateTo(WorkspaceUpdater.java:168)
at hudson.scm.SubversionSCM$CheckOutTask.perform(SubversionSCM.java:1049)
at hudson.scm.SubversionSCM$CheckOutTask.invoke(SubversionSCM.java:1025)
at hudson.scm.SubversionSCM$CheckOutTask.invoke(SubversionSCM.java:998)
at hudson.FilePath$FileCallableWrapper.call(FilePath.java:3313)
at hudson.remoting.UserRequest.perform(UserRequest.java:211)
at hudson.remoting.UserRequest.perform(UserRequest.java:54)
at hudson.remoting.Request$2.run(Request.java:375)
at hudson.remoting.InterceptingExecutorService$1.call(InterceptingExecutorService.java:73)
at java.util.concurrent.FutureTask.run(Unknown Source)
at java.util.concurrent.ThreadPoolExecutor.runWorker(Unknown Source)
at java.util.concurrent.ThreadPoolExecutor$Worker.run(Unknown Source)
at hudson.remoting.Engine$1.lambda$newThread$0(Engine.java:118)
at java.lang.Thread.run(Unknown Source)
Caused by: org.tmatesoft.svn.core.SVNException: svn: E135000: File 'F:\jenkins\jenkins-slave\712657a4\workspace\POI\POI-DSL-Windows-1.16\poi-ooxml-lite\src\main\java9\module-info.java' has inconsistent newlines
at org.tmatesoft.svn.core.internal.wc.SVNErrorManager.error(SVNErrorManager.java:70)
at org.tmatesoft.svn.core.internal.wc.SVNErrorManager.error(SVNErrorManager.java:57)
at org.tmatesoft.svn.core.internal.wc.admin.SVNTranslator.checkWrappedException(SVNTranslator.java:436)
at org.tmatesoft.svn.core.internal.wc.admin.SVNTranslator.copyAndTranslate(SVNTranslator.java:420)
at org.tmatesoft.svn.core.internal.wc17.SVNWCContext.getTranslatedFile(SVNWCContext.java:3099)
at org.tmatesoft.svn.core.internal.wc17.SVNWCContext.preservePreMergeFiles(SVNWCContext.java:3515)
at org.tmatesoft.svn.core.internal.wc17.SVNWCContext.mergeTextFile(SVNWCContext.java:3404)
at org.tmatesoft.svn.core.internal.wc17.SVNWCContext.merge(SVNWCContext.java:3200)
at org.tmatesoft.svn.core.internal.wc17.SVNUpdateEditor17.performFileMerge(SVNUpdateEditor17.java:2220)
at org.tmatesoft.svn.core.internal.wc17.SVNUpdateEditor17.mergeFile(SVNUpdateEditor17.java:2260)
at org.tmatesoft.svn.core.internal.wc17.SVNUpdateEditor17.closeFile(SVNUpdateEditor17.java:1588)
at org.tmatesoft.svn.core.internal.wc.SVNCancellableEditor.closeFile(SVNCancellableEditor.java:142)
at org.tmatesoft.svn.core.internal.io.dav.handlers.DAVEditorHandler.endElement(DAVEditorHandler.java:513)
at org.tmatesoft.svn.core.internal.io.dav.handlers.BasicDAVHandler.endElement(BasicDAVHandler.java:103)
at com.sun.org.apache.xerces.internal.parsers.AbstractSAXParser.endElement(Unknown Source)
at com.sun.org.apache.xerces.internal.impl.XMLDocumentFragmentScannerImpl.scanEndElement(Unknown Source)
at com.sun.org.apache.xerces.internal.impl.XMLDocumentFragmentScannerImpl$FragmentContentDriver.next(Unknown Source)
at com.sun.org.apache.xerces.internal.impl.XMLDocumentScannerImpl.next(Unknown Source)
at com.sun.org.apache.xerces.internal.impl.XMLNSDocumentScannerImpl.next(Unknown Source)
at com.sun.org.apache.xerces.internal.impl.XMLDocumentFragmentScannerImpl.scanDocument(Unknown Source)
at com.sun.org.apache.xerces.internal.parsers.XML11Configuration.parse(Unknown Source)
at com.sun.org.apache.xerces.internal.parsers.XML11Configuration.parse(Unknown Source)
at com.sun.org.apache.xerces.internal.parsers.XMLParser.parse(Unknown Source)
at com.sun.org.apache.xerces.internal.parsers.AbstractSAXParser.parse(Unknown Source)
at com.sun.org.apache.xerces.internal.jaxp.SAXParserImpl$JAXPSAXParser.parse(Unknown Source)
at org.tmatesoft.svn.core.internal.io.dav.http.HTTPConnection.readData(HTTPConnection.java:898)
at org.tmatesoft.svn.core.internal.io.dav.http.HTTPConnection.readData(HTTPConnection.java:863)
at org.tmatesoft.svn.core.internal.io.dav.http.HTTPRequest.dispatch(HTTPRequest.java:220)
at org.tmatesoft.svn.core.internal.io.dav.http.HTTPConnection.request(HTTPConnection.java:451)
... 32 more
ERROR: Subversion update failed
org.tmatesoft.svn.core.SVNException: svn: E135000: File 'F:/jenkins/jenkins-slave/712657a4/workspace/POI/POI-DSL-Windows-1.16/poi-ooxml-lite/src/main/java9/module-info.java' has inconsistent newlines
at org.tmatesoft.svn.core.internal.wc.SVNErrorManager.error(SVNErrorManager.java:70)
at org.tmatesoft.svn.core.internal.wc.SVNErrorManager.error(SVNErrorManager.java:57)
at org.tmatesoft.svn.core.internal.wc.admin.SVNTranslator.checkWrappedException(SVNTranslator.java:436)
at org.tmatesoft.svn.core.internal.wc.admin.SVNTranslator.copyAndTranslate(SVNTranslator.java:420)
at org.tmatesoft.svn.core.internal.wc17.SVNWCContext.getTranslatedFile(SVNWCContext.java:3099)
at org.tmatesoft.svn.core.internal.wc17.SVNWCContext.preservePreMergeFiles(SVNWCContext.java:3515)
at org.tmatesoft.svn.core.internal.wc17.SVNWCContext.mergeTextFile(SVNWCContext.java:3404)
at org.tmatesoft.svn.core.internal.wc17.SVNWCContext.merge(SVNWCContext.java:3200)
at org.tmatesoft.svn.core.internal.wc17.SVNUpdateEditor17.performFileMerge(SVNUpdateEditor17.java:2220)
at org.tmatesoft.svn.core.internal.wc17.SVNUpdateEditor17.mergeFile(SVNUpdateEditor17.java:2260)
at org.tmatesoft.svn.core.internal.wc17.SVNUpdateEditor17.closeFile(SVNUpdateEditor17.java:1588)
at org.tmatesoft.svn.core.internal.wc.SVNCancellableEditor.closeFile(SVNCancellableEditor.java:142)
at org.tmatesoft.svn.core.internal.io.dav.handlers.DAVEditorHandler.endElement(DAVEditorHandler.java:513)
at org.tmatesoft.svn.core.internal.io.dav.handlers.BasicDAVHandler.endElement(BasicDAVHandler.java:103)
at com.sun.org.apache.xerces.internal.parsers.AbstractSAXParser.endElement(Unknown Source)
at com.sun.org.apache.xerces.internal.impl.XMLDocumentFragmentScannerImpl.scanEndElement(Unknown Source)
at com.sun.org.apache.xerces.internal.impl.XMLDocumentFragmentScannerImpl$FragmentContentDriver.next(Unknown Source)
at com.sun.org.apache.xerces.internal.impl.XMLDocumentScannerImpl.next(Unknown Source)
at com.sun.org.apache.xerces.internal.impl.XMLNSDocumentScannerImpl.next(Unknown Source)
at com.sun.org.apache.xerces.internal.impl.XMLDocumentFragmentScannerImpl.scanDocument(Unknown Source)
at com.sun.org.apache.xerces.internal.parsers.XML11Configuration.parse(Unknown Source)
at com.sun.org.apache.xerces.internal.parsers.XML11Configuration.parse(Unknown Source)
at com.sun.org.apache.xerces.internal.parsers.XMLParser.parse(Unknown Source)
at com.sun.org.apache.xerces.internal.parsers.AbstractSAXParser.parse(Unknown Source)
at com.sun.org.apache.xerces.internal.jaxp.SAXParserImpl$JAXPSAXParser.parse(Unknown Source)
at org.tmatesoft.svn.core.internal.io.dav.http.HTTPConnection.readData(HTTPConnection.java:898)
at org.tmatesoft.svn.core.internal.io.dav.http.HTTPConnection.readData(HTTPConnection.java:863)
at org.tmatesoft.svn.core.internal.io.dav.http.HTTPRequest.dispatch(HTTPRequest.java:220)
at org.tmatesoft.svn.core.internal.io.dav.http.HTTPConnection.request(HTTPConnection.java:451)
Caused: org.tmatesoft.svn.core.SVNException: svn: E135000: File 'F:/jenkins/jenkins-slave/712657a4/workspace/POI/POI-DSL-Windows-1.16/poi-ooxml-lite/src/main/java9/module-info.java' has inconsistent newlines
at org.tmatesoft.svn.core.internal.wc.SVNErrorManager.error(SVNErrorManager.java:70)
at org.tmatesoft.svn.core.internal.wc.SVNErrorManager.error(SVNErrorManager.java:57)
at org.tmatesoft.svn.core.internal.io.dav.http.HTTPConnection.request(HTTPConnection.java:760)
at org.tmatesoft.svn.core.internal.io.dav.http.HTTPConnection.request(HTTPConnection.java:352)
at org.tmatesoft.svn.core.internal.io.dav.http.HTTPConnection.request(HTTPConnection.java:340)
at org.tmatesoft.svn.core.internal.io.dav.DAVConnection.performHttpRequest(DAVConnection.java:910)
at org.tmatesoft.svn.core.internal.io.dav.DAVConnection.doReport(DAVConnection.java:363)
at org.tmatesoft.svn.core.internal.io.dav.DAVRepository.runReport(DAVRepository.java:1361)
at org.tmatesoft.svn.core.internal.io.dav.DAVRepository.update(DAVRepository.java:859)
at org.tmatesoft.svn.core.internal.wc2.ng.SvnNgAbstractUpdate.updateInternal(SvnNgAbstractUpdate.java:263)
at org.tmatesoft.svn.core.internal.wc2.ng.SvnNgAbstractUpdate.update(SvnNgAbstractUpdate.java:115)
at org.tmatesoft.svn.core.internal.wc2.ng.SvnNgUpdate.run(SvnNgUpdate.java:40)
at org.tmatesoft.svn.core.internal.wc2.ng.SvnNgUpdate.run(SvnNgUpdate.java:18)
at org.tmatesoft.svn.core.internal.wc2.ng.SvnNgOperationRunner.run(SvnNgOperationRunner.java:20)
at org.tmatesoft.svn.core.internal.wc2.SvnOperationRunner.run(SvnOperationRunner.java:21)
at org.tmatesoft.svn.core.wc2.SvnOperationFactory.run(SvnOperationFactory.java:1239)
at org.tmatesoft.svn.core.wc2.SvnOperation.run(SvnOperation.java:294)
at org.tmatesoft.svn.core.wc.SVNUpdateClient.doUpdate(SVNUpdateClient.java:311)
at org.tmatesoft.svn.core.wc.SVNUpdateClient.doUpdate(SVNUpdateClient.java:291)
at org.tmatesoft.svn.core.wc.SVNUpdateClient.doUpdate(SVNUpdateClient.java:387)
at hudson.scm.subversion.UpdateUpdater$TaskImpl.perform(UpdateUpdater.java:159)
Caused: hudson.scm.subversion.UpdaterException: failed to perform svn update
Also: hudson.remoting.Channel$CallSiteStackTrace: Remote call to JNLP4-connect connection from jenkins-win-he-de-2.apache.org/144.76.15.28:57294
at hudson.remoting.Channel.attachCallSiteStackTrace(Channel.java:1800)
at hudson.remoting.UserRequest$ExceptionResponse.retrieve(UserRequest.java:357)
at hudson.remoting.Channel.call(Channel.java:1001)
at hudson.FilePath.act(FilePath.java:1157)
at hudson.FilePath.act(FilePath.java:1146)
at hudson.scm.SubversionSCM.checkout(SubversionSCM.java:945)
at hudson.scm.SubversionSCM.checkout(SubversionSCM.java:876)
at hudson.scm.SCM.checkout(SCM.java:505)
at hudson.model.AbstractProject.checkout(AbstractProject.java:1206)
at hudson.model.AbstractBuild$AbstractBuildExecution.defaultCheckout(AbstractBuild.java:637)
at jenkins.scm.SCMCheckoutStrategy.checkout(SCMCheckoutStrategy.java:86)
at hudson.model.AbstractBuild$AbstractBuildExecution.run(AbstractBuild.java:509)
at hudson.model.Run.execute(Run.java:1907)
at hudson.model.FreeStyleBuild.run(FreeStyleBuild.java:43)
at hudson.model.ResourceController.execute(ResourceController.java:97)
at hudson.model.Executor.run(Executor.java:429)
Caused: java.io.IOException
at hudson.scm.subversion.UpdateUpdater$TaskImpl.perform(UpdateUpdater.java:214)
at hudson.scm.subversion.WorkspaceUpdater$UpdateTask.delegateTo(WorkspaceUpdater.java:168)
at hudson.scm.SubversionSCM$CheckOutTask.perform(SubversionSCM.java:1049)
at hudson.scm.SubversionSCM$CheckOutTask.invoke(SubversionSCM.java:1025)
at hudson.scm.SubversionSCM$CheckOutTask.invoke(SubversionSCM.java:998)
at hudson.FilePath$FileCallableWrapper.call(FilePath.java:3313)
at hudson.remoting.UserRequest.perform(UserRequest.java:211)
at hudson.remoting.UserRequest.perform(UserRequest.java:54)
at hudson.remoting.Request$2.run(Request.java:375)
at hudson.remoting.InterceptingExecutorService$1.call(InterceptingExecutorService.java:73)
at java.util.concurrent.FutureTask.run(Unknown Source)
at java.util.concurrent.ThreadPoolExecutor.runWorker(Unknown Source)
at java.util.concurrent.ThreadPoolExecutor$Worker.run(Unknown Source)
at hudson.remoting.Engine$1.lambda$newThread$0(Engine.java:118)
at java.lang.Thread.run(Unknown Source)
[SpotBugs] Skipping execution of recorder since overall result is 'FAILURE'
Archiving artifacts
[Fast Archiver] Compressed 223.31 MB of artifacts by 100.0% relative to #13
Skipping publisher since build result is FAILURE
Recording test results
ERROR: Step ‘Publish JUnit test result report’ failed: Test reports were found but none of them are new. Did leafNodes run?
For example, <https://ci-builds.apache.org/job/POI/job/POI-DSL-Windows-1.16/ws/poi-excelant\build\test-results\TEST-org.apache.poi.ss.excelant.TestBuildFile.xml> is 2 days 19 hr old
---------------------------------------------------------------------
To unsubscribe, e-mail: dev-unsubscribe@poi.apache.org
For additional commands, e-mail: dev-help@poi.apache.org
Build failed in Jenkins: POI » POI-DSL-Windows-1.16 #20
Posted by Apache Jenkins Server <je...@builds.apache.org>.
See <https://ci-builds.apache.org/job/POI/job/POI-DSL-Windows-1.16/20/display/redirect?page=changes>
Changes:
[Andreas Beeker] try to fix new custom Junit Annotation module dependency
------------------------------------------
[...truncated 2.04 KB...]
M poi-examples\src\main\java9\module-info.class
M poi-ooxml\src\main\java9\module-info.class
M poi-ooxml\src\test\java9\module-info.class
M poi-ooxml-full\src\main\java9\module-info.class
M poi-ooxml-lite-agent\src\main\java9\module-info.class
M poi-scratchpad\src\main\java9\module-info.class
M poi-scratchpad\src\test\java9\module-info.class
X src\documentation
Performing status on external item at 'src\documentation':
svn: E155010: The node 'F:\jenkins\jenkins-slave\712657a4\workspace\POI\POI-DSL-Windows-1.16\poi*\src\*' was not found.
Java-Home: f:\\jenkins\\tools\\java\\latest16
Volume in drive F is data
Volume Serial Number is B2AC-24AD
Directory of f:\jenkins\tools\java\latest16
11/14/2020 06:56 AM <DIR> .
11/14/2020 06:56 AM <DIR> ..
11/14/2020 06:56 AM <DIR> bin
11/14/2020 06:56 AM <DIR> conf
11/14/2020 06:56 AM <DIR> include
11/14/2020 06:56 AM <DIR> jmods
11/14/2020 06:56 AM <DIR> legal
11/14/2020 06:56 AM <DIR> lib
11/11/2020 09:41 PM 1,165 release
1 File(s) 1,165 bytes
8 Dir(s) 2,868,073,541,632 bytes free
openjdk version "16-ea" 2021-03-16
OpenJDK Runtime Environment (build 16-ea+24-1553)
OpenJDK 64-Bit Server VM (build 16-ea+24-1553, mixed mode, sharing)
[POI-DSL-Windows-1.16] $ cmd.exe /C "F:\jenkins\tools\ant\latest1.10\bin\ant.bat -Dcoverage.enabled=true clean jenkins && exit %%ERRORLEVEL%%"
Buildfile: <https://ci-builds.apache.org/job/POI/job/POI-DSL-Windows-1.16/ws/build.xml>
[mkdir] Created dir: <https://ci-builds.apache.org/job/POI/job/POI-DSL-Windows-1.16/ws/poi-excelant\build\poi-ant-contrib>
[javac] Compiling 3 source files to <https://ci-builds.apache.org/job/POI/job/POI-DSL-Windows-1.16/ws/poi-excelant\build\poi-ant-contrib>
clean:
[delete] Deleting directory <https://ci-builds.apache.org/job/POI/job/POI-DSL-Windows-1.16/ws/build>
[delete] Deleting directory <https://ci-builds.apache.org/job/POI/job/POI-DSL-Windows-1.16/ws/poi-examples\build>
[delete] Deleting directory <https://ci-builds.apache.org/job/POI/job/POI-DSL-Windows-1.16/ws/poi-excelant\build>
[delete] Deleting directory <https://ci-builds.apache.org/job/POI/job/POI-DSL-Windows-1.16/ws/poi-integration\build>
[delete] Deleting directory <https://ci-builds.apache.org/job/POI/job/POI-DSL-Windows-1.16/ws/poi\build>
[delete] Deleting directory <https://ci-builds.apache.org/job/POI/job/POI-DSL-Windows-1.16/ws/poi-ooxml\build>
[delete] Deleting directory <https://ci-builds.apache.org/job/POI/job/POI-DSL-Windows-1.16/ws/poi-ooxml-full\build>
[delete] Deleting directory <https://ci-builds.apache.org/job/POI/job/POI-DSL-Windows-1.16/ws/poi-scratchpad\build>
replaceVersion:
check-jars:
fetch-jars:
check-ooxml-jars:
fetch-ooxml-jars:
[get] Destination already exists (skipping): <https://ci-builds.apache.org/job/POI/job/POI-DSL-Windows-1.16/ws/lib\ooxml\curvesapi-1.06.jar>
[get] Getting: https://repo1.maven.org/maven2/org/apache/xmlbeans/xmlbeans/5.0.0/xmlbeans-5.0.0.jar
[get] To: <https://ci-builds.apache.org/job/POI/job/POI-DSL-Windows-1.16/ws/lib\ooxml\xmlbeans-5.0.0.jar>
[get] Destination already exists (skipping): <https://ci-builds.apache.org/job/POI/job/POI-DSL-Windows-1.16/ws/lib\ooxml\commons-compress-1.20.jar>
[get] Destination already exists (skipping): <https://ci-builds.apache.org/job/POI/job/POI-DSL-Windows-1.16/ws/lib\ooxml-tests\reflections-0.9.12.jar>
[get] Destination already exists (skipping): <https://ci-builds.apache.org/job/POI/job/POI-DSL-Windows-1.16/ws/lib\ooxml-tests\guava-30.1-jre.jar>
[get] Destination already exists (skipping): <https://ci-builds.apache.org/job/POI/job/POI-DSL-Windows-1.16/ws/lib\ooxml-tests\javassist-3.27.0-GA.jar>
[get] Destination already exists (skipping): <https://ci-builds.apache.org/job/POI/job/POI-DSL-Windows-1.16/ws/lib\ooxml-tests\slf4j-api-1.7.31.jar>
[get] Destination already exists (skipping): <https://ci-builds.apache.org/job/POI/job/POI-DSL-Windows-1.16/ws/lib\ooxml-batik\batik-anim-1.14.jar>
[get] Destination already exists (skipping): <https://ci-builds.apache.org/job/POI/job/POI-DSL-Windows-1.16/ws/lib\ooxml-batik\batik-awt-util-1.14.jar>
[get] Destination already exists (skipping): <https://ci-builds.apache.org/job/POI/job/POI-DSL-Windows-1.16/ws/lib\ooxml-batik\batik-bridge-1.14.jar>
[get] Destination already exists (skipping): <https://ci-builds.apache.org/job/POI/job/POI-DSL-Windows-1.16/ws/lib\ooxml-batik\batik-codec-1.14.jar>
[get] Destination already exists (skipping): <https://ci-builds.apache.org/job/POI/job/POI-DSL-Windows-1.16/ws/lib\ooxml-batik\batik-constants-1.14.jar>
[get] Destination already exists (skipping): <https://ci-builds.apache.org/job/POI/job/POI-DSL-Windows-1.16/ws/lib\ooxml-batik\batik-css-1.14.jar>
[get] Destination already exists (skipping): <https://ci-builds.apache.org/job/POI/job/POI-DSL-Windows-1.16/ws/lib\ooxml-batik\batik-dom-1.14.jar>
[get] Destination already exists (skipping): <https://ci-builds.apache.org/job/POI/job/POI-DSL-Windows-1.16/ws/lib\ooxml-batik\batik-ext-1.14.jar>
[get] Destination already exists (skipping): <https://ci-builds.apache.org/job/POI/job/POI-DSL-Windows-1.16/ws/lib\ooxml-batik\batik-gvt-1.14.jar>
[get] Destination already exists (skipping): <https://ci-builds.apache.org/job/POI/job/POI-DSL-Windows-1.16/ws/lib\ooxml-batik\batik-i18n-1.14.jar>
[get] Destination already exists (skipping): <https://ci-builds.apache.org/job/POI/job/POI-DSL-Windows-1.16/ws/lib\ooxml-batik\batik-parser-1.14.jar>
[get] Destination already exists (skipping): <https://ci-builds.apache.org/job/POI/job/POI-DSL-Windows-1.16/ws/lib\ooxml-batik\batik-script-1.14.jar>
[get] Destination already exists (skipping): <https://ci-builds.apache.org/job/POI/job/POI-DSL-Windows-1.16/ws/lib\ooxml-batik\batik-shared-resources-1.14.jar>
[get] Destination already exists (skipping): <https://ci-builds.apache.org/job/POI/job/POI-DSL-Windows-1.16/ws/lib\ooxml-batik\batik-svg-dom-1.14.jar>
[get] Destination already exists (skipping): <https://ci-builds.apache.org/job/POI/job/POI-DSL-Windows-1.16/ws/lib\ooxml-batik\batik-svggen-1.14.jar>
[get] Destination already exists (skipping): <https://ci-builds.apache.org/job/POI/job/POI-DSL-Windows-1.16/ws/lib\ooxml-batik\batik-svgrasterizer-1.14.jar>
[get] Destination already exists (skipping): <https://ci-builds.apache.org/job/POI/job/POI-DSL-Windows-1.16/ws/lib\ooxml-batik\batik-transcoder-1.14.jar>
[get] Destination already exists (skipping): <https://ci-builds.apache.org/job/POI/job/POI-DSL-Windows-1.16/ws/lib\ooxml-batik\batik-util-1.14.jar>
[get] Destination already exists (skipping): <https://ci-builds.apache.org/job/POI/job/POI-DSL-Windows-1.16/ws/lib\ooxml-batik\batik-xml-1.14.jar>
[get] Destination already exists (skipping): <https://ci-builds.apache.org/job/POI/job/POI-DSL-Windows-1.16/ws/lib\ooxml-batik\xml-apis-ext-1.3.04.jar>
[get] Destination already exists (skipping): <https://ci-builds.apache.org/job/POI/job/POI-DSL-Windows-1.16/ws/lib\ooxml-batik\xmlgraphics-commons-2.4.jar>
[get] Destination already exists (skipping): <https://ci-builds.apache.org/job/POI/job/POI-DSL-Windows-1.16/ws/lib\ooxml-provided\pdfbox-2.0.24.jar>
[get] Destination already exists (skipping): <https://ci-builds.apache.org/job/POI/job/POI-DSL-Windows-1.16/ws/lib\ooxml-provided\fontbox-2.0.24.jar>
[get] Destination already exists (skipping): <https://ci-builds.apache.org/job/POI/job/POI-DSL-Windows-1.16/ws/lib\ooxml-provided\graphics2d-0.32.jar>
init:
[mkdir] Created dir: <https://ci-builds.apache.org/job/POI/job/POI-DSL-Windows-1.16/ws/build>
[mkdir] Created dir: <https://ci-builds.apache.org/job/POI/job/POI-DSL-Windows-1.16/ws/poi\build\classes\ant\java>
[mkdir] Created dir: <https://ci-builds.apache.org/job/POI/job/POI-DSL-Windows-1.16/ws/poi\build\test-classes>
[mkdir] Created dir: <https://ci-builds.apache.org/job/POI/job/POI-DSL-Windows-1.16/ws/poi\build\test-results>
[mkdir] Created dir: <https://ci-builds.apache.org/job/POI/job/POI-DSL-Windows-1.16/ws/poi-scratchpad\build\classes\ant\java>
[mkdir] Created dir: <https://ci-builds.apache.org/job/POI/job/POI-DSL-Windows-1.16/ws/poi-scratchpad\build\test-classes>
[mkdir] Created dir: <https://ci-builds.apache.org/job/POI/job/POI-DSL-Windows-1.16/ws/poi-scratchpad\build\test-results>
[mkdir] Created dir: <https://ci-builds.apache.org/job/POI/job/POI-DSL-Windows-1.16/ws/poi-ooxml\build\classes\ant\java>
[mkdir] Created dir: <https://ci-builds.apache.org/job/POI/job/POI-DSL-Windows-1.16/ws/poi-ooxml\build\test-classes>
[mkdir] Created dir: <https://ci-builds.apache.org/job/POI/job/POI-DSL-Windows-1.16/ws/poi-ooxml-full\build\classes\ant\java>
[mkdir] Created dir: <https://ci-builds.apache.org/job/POI/job/POI-DSL-Windows-1.16/ws/poi-ooxml-full\build\test-classes>
[mkdir] Created dir: <https://ci-builds.apache.org/job/POI/job/POI-DSL-Windows-1.16/ws/poi-ooxml-full\build\generated-sources>
[mkdir] Created dir: <https://ci-builds.apache.org/job/POI/job/POI-DSL-Windows-1.16/ws/poi-ooxml-full\build\generated-classes>
[mkdir] Created dir: <https://ci-builds.apache.org/job/POI/job/POI-DSL-Windows-1.16/ws/poi-ooxml\build\test-results>
[mkdir] Created dir: <https://ci-builds.apache.org/job/POI/job/POI-DSL-Windows-1.16/ws/poi-excelant\build\classes\ant\java>
[mkdir] Created dir: <https://ci-builds.apache.org/job/POI/job/POI-DSL-Windows-1.16/ws/poi-excelant\build\test-classes>
[mkdir] Created dir: <https://ci-builds.apache.org/job/POI/job/POI-DSL-Windows-1.16/ws/poi-excelant\build\test-results>
[mkdir] Created dir: <https://ci-builds.apache.org/job/POI/job/POI-DSL-Windows-1.16/ws/poi-examples\build\classes\ant\java>
[mkdir] Created dir: <https://ci-builds.apache.org/job/POI/job/POI-DSL-Windows-1.16/ws/poi-integration\build\test-classes>
[mkdir] Created dir: <https://ci-builds.apache.org/job/POI/job/POI-DSL-Windows-1.16/ws/poi-integration\build\test-results>
[mkdir] Created dir: <https://ci-builds.apache.org/job/POI/job/POI-DSL-Windows-1.16/ws/build\dist>
[mkdir] Created dir: <https://ci-builds.apache.org/job/POI/job/POI-DSL-Windows-1.16/ws/build\site>
[echo] Using Ant: Apache Ant(TM) version 1.10.9 compiled on September 27 2020 from F:\\jenkins\\tools\\ant\\latest1.10, Ant detected Java 16 (may be different than actual Java sometimes...)
[echo] Using Java: 16-ea/16-ea+24-1553/16-ea+24-1553/OpenJDK 64-Bit Server VM from Oracle Corporation on Windows Server 2016: 10.0
[echo] Building Apache POI version 5.0.1-SNAPSHOT and RC: RC1, isJava8: false
[echo] Compiling for Java 9+
-version-java-check:
compile-version:
[mkdir] Created dir: <https://ci-builds.apache.org/job/POI/job/POI-DSL-Windows-1.16/ws/poi\build\generated-sources\org\apache\poi>
[copy] Copying 1 file to <https://ci-builds.apache.org/job/POI/job/POI-DSL-Windows-1.16/ws/poi\build\generated-sources\org\apache\poi>
[javac] Compiling 1 source file to <https://ci-builds.apache.org/job/POI/job/POI-DSL-Windows-1.16/ws/poi\build\classes\ant\java>
[javac] warning: [options] bootstrap class path not set in conjunction with -source 8
[javac] 1 warning
compile-main:
[javac] Compiling 1171 source files to <https://ci-builds.apache.org/job/POI/job/POI-DSL-Windows-1.16/ws/poi\build\classes\ant\java>
[javac] Ignoring source, target and bootclasspath as release has been set
[javac] Note: Some input files use or override a deprecated API.
[javac] Note: Recompile with -Xlint:deprecation for details.
[javac] Note: Some input files use unchecked or unsafe operations.
[javac] Note: Recompile with -Xlint:unchecked for details.
[javac] Creating empty <https://ci-builds.apache.org/job/POI/job/POI-DSL-Windows-1.16/ws/poi\build\classes\ant\java\org\apache\poi\ddf\package-info.class>
[javac] Creating empty <https://ci-builds.apache.org/job/POI/job/POI-DSL-Windows-1.16/ws/poi\build\classes\ant\java\org\apache\poi\hssf\package-info.class>
[javac] Creating empty <https://ci-builds.apache.org/job/POI/job/POI-DSL-Windows-1.16/ws/poi\build\classes\ant\java\org\apache\poi\poifs\dev\package-info.class>
[javac] Creating empty <https://ci-builds.apache.org/job/POI/job/POI-DSL-Windows-1.16/ws/poi\build\classes\ant\java\org\apache\poi\util\package-info.class>
[javac] Creating empty <https://ci-builds.apache.org/job/POI/job/POI-DSL-Windows-1.16/ws/poi\build\classes\ant\java\org\apache\poi\poifs\common\package-info.class>
[javac] Creating empty <https://ci-builds.apache.org/job/POI/job/POI-DSL-Windows-1.16/ws/poi\build\classes\ant\java\org\apache\poi\hssf\record\package-info.class>
[javac] Creating empty <https://ci-builds.apache.org/job/POI/job/POI-DSL-Windows-1.16/ws/poi\build\classes\ant\java\org\apache\poi\poifs\package-info.class>
[javac] Creating empty <https://ci-builds.apache.org/job/POI/job/POI-DSL-Windows-1.16/ws/poi\build\classes\ant\java\org\apache\poi\poifs\crypt\package-info.class>
[javac] Creating empty <https://ci-builds.apache.org/job/POI/job/POI-DSL-Windows-1.16/ws/poi\build\classes\ant\java\org\apache\poi\hpsf\wellknown\package-info.class>
[javac] Creating empty <https://ci-builds.apache.org/job/POI/job/POI-DSL-Windows-1.16/ws/poi\build\classes\ant\java\org\apache\poi\hssf\dev\package-info.class>
[javac] Creating empty <https://ci-builds.apache.org/job/POI/job/POI-DSL-Windows-1.16/ws/poi\build\classes\ant\java\org\apache\poi\ss\formula\package-info.class>
[javac] Creating empty <https://ci-builds.apache.org/job/POI/job/POI-DSL-Windows-1.16/ws/poi\build\classes\ant\java\org\apache\poi\hpsf\package-info.class>
[javac] Creating empty <https://ci-builds.apache.org/job/POI/job/POI-DSL-Windows-1.16/ws/poi\build\classes\ant\java\org\apache\poi\poifs\property\package-info.class>
[javac] Creating empty <https://ci-builds.apache.org/job/POI/job/POI-DSL-Windows-1.16/ws/poi\build\classes\ant\java\org\apache\poi\poifs\filesystem\package-info.class>
[javac] Creating empty <https://ci-builds.apache.org/job/POI/job/POI-DSL-Windows-1.16/ws/poi\build\classes\ant\java\org\apache\poi\ss\formula\ptg\package-info.class>
[javac] Creating empty <https://ci-builds.apache.org/job/POI/job/POI-DSL-Windows-1.16/ws/poi\build\classes\ant\java\org\apache\poi\poifs\storage\package-info.class>
[javac] Creating empty <https://ci-builds.apache.org/job/POI/job/POI-DSL-Windows-1.16/ws/poi\build\classes\ant\java\org\apache\poi\hssf\eventusermodel\package-info.class>
[javac] Creating empty <https://ci-builds.apache.org/job/POI/job/POI-DSL-Windows-1.16/ws/poi\build\classes\ant\java\org\apache\poi\hssf\record\aggregates\package-info.class>
[javac] Creating empty <https://ci-builds.apache.org/job/POI/job/POI-DSL-Windows-1.16/ws/poi\build\classes\ant\java\org\apache\poi\ss\format\package-info.class>
[javac] Creating empty <https://ci-builds.apache.org/job/POI/job/POI-DSL-Windows-1.16/ws/poi\build\classes\ant\java\org\apache\poi\hssf\model\package-info.class>
[javac] Creating empty <https://ci-builds.apache.org/job/POI/job/POI-DSL-Windows-1.16/ws/poi\build\classes\ant\java\org\apache\poi\hssf\usermodel\package-info.class>
[javac] Creating empty <https://ci-builds.apache.org/job/POI/job/POI-DSL-Windows-1.16/ws/poi\build\classes\ant\java\org\apache\poi\hssf\util\package-info.class>
[javac] Creating empty <https://ci-builds.apache.org/job/POI/job/POI-DSL-Windows-1.16/ws/poi\build\classes\ant\java\org\apache\poi\poifs\eventfilesystem\package-info.class>
[mkdir] Created dir: <https://ci-builds.apache.org/job/POI/job/POI-DSL-Windows-1.16/ws/build\dist\maven\poi>
[echo] Building jar for poi, module-name: poi with isJava8: false
[jar] Building jar: <https://ci-builds.apache.org/job/POI/job/POI-DSL-Windows-1.16/ws/build\dist\maven\poi\poi-5.0.1-SNAPSHOT.jar>
[javac] Compiling 517 source files to <https://ci-builds.apache.org/job/POI/job/POI-DSL-Windows-1.16/ws/poi\build\test-classes>
[javac] Ignoring source, target and bootclasspath as release has been set
[javac] Note: Some input files use or override a deprecated API.
[javac] Note: Recompile with -Xlint:deprecation for details.
[echo] Building test-jar for poi, module-name: poi with isJava8: false
[jar] Building jar: <https://ci-builds.apache.org/job/POI/job/POI-DSL-Windows-1.16/ws/build\dist\maven\poi-tests\poi-5.0.1-SNAPSHOT-tests.jar>
[jar] Building jar: <https://ci-builds.apache.org/job/POI/job/POI-DSL-Windows-1.16/ws/build\dist\maven\poi\poi-5.0.1-SNAPSHOT-sources.jar>
compile-scratchpad:
[javac] Compiling 514 source files to <https://ci-builds.apache.org/job/POI/job/POI-DSL-Windows-1.16/ws/poi-scratchpad\build\classes\ant\java>
[javac] Ignoring source, target and bootclasspath as release has been set
[javac] Note: Some input files use or override a deprecated API.
[javac] Note: Recompile with -Xlint:deprecation for details.
[javac] Note: <https://ci-builds.apache.org/job/POI/job/POI-DSL-Windows-1.16/ws/poi-scratchpad\src\main\java\org\apache\poi\hwpf\model\BytePropertyNode.java> uses unchecked or unsafe operations.
[javac] Note: Recompile with -Xlint:unchecked for details.
[mkdir] Created dir: <https://ci-builds.apache.org/job/POI/job/POI-DSL-Windows-1.16/ws/build\dist\maven\poi-scratchpad>
[echo] Building jar for poi-scratchpad, module-name: scratchpad with isJava8: false
[jar] Building jar: <https://ci-builds.apache.org/job/POI/job/POI-DSL-Windows-1.16/ws/build\dist\maven\poi-scratchpad\poi-scratchpad-5.0.1-SNAPSHOT.jar>
[javac] Compiling 197 source files to <https://ci-builds.apache.org/job/POI/job/POI-DSL-Windows-1.16/ws/poi-scratchpad\build\test-classes>
[javac] Ignoring source, target and bootclasspath as release has been set
[javac] Note: Some input files use or override a deprecated API.
[javac] Note: Recompile with -Xlint:deprecation for details.
[echo] Building test-jar for poi-scratchpad, module-name: scratchpad with isJava8: false
[jar] Building jar: <https://ci-builds.apache.org/job/POI/job/POI-DSL-Windows-1.16/ws/build\dist\maven\poi-scratchpad-tests\poi-scratchpad-5.0.1-SNAPSHOT-tests.jar>
[jar] Building jar: <https://ci-builds.apache.org/job/POI/job/POI-DSL-Windows-1.16/ws/build\dist\maven\poi-scratchpad\poi-scratchpad-5.0.1-SNAPSHOT-sources.jar>
check-compiled-ooxml-xsds:
compile-ooxml-xsds:
[mkdir] Created dir: <https://ci-builds.apache.org/job/POI/job/POI-DSL-Windows-1.16/ws/poi-ooxml-full\build\xsds>
[copy] Copying 8 files to <https://ci-builds.apache.org/job/POI/job/POI-DSL-Windows-1.16/ws/poi-ooxml-full\build\xsds>
[copy] Copying 28 resources to <https://ci-builds.apache.org/job/POI/job/POI-DSL-Windows-1.16/ws/poi-ooxml-full\build\xsds>
[xmlbean] SchemaCompiler Metadata LOAD:org/apache/xmlbeans/metadata GEN:org/apache/poi/schemas/ooxml
[xmlbean] Time to build schema type system: 2.639 seconds
[xmlbean] Time to generate code: 14.126 seconds
[javac] Compiling 5064 source files to <https://ci-builds.apache.org/job/POI/job/POI-DSL-Windows-1.16/ws/poi-ooxml-full\build\classes\ant\java>
[javac] Ignoring source, target and bootclasspath as release has been set
[mkdir] Created dir: <https://ci-builds.apache.org/job/POI/job/POI-DSL-Windows-1.16/ws/build\dist\maven\poi-ooxml-full>
[jar] Building jar: <https://ci-builds.apache.org/job/POI/job/POI-DSL-Windows-1.16/ws/build\dist\maven\poi-ooxml-full\poi-ooxml-full-5.0.1-SNAPSHOT.jar>
[jar] Building jar: <https://ci-builds.apache.org/job/POI/job/POI-DSL-Windows-1.16/ws/build\dist\maven\poi-ooxml-full\poi-ooxml-full-5.0.1-SNAPSHOT-sources.jar>
compile-ooxml:
[javac] Compiling 620 source files to <https://ci-builds.apache.org/job/POI/job/POI-DSL-Windows-1.16/ws/poi-ooxml\build\classes\ant\java>
[javac] Ignoring source, target and bootclasspath as release has been set
[javac] Note: Some input files use or override a deprecated API.
[javac] Note: Recompile with -Xlint:deprecation for details.
[javac] Note: <https://ci-builds.apache.org/job/POI/job/POI-DSL-Windows-1.16/ws/poi-ooxml\src\main\java\org\apache\poi\xslf\draw\SVGImageRenderer.java> uses unchecked or unsafe operations.
[javac] Note: Recompile with -Xlint:unchecked for details.
[javac] Creating empty <https://ci-builds.apache.org/job/POI/job/POI-DSL-Windows-1.16/ws/poi-ooxml\build\classes\ant\java\org\apache\poi\xwpf\package-info.class>
[javac] Creating empty <https://ci-builds.apache.org/job/POI/job/POI-DSL-Windows-1.16/ws/poi-ooxml\build\classes\ant\java\org\apache\poi\xssf\binary\package-info.class>
[mkdir] Created dir: <https://ci-builds.apache.org/job/POI/job/POI-DSL-Windows-1.16/ws/build\dist\maven\poi-ooxml>
[echo] Building jar for poi-ooxml, module-name: ooxml with isJava8: false
[jar] Building jar: <https://ci-builds.apache.org/job/POI/job/POI-DSL-Windows-1.16/ws/build\dist\maven\poi-ooxml\poi-ooxml-5.0.1-SNAPSHOT.jar>
[javac] Compiling 272 source files to <https://ci-builds.apache.org/job/POI/job/POI-DSL-Windows-1.16/ws/poi-ooxml\build\test-classes>
[javac] Ignoring source, target and bootclasspath as release has been set
[javac] Note: Some input files use or override a deprecated API.
[javac] Note: Recompile with -Xlint:deprecation for details.
[echo] Building test-jar for poi-ooxml, module-name: ooxml with isJava8: false
[jar] Building jar: <https://ci-builds.apache.org/job/POI/job/POI-DSL-Windows-1.16/ws/build\dist\maven\poi-ooxml-tests\poi-ooxml-5.0.1-SNAPSHOT-tests.jar>
[jar] Building jar: <https://ci-builds.apache.org/job/POI/job/POI-DSL-Windows-1.16/ws/build\dist\maven\poi-ooxml\poi-ooxml-5.0.1-SNAPSHOT-sources.jar>
[jar] Building jar: <https://ci-builds.apache.org/job/POI/job/POI-DSL-Windows-1.16/ws/build\dist\maven\poi-ooxml-lite-agent\poi-ooxml-lite-agent-5.0.1-SNAPSHOT.jar>
compile-examples:
[javac] Compiling 138 source files to <https://ci-builds.apache.org/job/POI/job/POI-DSL-Windows-1.16/ws/poi-examples\build\classes\ant\java>
[javac] Ignoring source, target and bootclasspath as release has been set
[javac] Creating empty <https://ci-builds.apache.org/job/POI/job/POI-DSL-Windows-1.16/ws/poi-examples\build\classes\ant\java\org\apache\poi\examples\ss\html\package-info.class>
[mkdir] Created dir: <https://ci-builds.apache.org/job/POI/job/POI-DSL-Windows-1.16/ws/build\dist\maven\poi-examples>
[echo] Building jar for poi-examples, module-name: examples with isJava8: false
[jar] Building jar: <https://ci-builds.apache.org/job/POI/job/POI-DSL-Windows-1.16/ws/build\dist\maven\poi-examples\poi-examples-5.0.1-SNAPSHOT.jar>
[echo] Building test-jar for poi-examples, module-name: examples with isJava8: false
[jar] Building jar: <https://ci-builds.apache.org/job/POI/job/POI-DSL-Windows-1.16/ws/build\dist\maven\poi-examples\poi-examples-5.0.1-SNAPSHOT-sources.jar>
compile-excelant:
[javac] Compiling 14 source files to <https://ci-builds.apache.org/job/POI/job/POI-DSL-Windows-1.16/ws/poi-excelant\build\classes\ant\java>
[javac] Ignoring source, target and bootclasspath as release has been set
[javac] Compiling 1 source file to <https://ci-builds.apache.org/job/POI/job/POI-DSL-Windows-1.16/ws/poi-excelant\src\main\java9>
[javac] error: module not found: org.apache.poi.ooxml.schemas
[javac] error: module not found: org.apache.xmlbeans
[javac] 2 errors
BUILD FAILED
<https://ci-builds.apache.org/job/POI/job/POI-DSL-Windows-1.16/ws/build.xml>:1462: The following error occurred while executing this line:
<https://ci-builds.apache.org/job/POI/job/POI-DSL-Windows-1.16/ws/build.xml>:1093: Compile failed; see the compiler error output for details.
Total time: 5 minutes 18 seconds
Build step 'Invoke Ant' marked build as failure
[SpotBugs] Skipping execution of recorder since overall result is 'FAILURE'
Archiving artifacts
Skipping publisher since build result is FAILURE
Recording test results
ERROR: Step ‘Publish JUnit test result report’ failed: No test report files were found. Configuration error?
---------------------------------------------------------------------
To unsubscribe, e-mail: dev-unsubscribe@poi.apache.org
For additional commands, e-mail: dev-help@poi.apache.org
Build failed in Jenkins: POI » POI-DSL-Windows-1.16 #19
Posted by Apache Jenkins Server <je...@builds.apache.org>.
See <https://ci-builds.apache.org/job/POI/job/POI-DSL-Windows-1.16/19/display/redirect>
Changes:
------------------------------------------
[...truncated 2.93 KB...]
M poi-ooxml\src\main\java9\module-info.class
M poi-ooxml\src\test\java9\module-info.class
M poi-ooxml-full\src\main\java9\module-info.class
M poi-ooxml-lite-agent\src\main\java9\module-info.class
M poi-scratchpad\src\main\java9\module-info.class
M poi-scratchpad\src\test\java9\module-info.class
X src\documentation
Performing status on external item at 'src\documentation':
svn: E155010: The node 'F:\jenkins\jenkins-slave\712657a4\workspace\POI\POI-DSL-Windows-1.16\poi*\src\*' was not found.
Java-Home: f:\\jenkins\\tools\\java\\latest16
Volume in drive F is data
Volume Serial Number is B2AC-24AD
Directory of f:\jenkins\tools\java\latest16
11/14/2020 06:56 AM <DIR> .
11/14/2020 06:56 AM <DIR> ..
11/14/2020 06:56 AM <DIR> bin
11/14/2020 06:56 AM <DIR> conf
11/14/2020 06:56 AM <DIR> include
11/14/2020 06:56 AM <DIR> jmods
11/14/2020 06:56 AM <DIR> legal
11/14/2020 06:56 AM <DIR> lib
11/11/2020 09:41 PM 1,165 release
1 File(s) 1,165 bytes
8 Dir(s) 2,868,073,709,568 bytes free
openjdk version "16-ea" 2021-03-16
OpenJDK Runtime Environment (build 16-ea+24-1553)
OpenJDK 64-Bit Server VM (build 16-ea+24-1553, mixed mode, sharing)
[POI-DSL-Windows-1.16] $ cmd.exe /C "F:\jenkins\tools\ant\latest1.10\bin\ant.bat -Dcoverage.enabled=true clean jenkins && exit %%ERRORLEVEL%%"
Buildfile: <https://ci-builds.apache.org/job/POI/job/POI-DSL-Windows-1.16/ws/build.xml>
[mkdir] Created dir: <https://ci-builds.apache.org/job/POI/job/POI-DSL-Windows-1.16/ws/poi-excelant\build\poi-ant-contrib>
[javac] Compiling 3 source files to <https://ci-builds.apache.org/job/POI/job/POI-DSL-Windows-1.16/ws/poi-excelant\build\poi-ant-contrib>
clean:
[delete] Deleting directory <https://ci-builds.apache.org/job/POI/job/POI-DSL-Windows-1.16/ws/build>
[delete] Deleting directory <https://ci-builds.apache.org/job/POI/job/POI-DSL-Windows-1.16/ws/poi-examples\build>
[delete] Deleting directory <https://ci-builds.apache.org/job/POI/job/POI-DSL-Windows-1.16/ws/poi-excelant\build>
[delete] Deleting directory <https://ci-builds.apache.org/job/POI/job/POI-DSL-Windows-1.16/ws/poi-integration\build>
[delete] Deleting directory <https://ci-builds.apache.org/job/POI/job/POI-DSL-Windows-1.16/ws/poi\build>
[delete] Deleting directory <https://ci-builds.apache.org/job/POI/job/POI-DSL-Windows-1.16/ws/poi-ooxml\build>
[delete] Deleting directory <https://ci-builds.apache.org/job/POI/job/POI-DSL-Windows-1.16/ws/poi-ooxml-full\build>
[delete] Deleting directory <https://ci-builds.apache.org/job/POI/job/POI-DSL-Windows-1.16/ws/poi-scratchpad\build>
replaceVersion:
check-jars:
fetch-jars:
check-ooxml-jars:
fetch-ooxml-jars:
[get] Destination already exists (skipping): <https://ci-builds.apache.org/job/POI/job/POI-DSL-Windows-1.16/ws/lib\ooxml\curvesapi-1.06.jar>
[get] Getting: https://repo1.maven.org/maven2/org/apache/xmlbeans/xmlbeans/5.0.0/xmlbeans-5.0.0.jar
[get] To: <https://ci-builds.apache.org/job/POI/job/POI-DSL-Windows-1.16/ws/lib\ooxml\xmlbeans-5.0.0.jar>
[get] Destination already exists (skipping): <https://ci-builds.apache.org/job/POI/job/POI-DSL-Windows-1.16/ws/lib\ooxml\commons-compress-1.20.jar>
[get] Destination already exists (skipping): <https://ci-builds.apache.org/job/POI/job/POI-DSL-Windows-1.16/ws/lib\ooxml-tests\reflections-0.9.12.jar>
[get] Destination already exists (skipping): <https://ci-builds.apache.org/job/POI/job/POI-DSL-Windows-1.16/ws/lib\ooxml-tests\guava-30.1-jre.jar>
[get] Destination already exists (skipping): <https://ci-builds.apache.org/job/POI/job/POI-DSL-Windows-1.16/ws/lib\ooxml-tests\javassist-3.27.0-GA.jar>
[get] Destination already exists (skipping): <https://ci-builds.apache.org/job/POI/job/POI-DSL-Windows-1.16/ws/lib\ooxml-tests\slf4j-api-1.7.31.jar>
[get] Destination already exists (skipping): <https://ci-builds.apache.org/job/POI/job/POI-DSL-Windows-1.16/ws/lib\ooxml-batik\batik-anim-1.14.jar>
[get] Destination already exists (skipping): <https://ci-builds.apache.org/job/POI/job/POI-DSL-Windows-1.16/ws/lib\ooxml-batik\batik-awt-util-1.14.jar>
[get] Destination already exists (skipping): <https://ci-builds.apache.org/job/POI/job/POI-DSL-Windows-1.16/ws/lib\ooxml-batik\batik-bridge-1.14.jar>
[get] Destination already exists (skipping): <https://ci-builds.apache.org/job/POI/job/POI-DSL-Windows-1.16/ws/lib\ooxml-batik\batik-codec-1.14.jar>
[get] Destination already exists (skipping): <https://ci-builds.apache.org/job/POI/job/POI-DSL-Windows-1.16/ws/lib\ooxml-batik\batik-constants-1.14.jar>
[get] Destination already exists (skipping): <https://ci-builds.apache.org/job/POI/job/POI-DSL-Windows-1.16/ws/lib\ooxml-batik\batik-css-1.14.jar>
[get] Destination already exists (skipping): <https://ci-builds.apache.org/job/POI/job/POI-DSL-Windows-1.16/ws/lib\ooxml-batik\batik-dom-1.14.jar>
[get] Destination already exists (skipping): <https://ci-builds.apache.org/job/POI/job/POI-DSL-Windows-1.16/ws/lib\ooxml-batik\batik-ext-1.14.jar>
[get] Destination already exists (skipping): <https://ci-builds.apache.org/job/POI/job/POI-DSL-Windows-1.16/ws/lib\ooxml-batik\batik-gvt-1.14.jar>
[get] Destination already exists (skipping): <https://ci-builds.apache.org/job/POI/job/POI-DSL-Windows-1.16/ws/lib\ooxml-batik\batik-i18n-1.14.jar>
[get] Destination already exists (skipping): <https://ci-builds.apache.org/job/POI/job/POI-DSL-Windows-1.16/ws/lib\ooxml-batik\batik-parser-1.14.jar>
[get] Destination already exists (skipping): <https://ci-builds.apache.org/job/POI/job/POI-DSL-Windows-1.16/ws/lib\ooxml-batik\batik-script-1.14.jar>
[get] Destination already exists (skipping): <https://ci-builds.apache.org/job/POI/job/POI-DSL-Windows-1.16/ws/lib\ooxml-batik\batik-shared-resources-1.14.jar>
[get] Destination already exists (skipping): <https://ci-builds.apache.org/job/POI/job/POI-DSL-Windows-1.16/ws/lib\ooxml-batik\batik-svg-dom-1.14.jar>
[get] Destination already exists (skipping): <https://ci-builds.apache.org/job/POI/job/POI-DSL-Windows-1.16/ws/lib\ooxml-batik\batik-svggen-1.14.jar>
[get] Destination already exists (skipping): <https://ci-builds.apache.org/job/POI/job/POI-DSL-Windows-1.16/ws/lib\ooxml-batik\batik-svgrasterizer-1.14.jar>
[get] Destination already exists (skipping): <https://ci-builds.apache.org/job/POI/job/POI-DSL-Windows-1.16/ws/lib\ooxml-batik\batik-transcoder-1.14.jar>
[get] Destination already exists (skipping): <https://ci-builds.apache.org/job/POI/job/POI-DSL-Windows-1.16/ws/lib\ooxml-batik\batik-util-1.14.jar>
[get] Destination already exists (skipping): <https://ci-builds.apache.org/job/POI/job/POI-DSL-Windows-1.16/ws/lib\ooxml-batik\batik-xml-1.14.jar>
[get] Destination already exists (skipping): <https://ci-builds.apache.org/job/POI/job/POI-DSL-Windows-1.16/ws/lib\ooxml-batik\xml-apis-ext-1.3.04.jar>
[get] Destination already exists (skipping): <https://ci-builds.apache.org/job/POI/job/POI-DSL-Windows-1.16/ws/lib\ooxml-batik\xmlgraphics-commons-2.4.jar>
[get] Destination already exists (skipping): <https://ci-builds.apache.org/job/POI/job/POI-DSL-Windows-1.16/ws/lib\ooxml-provided\pdfbox-2.0.24.jar>
[get] Destination already exists (skipping): <https://ci-builds.apache.org/job/POI/job/POI-DSL-Windows-1.16/ws/lib\ooxml-provided\fontbox-2.0.24.jar>
[get] Destination already exists (skipping): <https://ci-builds.apache.org/job/POI/job/POI-DSL-Windows-1.16/ws/lib\ooxml-provided\graphics2d-0.32.jar>
init:
[mkdir] Created dir: <https://ci-builds.apache.org/job/POI/job/POI-DSL-Windows-1.16/ws/build>
[mkdir] Created dir: <https://ci-builds.apache.org/job/POI/job/POI-DSL-Windows-1.16/ws/poi\build\classes\ant\java>
[mkdir] Created dir: <https://ci-builds.apache.org/job/POI/job/POI-DSL-Windows-1.16/ws/poi\build\test-classes>
[mkdir] Created dir: <https://ci-builds.apache.org/job/POI/job/POI-DSL-Windows-1.16/ws/poi\build\test-results>
[mkdir] Created dir: <https://ci-builds.apache.org/job/POI/job/POI-DSL-Windows-1.16/ws/poi-scratchpad\build\classes\ant\java>
[mkdir] Created dir: <https://ci-builds.apache.org/job/POI/job/POI-DSL-Windows-1.16/ws/poi-scratchpad\build\test-classes>
[mkdir] Created dir: <https://ci-builds.apache.org/job/POI/job/POI-DSL-Windows-1.16/ws/poi-scratchpad\build\test-results>
[mkdir] Created dir: <https://ci-builds.apache.org/job/POI/job/POI-DSL-Windows-1.16/ws/poi-ooxml\build\classes\ant\java>
[mkdir] Created dir: <https://ci-builds.apache.org/job/POI/job/POI-DSL-Windows-1.16/ws/poi-ooxml\build\test-classes>
[mkdir] Created dir: <https://ci-builds.apache.org/job/POI/job/POI-DSL-Windows-1.16/ws/poi-ooxml-full\build\classes\ant\java>
[mkdir] Created dir: <https://ci-builds.apache.org/job/POI/job/POI-DSL-Windows-1.16/ws/poi-ooxml-full\build\test-classes>
[mkdir] Created dir: <https://ci-builds.apache.org/job/POI/job/POI-DSL-Windows-1.16/ws/poi-ooxml-full\build\generated-sources>
[mkdir] Created dir: <https://ci-builds.apache.org/job/POI/job/POI-DSL-Windows-1.16/ws/poi-ooxml-full\build\generated-classes>
[mkdir] Created dir: <https://ci-builds.apache.org/job/POI/job/POI-DSL-Windows-1.16/ws/poi-ooxml\build\test-results>
[mkdir] Created dir: <https://ci-builds.apache.org/job/POI/job/POI-DSL-Windows-1.16/ws/poi-excelant\build\classes\ant\java>
[mkdir] Created dir: <https://ci-builds.apache.org/job/POI/job/POI-DSL-Windows-1.16/ws/poi-excelant\build\test-classes>
[mkdir] Created dir: <https://ci-builds.apache.org/job/POI/job/POI-DSL-Windows-1.16/ws/poi-excelant\build\test-results>
[mkdir] Created dir: <https://ci-builds.apache.org/job/POI/job/POI-DSL-Windows-1.16/ws/poi-examples\build\classes\ant\java>
[mkdir] Created dir: <https://ci-builds.apache.org/job/POI/job/POI-DSL-Windows-1.16/ws/poi-integration\build\test-classes>
[mkdir] Created dir: <https://ci-builds.apache.org/job/POI/job/POI-DSL-Windows-1.16/ws/poi-integration\build\test-results>
[mkdir] Created dir: <https://ci-builds.apache.org/job/POI/job/POI-DSL-Windows-1.16/ws/build\dist>
[mkdir] Created dir: <https://ci-builds.apache.org/job/POI/job/POI-DSL-Windows-1.16/ws/build\site>
[echo] Using Ant: Apache Ant(TM) version 1.10.9 compiled on September 27 2020 from F:\\jenkins\\tools\\ant\\latest1.10, Ant detected Java 16 (may be different than actual Java sometimes...)
[echo] Using Java: 16-ea/16-ea+24-1553/16-ea+24-1553/OpenJDK 64-Bit Server VM from Oracle Corporation on Windows Server 2016: 10.0
[echo] Building Apache POI version 5.0.1-SNAPSHOT and RC: RC1, isJava8: false
[echo] Compiling for Java 9+
-version-java-check:
compile-version:
[mkdir] Created dir: <https://ci-builds.apache.org/job/POI/job/POI-DSL-Windows-1.16/ws/poi\build\generated-sources\org\apache\poi>
[copy] Copying 1 file to <https://ci-builds.apache.org/job/POI/job/POI-DSL-Windows-1.16/ws/poi\build\generated-sources\org\apache\poi>
[javac] Compiling 1 source file to <https://ci-builds.apache.org/job/POI/job/POI-DSL-Windows-1.16/ws/poi\build\classes\ant\java>
[javac] warning: [options] bootstrap class path not set in conjunction with -source 8
[javac] 1 warning
compile-main:
[javac] Compiling 1171 source files to <https://ci-builds.apache.org/job/POI/job/POI-DSL-Windows-1.16/ws/poi\build\classes\ant\java>
[javac] Ignoring source, target and bootclasspath as release has been set
[javac] Note: Some input files use or override a deprecated API.
[javac] Note: Recompile with -Xlint:deprecation for details.
[javac] Note: Some input files use unchecked or unsafe operations.
[javac] Note: Recompile with -Xlint:unchecked for details.
[javac] Creating empty <https://ci-builds.apache.org/job/POI/job/POI-DSL-Windows-1.16/ws/poi\build\classes\ant\java\org\apache\poi\ddf\package-info.class>
[javac] Creating empty <https://ci-builds.apache.org/job/POI/job/POI-DSL-Windows-1.16/ws/poi\build\classes\ant\java\org\apache\poi\hssf\package-info.class>
[javac] Creating empty <https://ci-builds.apache.org/job/POI/job/POI-DSL-Windows-1.16/ws/poi\build\classes\ant\java\org\apache\poi\poifs\dev\package-info.class>
[javac] Creating empty <https://ci-builds.apache.org/job/POI/job/POI-DSL-Windows-1.16/ws/poi\build\classes\ant\java\org\apache\poi\util\package-info.class>
[javac] Creating empty <https://ci-builds.apache.org/job/POI/job/POI-DSL-Windows-1.16/ws/poi\build\classes\ant\java\org\apache\poi\poifs\common\package-info.class>
[javac] Creating empty <https://ci-builds.apache.org/job/POI/job/POI-DSL-Windows-1.16/ws/poi\build\classes\ant\java\org\apache\poi\hssf\record\package-info.class>
[javac] Creating empty <https://ci-builds.apache.org/job/POI/job/POI-DSL-Windows-1.16/ws/poi\build\classes\ant\java\org\apache\poi\poifs\package-info.class>
[javac] Creating empty <https://ci-builds.apache.org/job/POI/job/POI-DSL-Windows-1.16/ws/poi\build\classes\ant\java\org\apache\poi\poifs\crypt\package-info.class>
[javac] Creating empty <https://ci-builds.apache.org/job/POI/job/POI-DSL-Windows-1.16/ws/poi\build\classes\ant\java\org\apache\poi\hpsf\wellknown\package-info.class>
[javac] Creating empty <https://ci-builds.apache.org/job/POI/job/POI-DSL-Windows-1.16/ws/poi\build\classes\ant\java\org\apache\poi\hssf\dev\package-info.class>
[javac] Creating empty <https://ci-builds.apache.org/job/POI/job/POI-DSL-Windows-1.16/ws/poi\build\classes\ant\java\org\apache\poi\ss\formula\package-info.class>
[javac] Creating empty <https://ci-builds.apache.org/job/POI/job/POI-DSL-Windows-1.16/ws/poi\build\classes\ant\java\org\apache\poi\hpsf\package-info.class>
[javac] Creating empty <https://ci-builds.apache.org/job/POI/job/POI-DSL-Windows-1.16/ws/poi\build\classes\ant\java\org\apache\poi\poifs\property\package-info.class>
[javac] Creating empty <https://ci-builds.apache.org/job/POI/job/POI-DSL-Windows-1.16/ws/poi\build\classes\ant\java\org\apache\poi\poifs\filesystem\package-info.class>
[javac] Creating empty <https://ci-builds.apache.org/job/POI/job/POI-DSL-Windows-1.16/ws/poi\build\classes\ant\java\org\apache\poi\ss\formula\ptg\package-info.class>
[javac] Creating empty <https://ci-builds.apache.org/job/POI/job/POI-DSL-Windows-1.16/ws/poi\build\classes\ant\java\org\apache\poi\poifs\storage\package-info.class>
[javac] Creating empty <https://ci-builds.apache.org/job/POI/job/POI-DSL-Windows-1.16/ws/poi\build\classes\ant\java\org\apache\poi\hssf\eventusermodel\package-info.class>
[javac] Creating empty <https://ci-builds.apache.org/job/POI/job/POI-DSL-Windows-1.16/ws/poi\build\classes\ant\java\org\apache\poi\hssf\record\aggregates\package-info.class>
[javac] Creating empty <https://ci-builds.apache.org/job/POI/job/POI-DSL-Windows-1.16/ws/poi\build\classes\ant\java\org\apache\poi\ss\format\package-info.class>
[javac] Creating empty <https://ci-builds.apache.org/job/POI/job/POI-DSL-Windows-1.16/ws/poi\build\classes\ant\java\org\apache\poi\hssf\model\package-info.class>
[javac] Creating empty <https://ci-builds.apache.org/job/POI/job/POI-DSL-Windows-1.16/ws/poi\build\classes\ant\java\org\apache\poi\hssf\usermodel\package-info.class>
[javac] Creating empty <https://ci-builds.apache.org/job/POI/job/POI-DSL-Windows-1.16/ws/poi\build\classes\ant\java\org\apache\poi\hssf\util\package-info.class>
[javac] Creating empty <https://ci-builds.apache.org/job/POI/job/POI-DSL-Windows-1.16/ws/poi\build\classes\ant\java\org\apache\poi\poifs\eventfilesystem\package-info.class>
[javac] Compiling 1 source file to <https://ci-builds.apache.org/job/POI/job/POI-DSL-Windows-1.16/ws/poi\src\main\java9>
[mkdir] Created dir: <https://ci-builds.apache.org/job/POI/job/POI-DSL-Windows-1.16/ws/build\dist\maven\poi>
[echo] Building jar for poi, module-name: poi with isJava8: false
[jar] Building jar: <https://ci-builds.apache.org/job/POI/job/POI-DSL-Windows-1.16/ws/build\dist\maven\poi\poi-5.0.1-SNAPSHOT.jar>
[javac] Compiling 517 source files to <https://ci-builds.apache.org/job/POI/job/POI-DSL-Windows-1.16/ws/poi\build\test-classes>
[javac] Ignoring source, target and bootclasspath as release has been set
[javac] Note: Some input files use or override a deprecated API.
[javac] Note: Recompile with -Xlint:deprecation for details.
[echo] Building test-jar for poi, module-name: poi with isJava8: false
[jar] Building jar: <https://ci-builds.apache.org/job/POI/job/POI-DSL-Windows-1.16/ws/build\dist\maven\poi-tests\poi-5.0.1-SNAPSHOT-tests.jar>
[jar] Building jar: <https://ci-builds.apache.org/job/POI/job/POI-DSL-Windows-1.16/ws/build\dist\maven\poi\poi-5.0.1-SNAPSHOT-sources.jar>
compile-scratchpad:
[javac] Compiling 514 source files to <https://ci-builds.apache.org/job/POI/job/POI-DSL-Windows-1.16/ws/poi-scratchpad\build\classes\ant\java>
[javac] Ignoring source, target and bootclasspath as release has been set
[javac] Note: Some input files use or override a deprecated API.
[javac] Note: Recompile with -Xlint:deprecation for details.
[javac] Note: <https://ci-builds.apache.org/job/POI/job/POI-DSL-Windows-1.16/ws/poi-scratchpad\src\main\java\org\apache\poi\hwpf\model\BytePropertyNode.java> uses unchecked or unsafe operations.
[javac] Note: Recompile with -Xlint:unchecked for details.
[mkdir] Created dir: <https://ci-builds.apache.org/job/POI/job/POI-DSL-Windows-1.16/ws/build\dist\maven\poi-scratchpad>
[echo] Building jar for poi-scratchpad, module-name: scratchpad with isJava8: false
[jar] Building jar: <https://ci-builds.apache.org/job/POI/job/POI-DSL-Windows-1.16/ws/build\dist\maven\poi-scratchpad\poi-scratchpad-5.0.1-SNAPSHOT.jar>
[javac] Compiling 197 source files to <https://ci-builds.apache.org/job/POI/job/POI-DSL-Windows-1.16/ws/poi-scratchpad\build\test-classes>
[javac] Ignoring source, target and bootclasspath as release has been set
[javac] Note: Some input files use or override a deprecated API.
[javac] Note: Recompile with -Xlint:deprecation for details.
[echo] Building test-jar for poi-scratchpad, module-name: scratchpad with isJava8: false
[jar] Building jar: <https://ci-builds.apache.org/job/POI/job/POI-DSL-Windows-1.16/ws/build\dist\maven\poi-scratchpad-tests\poi-scratchpad-5.0.1-SNAPSHOT-tests.jar>
[jar] Building jar: <https://ci-builds.apache.org/job/POI/job/POI-DSL-Windows-1.16/ws/build\dist\maven\poi-scratchpad\poi-scratchpad-5.0.1-SNAPSHOT-sources.jar>
check-compiled-ooxml-xsds:
compile-ooxml-xsds:
[mkdir] Created dir: <https://ci-builds.apache.org/job/POI/job/POI-DSL-Windows-1.16/ws/poi-ooxml-full\build\xsds>
[copy] Copying 8 files to <https://ci-builds.apache.org/job/POI/job/POI-DSL-Windows-1.16/ws/poi-ooxml-full\build\xsds>
[copy] Copying 28 resources to <https://ci-builds.apache.org/job/POI/job/POI-DSL-Windows-1.16/ws/poi-ooxml-full\build\xsds>
[xmlbean] SchemaCompiler Metadata LOAD:org/apache/xmlbeans/metadata GEN:org/apache/poi/schemas/ooxml
[xmlbean] Time to build schema type system: 3.17 seconds
[xmlbean] Time to generate code: 13.683 seconds
[javac] Compiling 5064 source files to <https://ci-builds.apache.org/job/POI/job/POI-DSL-Windows-1.16/ws/poi-ooxml-full\build\classes\ant\java>
[javac] Ignoring source, target and bootclasspath as release has been set
[mkdir] Created dir: <https://ci-builds.apache.org/job/POI/job/POI-DSL-Windows-1.16/ws/build\dist\maven\poi-ooxml-full>
[jar] Building jar: <https://ci-builds.apache.org/job/POI/job/POI-DSL-Windows-1.16/ws/build\dist\maven\poi-ooxml-full\poi-ooxml-full-5.0.1-SNAPSHOT.jar>
[jar] Building jar: <https://ci-builds.apache.org/job/POI/job/POI-DSL-Windows-1.16/ws/build\dist\maven\poi-ooxml-full\poi-ooxml-full-5.0.1-SNAPSHOT-sources.jar>
compile-ooxml:
[javac] Compiling 620 source files to <https://ci-builds.apache.org/job/POI/job/POI-DSL-Windows-1.16/ws/poi-ooxml\build\classes\ant\java>
[javac] Ignoring source, target and bootclasspath as release has been set
[javac] Note: Some input files use or override a deprecated API.
[javac] Note: Recompile with -Xlint:deprecation for details.
[javac] Note: <https://ci-builds.apache.org/job/POI/job/POI-DSL-Windows-1.16/ws/poi-ooxml\src\main\java\org\apache\poi\xslf\draw\SVGImageRenderer.java> uses unchecked or unsafe operations.
[javac] Note: Recompile with -Xlint:unchecked for details.
[javac] Creating empty <https://ci-builds.apache.org/job/POI/job/POI-DSL-Windows-1.16/ws/poi-ooxml\build\classes\ant\java\org\apache\poi\xwpf\package-info.class>
[javac] Creating empty <https://ci-builds.apache.org/job/POI/job/POI-DSL-Windows-1.16/ws/poi-ooxml\build\classes\ant\java\org\apache\poi\xssf\binary\package-info.class>
[mkdir] Created dir: <https://ci-builds.apache.org/job/POI/job/POI-DSL-Windows-1.16/ws/build\dist\maven\poi-ooxml>
[echo] Building jar for poi-ooxml, module-name: ooxml with isJava8: false
[jar] Building jar: <https://ci-builds.apache.org/job/POI/job/POI-DSL-Windows-1.16/ws/build\dist\maven\poi-ooxml\poi-ooxml-5.0.1-SNAPSHOT.jar>
[javac] Compiling 272 source files to <https://ci-builds.apache.org/job/POI/job/POI-DSL-Windows-1.16/ws/poi-ooxml\build\test-classes>
[javac] Ignoring source, target and bootclasspath as release has been set
[javac] Note: Some input files use or override a deprecated API.
[javac] Note: Recompile with -Xlint:deprecation for details.
[echo] Building test-jar for poi-ooxml, module-name: ooxml with isJava8: false
[jar] Building jar: <https://ci-builds.apache.org/job/POI/job/POI-DSL-Windows-1.16/ws/build\dist\maven\poi-ooxml-tests\poi-ooxml-5.0.1-SNAPSHOT-tests.jar>
[jar] Building jar: <https://ci-builds.apache.org/job/POI/job/POI-DSL-Windows-1.16/ws/build\dist\maven\poi-ooxml\poi-ooxml-5.0.1-SNAPSHOT-sources.jar>
[jar] Building jar: <https://ci-builds.apache.org/job/POI/job/POI-DSL-Windows-1.16/ws/build\dist\maven\poi-ooxml-lite-agent\poi-ooxml-lite-agent-5.0.1-SNAPSHOT.jar>
compile-examples:
[javac] Compiling 138 source files to <https://ci-builds.apache.org/job/POI/job/POI-DSL-Windows-1.16/ws/poi-examples\build\classes\ant\java>
[javac] Ignoring source, target and bootclasspath as release has been set
[javac] Creating empty <https://ci-builds.apache.org/job/POI/job/POI-DSL-Windows-1.16/ws/poi-examples\build\classes\ant\java\org\apache\poi\examples\ss\html\package-info.class>
[mkdir] Created dir: <https://ci-builds.apache.org/job/POI/job/POI-DSL-Windows-1.16/ws/build\dist\maven\poi-examples>
[echo] Building jar for poi-examples, module-name: examples with isJava8: false
[jar] Building jar: <https://ci-builds.apache.org/job/POI/job/POI-DSL-Windows-1.16/ws/build\dist\maven\poi-examples\poi-examples-5.0.1-SNAPSHOT.jar>
[echo] Building test-jar for poi-examples, module-name: examples with isJava8: false
[jar] Building jar: <https://ci-builds.apache.org/job/POI/job/POI-DSL-Windows-1.16/ws/build\dist\maven\poi-examples\poi-examples-5.0.1-SNAPSHOT-sources.jar>
compile-excelant:
[javac] Compiling 14 source files to <https://ci-builds.apache.org/job/POI/job/POI-DSL-Windows-1.16/ws/poi-excelant\build\classes\ant\java>
[javac] Ignoring source, target and bootclasspath as release has been set
[javac] Compiling 1 source file to <https://ci-builds.apache.org/job/POI/job/POI-DSL-Windows-1.16/ws/poi-excelant\src\main\java9>
[javac] error: module not found: org.apache.poi.ooxml.schemas
[javac] error: module not found: org.apache.xmlbeans
[javac] 2 errors
BUILD FAILED
<https://ci-builds.apache.org/job/POI/job/POI-DSL-Windows-1.16/ws/build.xml>:1462: The following error occurred while executing this line:
<https://ci-builds.apache.org/job/POI/job/POI-DSL-Windows-1.16/ws/build.xml>:1093: Compile failed; see the compiler error output for details.
Total time: 6 minutes 41 seconds
Build step 'Invoke Ant' marked build as failure
[SpotBugs] Skipping execution of recorder since overall result is 'FAILURE'
Archiving artifacts
Skipping publisher since build result is FAILURE
Recording test results
ERROR: Step ‘Publish JUnit test result report’ failed: No test report files were found. Configuration error?
---------------------------------------------------------------------
To unsubscribe, e-mail: dev-unsubscribe@poi.apache.org
For additional commands, e-mail: dev-help@poi.apache.org
Build failed in Jenkins: POI » POI-DSL-Windows-1.16 #18
Posted by Apache Jenkins Server <je...@builds.apache.org>.
See <https://ci-builds.apache.org/job/POI/job/POI-DSL-Windows-1.16/18/display/redirect>
Changes:
------------------------------------------
[...truncated 34.33 KB...]
at org.tmatesoft.svn.core.internal.wc.SVNErrorManager.error(SVNErrorManager.java:57)
at org.tmatesoft.svn.core.internal.wc.admin.SVNTranslator.checkWrappedException(SVNTranslator.java:436)
at org.tmatesoft.svn.core.internal.wc.admin.SVNTranslator.copyAndTranslate(SVNTranslator.java:420)
at org.tmatesoft.svn.core.internal.wc17.SVNWCContext.getTranslatedFile(SVNWCContext.java:3099)
at org.tmatesoft.svn.core.internal.wc17.SVNWCContext.preservePreMergeFiles(SVNWCContext.java:3515)
at org.tmatesoft.svn.core.internal.wc17.SVNWCContext.mergeTextFile(SVNWCContext.java:3404)
at org.tmatesoft.svn.core.internal.wc17.SVNWCContext.merge(SVNWCContext.java:3200)
at org.tmatesoft.svn.core.internal.wc17.SVNUpdateEditor17.performFileMerge(SVNUpdateEditor17.java:2220)
at org.tmatesoft.svn.core.internal.wc17.SVNUpdateEditor17.mergeFile(SVNUpdateEditor17.java:2260)
at org.tmatesoft.svn.core.internal.wc17.SVNUpdateEditor17.closeFile(SVNUpdateEditor17.java:1588)
at org.tmatesoft.svn.core.internal.wc.SVNCancellableEditor.closeFile(SVNCancellableEditor.java:142)
at org.tmatesoft.svn.core.internal.io.dav.handlers.DAVEditorHandler.endElement(DAVEditorHandler.java:513)
at org.tmatesoft.svn.core.internal.io.dav.handlers.BasicDAVHandler.endElement(BasicDAVHandler.java:103)
at com.sun.org.apache.xerces.internal.parsers.AbstractSAXParser.endElement(Unknown Source)
at com.sun.org.apache.xerces.internal.impl.XMLDocumentFragmentScannerImpl.scanEndElement(Unknown Source)
at com.sun.org.apache.xerces.internal.impl.XMLDocumentFragmentScannerImpl$FragmentContentDriver.next(Unknown Source)
at com.sun.org.apache.xerces.internal.impl.XMLDocumentScannerImpl.next(Unknown Source)
at com.sun.org.apache.xerces.internal.impl.XMLNSDocumentScannerImpl.next(Unknown Source)
at com.sun.org.apache.xerces.internal.impl.XMLDocumentFragmentScannerImpl.scanDocument(Unknown Source)
at com.sun.org.apache.xerces.internal.parsers.XML11Configuration.parse(Unknown Source)
at com.sun.org.apache.xerces.internal.parsers.XML11Configuration.parse(Unknown Source)
at com.sun.org.apache.xerces.internal.parsers.XMLParser.parse(Unknown Source)
at com.sun.org.apache.xerces.internal.parsers.AbstractSAXParser.parse(Unknown Source)
at com.sun.org.apache.xerces.internal.jaxp.SAXParserImpl$JAXPSAXParser.parse(Unknown Source)
at org.tmatesoft.svn.core.internal.io.dav.http.HTTPConnection.readData(HTTPConnection.java:898)
at org.tmatesoft.svn.core.internal.io.dav.http.HTTPConnection.readData(HTTPConnection.java:863)
at org.tmatesoft.svn.core.internal.io.dav.http.HTTPRequest.dispatch(HTTPRequest.java:220)
at org.tmatesoft.svn.core.internal.io.dav.http.HTTPConnection.request(HTTPConnection.java:451)
Caused: org.tmatesoft.svn.core.SVNException: svn: E135000: File 'F:/jenkins/jenkins-slave/712657a4/workspace/POI/POI-DSL-Windows-1.16/poi-ooxml-lite/src/main/java9/module-info.java' has inconsistent newlines
at org.tmatesoft.svn.core.internal.wc.SVNErrorManager.error(SVNErrorManager.java:70)
at org.tmatesoft.svn.core.internal.wc.SVNErrorManager.error(SVNErrorManager.java:57)
at org.tmatesoft.svn.core.internal.io.dav.http.HTTPConnection.request(HTTPConnection.java:760)
at org.tmatesoft.svn.core.internal.io.dav.http.HTTPConnection.request(HTTPConnection.java:352)
at org.tmatesoft.svn.core.internal.io.dav.http.HTTPConnection.request(HTTPConnection.java:340)
at org.tmatesoft.svn.core.internal.io.dav.DAVConnection.performHttpRequest(DAVConnection.java:910)
at org.tmatesoft.svn.core.internal.io.dav.DAVConnection.doReport(DAVConnection.java:363)
at org.tmatesoft.svn.core.internal.io.dav.DAVRepository.runReport(DAVRepository.java:1361)
at org.tmatesoft.svn.core.internal.io.dav.DAVRepository.update(DAVRepository.java:859)
at org.tmatesoft.svn.core.internal.wc2.ng.SvnNgAbstractUpdate.updateInternal(SvnNgAbstractUpdate.java:263)
at org.tmatesoft.svn.core.internal.wc2.ng.SvnNgAbstractUpdate.update(SvnNgAbstractUpdate.java:115)
at org.tmatesoft.svn.core.internal.wc2.ng.SvnNgUpdate.run(SvnNgUpdate.java:40)
at org.tmatesoft.svn.core.internal.wc2.ng.SvnNgUpdate.run(SvnNgUpdate.java:18)
at org.tmatesoft.svn.core.internal.wc2.ng.SvnNgOperationRunner.run(SvnNgOperationRunner.java:20)
at org.tmatesoft.svn.core.internal.wc2.SvnOperationRunner.run(SvnOperationRunner.java:21)
at org.tmatesoft.svn.core.wc2.SvnOperationFactory.run(SvnOperationFactory.java:1239)
at org.tmatesoft.svn.core.wc2.SvnOperation.run(SvnOperation.java:294)
at org.tmatesoft.svn.core.wc.SVNUpdateClient.doUpdate(SVNUpdateClient.java:311)
at org.tmatesoft.svn.core.wc.SVNUpdateClient.doUpdate(SVNUpdateClient.java:291)
at org.tmatesoft.svn.core.wc.SVNUpdateClient.doUpdate(SVNUpdateClient.java:387)
at hudson.scm.subversion.UpdateUpdater$TaskImpl.perform(UpdateUpdater.java:159)
Caused: hudson.scm.subversion.UpdaterException: failed to perform svn update
Also: hudson.remoting.Channel$CallSiteStackTrace: Remote call to JNLP4-connect connection from jenkins-win-he-de-2.apache.org/144.76.15.28:52477
at hudson.remoting.Channel.attachCallSiteStackTrace(Channel.java:1800)
at hudson.remoting.UserRequest$ExceptionResponse.retrieve(UserRequest.java:357)
at hudson.remoting.Channel.call(Channel.java:1001)
at hudson.FilePath.act(FilePath.java:1157)
at hudson.FilePath.act(FilePath.java:1146)
at hudson.scm.SubversionSCM.checkout(SubversionSCM.java:945)
at hudson.scm.SubversionSCM.checkout(SubversionSCM.java:876)
at hudson.scm.SCM.checkout(SCM.java:505)
at hudson.model.AbstractProject.checkout(AbstractProject.java:1206)
at hudson.model.AbstractBuild$AbstractBuildExecution.defaultCheckout(AbstractBuild.java:637)
at jenkins.scm.SCMCheckoutStrategy.checkout(SCMCheckoutStrategy.java:86)
at hudson.model.AbstractBuild$AbstractBuildExecution.run(AbstractBuild.java:509)
at hudson.model.Run.execute(Run.java:1907)
at hudson.model.FreeStyleBuild.run(FreeStyleBuild.java:43)
at hudson.model.ResourceController.execute(ResourceController.java:97)
at hudson.model.Executor.run(Executor.java:429)
Caused: java.io.IOException
at hudson.scm.subversion.UpdateUpdater$TaskImpl.perform(UpdateUpdater.java:214)
at hudson.scm.subversion.WorkspaceUpdater$UpdateTask.delegateTo(WorkspaceUpdater.java:168)
at hudson.scm.SubversionSCM$CheckOutTask.perform(SubversionSCM.java:1049)
at hudson.scm.SubversionSCM$CheckOutTask.invoke(SubversionSCM.java:1025)
at hudson.scm.SubversionSCM$CheckOutTask.invoke(SubversionSCM.java:998)
at hudson.FilePath$FileCallableWrapper.call(FilePath.java:3313)
at hudson.remoting.UserRequest.perform(UserRequest.java:211)
at hudson.remoting.UserRequest.perform(UserRequest.java:54)
at hudson.remoting.Request$2.run(Request.java:375)
at hudson.remoting.InterceptingExecutorService$1.call(InterceptingExecutorService.java:73)
at java.util.concurrent.FutureTask.run(Unknown Source)
at java.util.concurrent.ThreadPoolExecutor.runWorker(Unknown Source)
at java.util.concurrent.ThreadPoolExecutor$Worker.run(Unknown Source)
at hudson.remoting.Engine$1.lambda$newThread$0(Engine.java:118)
at java.lang.Thread.run(Unknown Source)
Retrying after 10 seconds
Updating https://svn.apache.org/repos/asf/poi/trunk at revision '2021-07-06T10:14:36.002 -0700'
ERROR: Failed to update https://svn.apache.org/repos/asf/poi/trunk
org.tmatesoft.svn.core.SVNException: svn: E135000: File 'F:\jenkins\jenkins-slave\712657a4\workspace\POI\POI-DSL-Windows-1.16\poi-ooxml-lite\src\main\java9\module-info.java' has inconsistent newlines
at org.tmatesoft.svn.core.internal.wc.SVNErrorManager.error(SVNErrorManager.java:70)
at org.tmatesoft.svn.core.internal.wc.SVNErrorManager.error(SVNErrorManager.java:57)
at org.tmatesoft.svn.core.internal.io.dav.http.HTTPConnection.request(HTTPConnection.java:760)
at org.tmatesoft.svn.core.internal.io.dav.http.HTTPConnection.request(HTTPConnection.java:352)
at org.tmatesoft.svn.core.internal.io.dav.http.HTTPConnection.request(HTTPConnection.java:340)
at org.tmatesoft.svn.core.internal.io.dav.DAVConnection.performHttpRequest(DAVConnection.java:910)
at org.tmatesoft.svn.core.internal.io.dav.DAVConnection.doReport(DAVConnection.java:363)
at org.tmatesoft.svn.core.internal.io.dav.DAVRepository.runReport(DAVRepository.java:1361)
at org.tmatesoft.svn.core.internal.io.dav.DAVRepository.update(DAVRepository.java:859)
at org.tmatesoft.svn.core.internal.wc2.ng.SvnNgAbstractUpdate.updateInternal(SvnNgAbstractUpdate.java:263)
at org.tmatesoft.svn.core.internal.wc2.ng.SvnNgAbstractUpdate.update(SvnNgAbstractUpdate.java:115)
at org.tmatesoft.svn.core.internal.wc2.ng.SvnNgUpdate.run(SvnNgUpdate.java:40)
at org.tmatesoft.svn.core.internal.wc2.ng.SvnNgUpdate.run(SvnNgUpdate.java:18)
at org.tmatesoft.svn.core.internal.wc2.ng.SvnNgOperationRunner.run(SvnNgOperationRunner.java:20)
at org.tmatesoft.svn.core.internal.wc2.SvnOperationRunner.run(SvnOperationRunner.java:21)
at org.tmatesoft.svn.core.wc2.SvnOperationFactory.run(SvnOperationFactory.java:1239)
at org.tmatesoft.svn.core.wc2.SvnOperation.run(SvnOperation.java:294)
at org.tmatesoft.svn.core.wc.SVNUpdateClient.doUpdate(SVNUpdateClient.java:311)
at org.tmatesoft.svn.core.wc.SVNUpdateClient.doUpdate(SVNUpdateClient.java:291)
at org.tmatesoft.svn.core.wc.SVNUpdateClient.doUpdate(SVNUpdateClient.java:387)
at hudson.scm.subversion.UpdateUpdater$TaskImpl.perform(UpdateUpdater.java:159)
at hudson.scm.subversion.WorkspaceUpdater$UpdateTask.delegateTo(WorkspaceUpdater.java:168)
at hudson.scm.SubversionSCM$CheckOutTask.perform(SubversionSCM.java:1049)
at hudson.scm.SubversionSCM$CheckOutTask.invoke(SubversionSCM.java:1025)
at hudson.scm.SubversionSCM$CheckOutTask.invoke(SubversionSCM.java:998)
at hudson.FilePath$FileCallableWrapper.call(FilePath.java:3313)
at hudson.remoting.UserRequest.perform(UserRequest.java:211)
at hudson.remoting.UserRequest.perform(UserRequest.java:54)
at hudson.remoting.Request$2.run(Request.java:375)
at hudson.remoting.InterceptingExecutorService$1.call(InterceptingExecutorService.java:73)
at java.util.concurrent.FutureTask.run(Unknown Source)
at java.util.concurrent.ThreadPoolExecutor.runWorker(Unknown Source)
at java.util.concurrent.ThreadPoolExecutor$Worker.run(Unknown Source)
at hudson.remoting.Engine$1.lambda$newThread$0(Engine.java:118)
at java.lang.Thread.run(Unknown Source)
Caused by: org.tmatesoft.svn.core.SVNException: svn: E135000: File 'F:\jenkins\jenkins-slave\712657a4\workspace\POI\POI-DSL-Windows-1.16\poi-ooxml-lite\src\main\java9\module-info.java' has inconsistent newlines
at org.tmatesoft.svn.core.internal.wc.SVNErrorManager.error(SVNErrorManager.java:70)
at org.tmatesoft.svn.core.internal.wc.SVNErrorManager.error(SVNErrorManager.java:57)
at org.tmatesoft.svn.core.internal.wc.admin.SVNTranslator.checkWrappedException(SVNTranslator.java:436)
at org.tmatesoft.svn.core.internal.wc.admin.SVNTranslator.copyAndTranslate(SVNTranslator.java:420)
at org.tmatesoft.svn.core.internal.wc17.SVNWCContext.getTranslatedFile(SVNWCContext.java:3099)
at org.tmatesoft.svn.core.internal.wc17.SVNWCContext.preservePreMergeFiles(SVNWCContext.java:3515)
at org.tmatesoft.svn.core.internal.wc17.SVNWCContext.mergeTextFile(SVNWCContext.java:3404)
at org.tmatesoft.svn.core.internal.wc17.SVNWCContext.merge(SVNWCContext.java:3200)
at org.tmatesoft.svn.core.internal.wc17.SVNUpdateEditor17.performFileMerge(SVNUpdateEditor17.java:2220)
at org.tmatesoft.svn.core.internal.wc17.SVNUpdateEditor17.mergeFile(SVNUpdateEditor17.java:2260)
at org.tmatesoft.svn.core.internal.wc17.SVNUpdateEditor17.closeFile(SVNUpdateEditor17.java:1588)
at org.tmatesoft.svn.core.internal.wc.SVNCancellableEditor.closeFile(SVNCancellableEditor.java:142)
at org.tmatesoft.svn.core.internal.io.dav.handlers.DAVEditorHandler.endElement(DAVEditorHandler.java:513)
at org.tmatesoft.svn.core.internal.io.dav.handlers.BasicDAVHandler.endElement(BasicDAVHandler.java:103)
at com.sun.org.apache.xerces.internal.parsers.AbstractSAXParser.endElement(Unknown Source)
at com.sun.org.apache.xerces.internal.impl.XMLDocumentFragmentScannerImpl.scanEndElement(Unknown Source)
at com.sun.org.apache.xerces.internal.impl.XMLDocumentFragmentScannerImpl$FragmentContentDriver.next(Unknown Source)
at com.sun.org.apache.xerces.internal.impl.XMLDocumentScannerImpl.next(Unknown Source)
at com.sun.org.apache.xerces.internal.impl.XMLNSDocumentScannerImpl.next(Unknown Source)
at com.sun.org.apache.xerces.internal.impl.XMLDocumentFragmentScannerImpl.scanDocument(Unknown Source)
at com.sun.org.apache.xerces.internal.parsers.XML11Configuration.parse(Unknown Source)
at com.sun.org.apache.xerces.internal.parsers.XML11Configuration.parse(Unknown Source)
at com.sun.org.apache.xerces.internal.parsers.XMLParser.parse(Unknown Source)
at com.sun.org.apache.xerces.internal.parsers.AbstractSAXParser.parse(Unknown Source)
at com.sun.org.apache.xerces.internal.jaxp.SAXParserImpl$JAXPSAXParser.parse(Unknown Source)
at org.tmatesoft.svn.core.internal.io.dav.http.HTTPConnection.readData(HTTPConnection.java:898)
at org.tmatesoft.svn.core.internal.io.dav.http.HTTPConnection.readData(HTTPConnection.java:863)
at org.tmatesoft.svn.core.internal.io.dav.http.HTTPRequest.dispatch(HTTPRequest.java:220)
at org.tmatesoft.svn.core.internal.io.dav.http.HTTPConnection.request(HTTPConnection.java:451)
... 32 more
ERROR: Subversion update failed
org.tmatesoft.svn.core.SVNException: svn: E135000: File 'F:/jenkins/jenkins-slave/712657a4/workspace/POI/POI-DSL-Windows-1.16/poi-ooxml-lite/src/main/java9/module-info.java' has inconsistent newlines
at org.tmatesoft.svn.core.internal.wc.SVNErrorManager.error(SVNErrorManager.java:70)
at org.tmatesoft.svn.core.internal.wc.SVNErrorManager.error(SVNErrorManager.java:57)
at org.tmatesoft.svn.core.internal.wc.admin.SVNTranslator.checkWrappedException(SVNTranslator.java:436)
at org.tmatesoft.svn.core.internal.wc.admin.SVNTranslator.copyAndTranslate(SVNTranslator.java:420)
at org.tmatesoft.svn.core.internal.wc17.SVNWCContext.getTranslatedFile(SVNWCContext.java:3099)
at org.tmatesoft.svn.core.internal.wc17.SVNWCContext.preservePreMergeFiles(SVNWCContext.java:3515)
at org.tmatesoft.svn.core.internal.wc17.SVNWCContext.mergeTextFile(SVNWCContext.java:3404)
at org.tmatesoft.svn.core.internal.wc17.SVNWCContext.merge(SVNWCContext.java:3200)
at org.tmatesoft.svn.core.internal.wc17.SVNUpdateEditor17.performFileMerge(SVNUpdateEditor17.java:2220)
at org.tmatesoft.svn.core.internal.wc17.SVNUpdateEditor17.mergeFile(SVNUpdateEditor17.java:2260)
at org.tmatesoft.svn.core.internal.wc17.SVNUpdateEditor17.closeFile(SVNUpdateEditor17.java:1588)
at org.tmatesoft.svn.core.internal.wc.SVNCancellableEditor.closeFile(SVNCancellableEditor.java:142)
at org.tmatesoft.svn.core.internal.io.dav.handlers.DAVEditorHandler.endElement(DAVEditorHandler.java:513)
at org.tmatesoft.svn.core.internal.io.dav.handlers.BasicDAVHandler.endElement(BasicDAVHandler.java:103)
at com.sun.org.apache.xerces.internal.parsers.AbstractSAXParser.endElement(Unknown Source)
at com.sun.org.apache.xerces.internal.impl.XMLDocumentFragmentScannerImpl.scanEndElement(Unknown Source)
at com.sun.org.apache.xerces.internal.impl.XMLDocumentFragmentScannerImpl$FragmentContentDriver.next(Unknown Source)
at com.sun.org.apache.xerces.internal.impl.XMLDocumentScannerImpl.next(Unknown Source)
at com.sun.org.apache.xerces.internal.impl.XMLNSDocumentScannerImpl.next(Unknown Source)
at com.sun.org.apache.xerces.internal.impl.XMLDocumentFragmentScannerImpl.scanDocument(Unknown Source)
at com.sun.org.apache.xerces.internal.parsers.XML11Configuration.parse(Unknown Source)
at com.sun.org.apache.xerces.internal.parsers.XML11Configuration.parse(Unknown Source)
at com.sun.org.apache.xerces.internal.parsers.XMLParser.parse(Unknown Source)
at com.sun.org.apache.xerces.internal.parsers.AbstractSAXParser.parse(Unknown Source)
at com.sun.org.apache.xerces.internal.jaxp.SAXParserImpl$JAXPSAXParser.parse(Unknown Source)
at org.tmatesoft.svn.core.internal.io.dav.http.HTTPConnection.readData(HTTPConnection.java:898)
at org.tmatesoft.svn.core.internal.io.dav.http.HTTPConnection.readData(HTTPConnection.java:863)
at org.tmatesoft.svn.core.internal.io.dav.http.HTTPRequest.dispatch(HTTPRequest.java:220)
at org.tmatesoft.svn.core.internal.io.dav.http.HTTPConnection.request(HTTPConnection.java:451)
Caused: org.tmatesoft.svn.core.SVNException: svn: E135000: File 'F:/jenkins/jenkins-slave/712657a4/workspace/POI/POI-DSL-Windows-1.16/poi-ooxml-lite/src/main/java9/module-info.java' has inconsistent newlines
at org.tmatesoft.svn.core.internal.wc.SVNErrorManager.error(SVNErrorManager.java:70)
at org.tmatesoft.svn.core.internal.wc.SVNErrorManager.error(SVNErrorManager.java:57)
at org.tmatesoft.svn.core.internal.io.dav.http.HTTPConnection.request(HTTPConnection.java:760)
at org.tmatesoft.svn.core.internal.io.dav.http.HTTPConnection.request(HTTPConnection.java:352)
at org.tmatesoft.svn.core.internal.io.dav.http.HTTPConnection.request(HTTPConnection.java:340)
at org.tmatesoft.svn.core.internal.io.dav.DAVConnection.performHttpRequest(DAVConnection.java:910)
at org.tmatesoft.svn.core.internal.io.dav.DAVConnection.doReport(DAVConnection.java:363)
at org.tmatesoft.svn.core.internal.io.dav.DAVRepository.runReport(DAVRepository.java:1361)
at org.tmatesoft.svn.core.internal.io.dav.DAVRepository.update(DAVRepository.java:859)
at org.tmatesoft.svn.core.internal.wc2.ng.SvnNgAbstractUpdate.updateInternal(SvnNgAbstractUpdate.java:263)
at org.tmatesoft.svn.core.internal.wc2.ng.SvnNgAbstractUpdate.update(SvnNgAbstractUpdate.java:115)
at org.tmatesoft.svn.core.internal.wc2.ng.SvnNgUpdate.run(SvnNgUpdate.java:40)
at org.tmatesoft.svn.core.internal.wc2.ng.SvnNgUpdate.run(SvnNgUpdate.java:18)
at org.tmatesoft.svn.core.internal.wc2.ng.SvnNgOperationRunner.run(SvnNgOperationRunner.java:20)
at org.tmatesoft.svn.core.internal.wc2.SvnOperationRunner.run(SvnOperationRunner.java:21)
at org.tmatesoft.svn.core.wc2.SvnOperationFactory.run(SvnOperationFactory.java:1239)
at org.tmatesoft.svn.core.wc2.SvnOperation.run(SvnOperation.java:294)
at org.tmatesoft.svn.core.wc.SVNUpdateClient.doUpdate(SVNUpdateClient.java:311)
at org.tmatesoft.svn.core.wc.SVNUpdateClient.doUpdate(SVNUpdateClient.java:291)
at org.tmatesoft.svn.core.wc.SVNUpdateClient.doUpdate(SVNUpdateClient.java:387)
at hudson.scm.subversion.UpdateUpdater$TaskImpl.perform(UpdateUpdater.java:159)
Caused: hudson.scm.subversion.UpdaterException: failed to perform svn update
Also: hudson.remoting.Channel$CallSiteStackTrace: Remote call to JNLP4-connect connection from jenkins-win-he-de-2.apache.org/144.76.15.28:52477
at hudson.remoting.Channel.attachCallSiteStackTrace(Channel.java:1800)
at hudson.remoting.UserRequest$ExceptionResponse.retrieve(UserRequest.java:357)
at hudson.remoting.Channel.call(Channel.java:1001)
at hudson.FilePath.act(FilePath.java:1157)
at hudson.FilePath.act(FilePath.java:1146)
at hudson.scm.SubversionSCM.checkout(SubversionSCM.java:945)
at hudson.scm.SubversionSCM.checkout(SubversionSCM.java:876)
at hudson.scm.SCM.checkout(SCM.java:505)
at hudson.model.AbstractProject.checkout(AbstractProject.java:1206)
at hudson.model.AbstractBuild$AbstractBuildExecution.defaultCheckout(AbstractBuild.java:637)
at jenkins.scm.SCMCheckoutStrategy.checkout(SCMCheckoutStrategy.java:86)
at hudson.model.AbstractBuild$AbstractBuildExecution.run(AbstractBuild.java:509)
at hudson.model.Run.execute(Run.java:1907)
at hudson.model.FreeStyleBuild.run(FreeStyleBuild.java:43)
at hudson.model.ResourceController.execute(ResourceController.java:97)
at hudson.model.Executor.run(Executor.java:429)
Caused: java.io.IOException
at hudson.scm.subversion.UpdateUpdater$TaskImpl.perform(UpdateUpdater.java:214)
at hudson.scm.subversion.WorkspaceUpdater$UpdateTask.delegateTo(WorkspaceUpdater.java:168)
at hudson.scm.SubversionSCM$CheckOutTask.perform(SubversionSCM.java:1049)
at hudson.scm.SubversionSCM$CheckOutTask.invoke(SubversionSCM.java:1025)
at hudson.scm.SubversionSCM$CheckOutTask.invoke(SubversionSCM.java:998)
at hudson.FilePath$FileCallableWrapper.call(FilePath.java:3313)
at hudson.remoting.UserRequest.perform(UserRequest.java:211)
at hudson.remoting.UserRequest.perform(UserRequest.java:54)
at hudson.remoting.Request$2.run(Request.java:375)
at hudson.remoting.InterceptingExecutorService$1.call(InterceptingExecutorService.java:73)
at java.util.concurrent.FutureTask.run(Unknown Source)
at java.util.concurrent.ThreadPoolExecutor.runWorker(Unknown Source)
at java.util.concurrent.ThreadPoolExecutor$Worker.run(Unknown Source)
at hudson.remoting.Engine$1.lambda$newThread$0(Engine.java:118)
at java.lang.Thread.run(Unknown Source)
[SpotBugs] Skipping execution of recorder since overall result is 'FAILURE'
Archiving artifacts
[Fast Archiver] Compressed 223.31 MB of artifacts by 100.0% relative to #13
Skipping publisher since build result is FAILURE
Recording test results
ERROR: Step ‘Publish JUnit test result report’ failed: Test reports were found but none of them are new. Did leafNodes run?
For example, <https://ci-builds.apache.org/job/POI/job/POI-DSL-Windows-1.16/ws/poi-excelant\build\test-results\TEST-org.apache.poi.ss.excelant.TestBuildFile.xml> is 2 days 2 hr old
---------------------------------------------------------------------
To unsubscribe, e-mail: dev-unsubscribe@poi.apache.org
For additional commands, e-mail: dev-help@poi.apache.org
Build failed in Jenkins: POI » POI-DSL-Windows-1.16 #17
Posted by Apache Jenkins Server <je...@builds.apache.org>.
See <https://ci-builds.apache.org/job/POI/job/POI-DSL-Windows-1.16/17/display/redirect?page=changes>
Changes:
[PJ Fanning] add explicit commons-io dependency to poi-ooxml. This closes #237
------------------------------------------
[...truncated 933 B...]
Updating https://svn.apache.org/repos/asf/poi/trunk at revision '2021-07-06T10:00:01.834 -0700'
U build.gradle
U maven\poi-ooxml.pom
U poi\src\main\java9\module-info.java
U poi\src\main\java\org\apache\poi\ss\util\CellUtil.java
AU poi\src\test\java\org\apache\poi\util\ConditionalExecution.java
U poi-ooxml\build.gradle
U poi-ooxml\src\test\java\org\apache\poi\poifs\crypt\dsig\TestSignatureInfo.java
U poi-ooxml-lite\src\main\java9\module-info.java
U sonar\ooxml\pom.xml
U .github\workflows\test-gradle.yml
U .github\workflows\test-maven.yml
U .github\workflows\test-ant.yml
U build.xml
U osgi\README.md
U poi-ooxml-full\build.gradle
<-- Got one external: forrest.properties, svn url: https://svn.apache.org/repos/asf/poi/site/forrest.properties -->
Fetching 'https://svn.apache.org/repos/asf/poi/site/forrest.properties' at -1 into 'F:\jenkins\jenkins-slave\712657a4\workspace\POI\POI-DSL-Windows-1.16\forrest.properties'
At revision 1891321
<-- Got one external: documentation, svn url: https://svn.apache.org/repos/asf/poi/site/src/documentation -->
Fetching 'https://svn.apache.org/repos/asf/poi/site/src/documentation' at -1 into 'F:\jenkins\jenkins-slave\712657a4\workspace\POI\POI-DSL-Windows-1.16\src\documentation'
U src\documentation\content\xdocs\changes.xml
U src\documentation\content\xdocs\components\index.xml
U src\documentation\content\xdocs\encryption.xml
At revision 1891321
At revision 1891321
No changes for https://svn.apache.org/repos/asf/poi/site/forrest.properties since the previous build
No changes for https://svn.apache.org/repos/asf/poi/site/src/documentation since the previous build
[POI-DSL-Windows-1.16] $ cmd /c call F:\jenkins\jenkins-slave\temp\jenkins1170768104774140334.bat
X forrest.properties
M poi-examples\src\main\java9\module-info.class
M poi-ooxml\src\main\java9\module-info.class
M poi-ooxml\src\test\java9\module-info.class
M poi-ooxml-full\src\main\java9\module-info.class
M poi-ooxml-lite-agent\src\main\java9\module-info.class
X src\documentation
Performing status on external item at 'src\documentation':
svn: E155010: The node 'F:\jenkins\jenkins-slave\712657a4\workspace\POI\POI-DSL-Windows-1.16\poi*\src\*' was not found.
Java-Home: f:\\jenkins\\tools\\java\\latest16
Volume in drive F is data
Volume Serial Number is FEB9-6BE4
Directory of f:\jenkins\tools\java\latest16
12/18/2020 02:29 PM <DIR> .
12/18/2020 02:29 PM <DIR> ..
12/18/2020 02:28 PM <DIR> bin
12/18/2020 02:28 PM <DIR> conf
12/18/2020 02:28 PM <DIR> include
12/18/2020 02:28 PM <DIR> jmods
12/18/2020 02:28 PM <DIR> legal
12/18/2020 02:29 PM <DIR> lib
11/11/2020 09:41 PM 1,165 release
1 File(s) 1,165 bytes
8 Dir(s) 1,336,957,698,048 bytes free
openjdk version "16-ea" 2021-03-16
OpenJDK Runtime Environment (build 16-ea+24-1553)
OpenJDK 64-Bit Server VM (build 16-ea+24-1553, mixed mode, sharing)
[POI-DSL-Windows-1.16] $ cmd.exe /C "F:\jenkins\tools\ant\latest1.10\bin\ant.bat -Dcoverage.enabled=true clean jenkins && exit %%ERRORLEVEL%%"
Buildfile: <https://ci-builds.apache.org/job/POI/job/POI-DSL-Windows-1.16/ws/build.xml>
[mkdir] Created dir: <https://ci-builds.apache.org/job/POI/job/POI-DSL-Windows-1.16/ws/poi-excelant\build\poi-ant-contrib>
[javac] Compiling 3 source files to <https://ci-builds.apache.org/job/POI/job/POI-DSL-Windows-1.16/ws/poi-excelant\build\poi-ant-contrib>
clean:
[delete] Deleting directory <https://ci-builds.apache.org/job/POI/job/POI-DSL-Windows-1.16/ws/build>
[delete] Deleting directory <https://ci-builds.apache.org/job/POI/job/POI-DSL-Windows-1.16/ws/poi-examples\build>
[delete] Deleting directory <https://ci-builds.apache.org/job/POI/job/POI-DSL-Windows-1.16/ws/poi-excelant\build>
[delete] Deleting directory <https://ci-builds.apache.org/job/POI/job/POI-DSL-Windows-1.16/ws/poi-integration\build>
[delete] Deleting directory <https://ci-builds.apache.org/job/POI/job/POI-DSL-Windows-1.16/ws/poi\build>
[delete] Deleting directory <https://ci-builds.apache.org/job/POI/job/POI-DSL-Windows-1.16/ws/poi-ooxml\build>
[delete] Deleting directory <https://ci-builds.apache.org/job/POI/job/POI-DSL-Windows-1.16/ws/poi-ooxml-full\build>
[delete] Deleting directory <https://ci-builds.apache.org/job/POI/job/POI-DSL-Windows-1.16/ws/poi-scratchpad\build>
replaceVersion:
check-jars:
fetch-jars:
[get] Destination already exists (skipping): <https://ci-builds.apache.org/job/POI/job/POI-DSL-Windows-1.16/ws/lib\main-tests\commons-logging-1.2.jar>
[get] Destination already exists (skipping): <https://ci-builds.apache.org/job/POI/job/POI-DSL-Windows-1.16/ws/lib\main\commons-codec-1.15.jar>
[get] Destination already exists (skipping): <https://ci-builds.apache.org/job/POI/job/POI-DSL-Windows-1.16/ws/lib\main-tests\junit-jupiter-api-5.7.1.jar>
[get] Destination already exists (skipping): <https://ci-builds.apache.org/job/POI/job/POI-DSL-Windows-1.16/ws/lib\main-tests\junit-jupiter-engine-5.7.1.jar>
[get] Destination already exists (skipping): <https://ci-builds.apache.org/job/POI/job/POI-DSL-Windows-1.16/ws/lib\main-tests\junit-jupiter-params-5.7.1.jar>
[get] Destination already exists (skipping): <https://ci-builds.apache.org/job/POI/job/POI-DSL-Windows-1.16/ws/lib\main-tests\junit-platform-launcher-1.7.1.jar>
[get] Destination already exists (skipping): <https://ci-builds.apache.org/job/POI/job/POI-DSL-Windows-1.16/ws/lib\main-tests\junit-platform-engine-1.7.1.jar>
[get] Destination already exists (skipping): <https://ci-builds.apache.org/job/POI/job/POI-DSL-Windows-1.16/ws/lib\main-tests\junit-platform-commons-1.7.1.jar>
[get] Destination already exists (skipping): <https://ci-builds.apache.org/job/POI/job/POI-DSL-Windows-1.16/ws/lib\main-tests\opentest4j-1.2.0.jar>
[get] Destination already exists (skipping): <https://ci-builds.apache.org/job/POI/job/POI-DSL-Windows-1.16/ws/lib\main-tests\apiguardian-api-1.1.0.jar>
[get] Destination already exists (skipping): <https://ci-builds.apache.org/job/POI/job/POI-DSL-Windows-1.16/ws/lib\main-tests\jmh-core-1.27.jar>
[get] Destination already exists (skipping): <https://ci-builds.apache.org/job/POI/job/POI-DSL-Windows-1.16/ws/lib\main-tests\jmh-generator-annprocess-1.27.jar>
[get] Destination already exists (skipping): <https://ci-builds.apache.org/job/POI/job/POI-DSL-Windows-1.16/ws/lib\main-tests\hamcrest-2.2.jar>
[get] Destination already exists (skipping): <https://ci-builds.apache.org/job/POI/job/POI-DSL-Windows-1.16/ws/lib\main-tests\xmlunit-core-2.8.2.jar>
[get] Destination already exists (skipping): <https://ci-builds.apache.org/job/POI/job/POI-DSL-Windows-1.16/ws/lib\main-tests\mockito-core-3.6.28.jar>
[get] Destination already exists (skipping): <https://ci-builds.apache.org/job/POI/job/POI-DSL-Windows-1.16/ws/lib\main-tests\byte-buddy-1.10.19.jar>
[get] Destination already exists (skipping): <https://ci-builds.apache.org/job/POI/job/POI-DSL-Windows-1.16/ws/lib\main-tests\byte-buddy-agent-1.10.19.jar>
[get] Destination already exists (skipping): <https://ci-builds.apache.org/job/POI/job/POI-DSL-Windows-1.16/ws/lib\main-tests\objenesis-3.1.jar>
[get] Destination already exists (skipping): <https://ci-builds.apache.org/job/POI/job/POI-DSL-Windows-1.16/ws/lib\excelant\ant-1.10.9.jar>
[get] Destination already exists (skipping): <https://ci-builds.apache.org/job/POI/job/POI-DSL-Windows-1.16/ws/lib\excelant\ant-launcher-1.10.9.jar>
[get] Destination already exists (skipping): <https://ci-builds.apache.org/job/POI/job/POI-DSL-Windows-1.16/ws/lib\main\log4j-api-2.14.0.jar>
[get] Destination already exists (skipping): <https://ci-builds.apache.org/job/POI/job/POI-DSL-Windows-1.16/ws/lib\main-tests\log4j-core-2.14.0.jar>
[get] Destination already exists (skipping): <https://ci-builds.apache.org/job/POI/job/POI-DSL-Windows-1.16/ws/lib\util\asm-9.0.jar>
[get] Destination already exists (skipping): <https://ci-builds.apache.org/job/POI/job/POI-DSL-Windows-1.16/ws/lib\util\asm-commons-9.0.jar>
[get] Destination already exists (skipping): <https://ci-builds.apache.org/job/POI/job/POI-DSL-Windows-1.16/ws/lib\util\asm-tree-9.0.jar>
[get] Destination already exists (skipping): <https://ci-builds.apache.org/job/POI/job/POI-DSL-Windows-1.16/ws/lib\util\jacoco-0.8.6.zip>
[get] Destination already exists (skipping): <https://ci-builds.apache.org/job/POI/job/POI-DSL-Windows-1.16/ws/lib\main\commons-collections4-4.4.jar>
[get] Destination already exists (skipping): <https://ci-builds.apache.org/job/POI/job/POI-DSL-Windows-1.16/ws/lib\main\commons-math3-3.6.1.jar>
[get] Destination already exists (skipping): <https://ci-builds.apache.org/job/POI/job/POI-DSL-Windows-1.16/ws/lib\main\commons-io-2.10.0.jar>
[get] Destination already exists (skipping): <https://ci-builds.apache.org/job/POI/job/POI-DSL-Windows-1.16/ws/lib\main\SparseBitSet-1.2.jar>
[unzip] Expanding: <https://ci-builds.apache.org/job/POI/job/POI-DSL-Windows-1.16/ws/lib\util\jacoco-0.8.6.zip> into <https://ci-builds.apache.org/job/POI/job/POI-DSL-Windows-1.16/ws/lib\util>
[get] Destination already exists (skipping): <https://ci-builds.apache.org/job/POI/job/POI-DSL-Windows-1.16/ws/lib\util\apache-rat-0.13.jar>
[get] Destination already exists (skipping): <https://ci-builds.apache.org/job/POI/job/POI-DSL-Windows-1.16/ws/lib\util\forbiddenapis-3.1.jar>
[get] Getting: https://repo1.maven.org/maven2/org/bouncycastle/bcprov-jdk15on/1.69/bcprov-jdk15on-1.69.jar
[get] To: <https://ci-builds.apache.org/job/POI/job/POI-DSL-Windows-1.16/ws/lib\ooxml-provided\bcprov-jdk15on-1.69.jar>
[get] Getting: https://repo1.maven.org/maven2/org/bouncycastle/bcpkix-jdk15on/1.69/bcpkix-jdk15on-1.69.jar
[get] To: <https://ci-builds.apache.org/job/POI/job/POI-DSL-Windows-1.16/ws/lib\ooxml-provided\bcpkix-jdk15on-1.69.jar>
[get] Getting: https://repo1.maven.org/maven2/org/bouncycastle/bcutil-jdk15on/1.69/bcutil-jdk15on-1.69.jar
[get] To: <https://ci-builds.apache.org/job/POI/job/POI-DSL-Windows-1.16/ws/lib\ooxml-provided\bcutil-jdk15on-1.69.jar>
[get] Destination already exists (skipping): <https://ci-builds.apache.org/job/POI/job/POI-DSL-Windows-1.16/ws/lib\ooxml-provided\xmlsec-2.2.2.jar>
check-ooxml-jars:
fetch-ooxml-jars:
[get] Destination already exists (skipping): <https://ci-builds.apache.org/job/POI/job/POI-DSL-Windows-1.16/ws/lib\ooxml\curvesapi-1.06.jar>
[get] Getting: https://repo1.maven.org/maven2/org/apache/xmlbeans/xmlbeans/5.0.0/xmlbeans-5.0.0.jar
[get] To: <https://ci-builds.apache.org/job/POI/job/POI-DSL-Windows-1.16/ws/lib\ooxml\xmlbeans-5.0.0.jar>
[get] Destination already exists (skipping): <https://ci-builds.apache.org/job/POI/job/POI-DSL-Windows-1.16/ws/lib\ooxml\commons-compress-1.20.jar>
[get] Destination already exists (skipping): <https://ci-builds.apache.org/job/POI/job/POI-DSL-Windows-1.16/ws/lib\ooxml-tests\reflections-0.9.12.jar>
[get] Destination already exists (skipping): <https://ci-builds.apache.org/job/POI/job/POI-DSL-Windows-1.16/ws/lib\ooxml-tests\guava-30.1-jre.jar>
[get] Destination already exists (skipping): <https://ci-builds.apache.org/job/POI/job/POI-DSL-Windows-1.16/ws/lib\ooxml-tests\javassist-3.27.0-GA.jar>
[get] Getting: https://repo1.maven.org/maven2/org/slf4j/slf4j-api/1.7.31/slf4j-api-1.7.31.jar
[get] To: <https://ci-builds.apache.org/job/POI/job/POI-DSL-Windows-1.16/ws/lib\ooxml-tests\slf4j-api-1.7.31.jar>
[get] Destination already exists (skipping): <https://ci-builds.apache.org/job/POI/job/POI-DSL-Windows-1.16/ws/lib\ooxml-batik\batik-anim-1.14.jar>
[get] Destination already exists (skipping): <https://ci-builds.apache.org/job/POI/job/POI-DSL-Windows-1.16/ws/lib\ooxml-batik\batik-awt-util-1.14.jar>
[get] Destination already exists (skipping): <https://ci-builds.apache.org/job/POI/job/POI-DSL-Windows-1.16/ws/lib\ooxml-batik\batik-bridge-1.14.jar>
[get] Destination already exists (skipping): <https://ci-builds.apache.org/job/POI/job/POI-DSL-Windows-1.16/ws/lib\ooxml-batik\batik-codec-1.14.jar>
[get] Destination already exists (skipping): <https://ci-builds.apache.org/job/POI/job/POI-DSL-Windows-1.16/ws/lib\ooxml-batik\batik-constants-1.14.jar>
[get] Destination already exists (skipping): <https://ci-builds.apache.org/job/POI/job/POI-DSL-Windows-1.16/ws/lib\ooxml-batik\batik-css-1.14.jar>
[get] Destination already exists (skipping): <https://ci-builds.apache.org/job/POI/job/POI-DSL-Windows-1.16/ws/lib\ooxml-batik\batik-dom-1.14.jar>
[get] Destination already exists (skipping): <https://ci-builds.apache.org/job/POI/job/POI-DSL-Windows-1.16/ws/lib\ooxml-batik\batik-ext-1.14.jar>
[get] Destination already exists (skipping): <https://ci-builds.apache.org/job/POI/job/POI-DSL-Windows-1.16/ws/lib\ooxml-batik\batik-gvt-1.14.jar>
[get] Destination already exists (skipping): <https://ci-builds.apache.org/job/POI/job/POI-DSL-Windows-1.16/ws/lib\ooxml-batik\batik-i18n-1.14.jar>
[get] Destination already exists (skipping): <https://ci-builds.apache.org/job/POI/job/POI-DSL-Windows-1.16/ws/lib\ooxml-batik\batik-parser-1.14.jar>
[get] Destination already exists (skipping): <https://ci-builds.apache.org/job/POI/job/POI-DSL-Windows-1.16/ws/lib\ooxml-batik\batik-script-1.14.jar>
[get] Destination already exists (skipping): <https://ci-builds.apache.org/job/POI/job/POI-DSL-Windows-1.16/ws/lib\ooxml-batik\batik-shared-resources-1.14.jar>
[get] Destination already exists (skipping): <https://ci-builds.apache.org/job/POI/job/POI-DSL-Windows-1.16/ws/lib\ooxml-batik\batik-svg-dom-1.14.jar>
[get] Destination already exists (skipping): <https://ci-builds.apache.org/job/POI/job/POI-DSL-Windows-1.16/ws/lib\ooxml-batik\batik-svggen-1.14.jar>
[get] Destination already exists (skipping): <https://ci-builds.apache.org/job/POI/job/POI-DSL-Windows-1.16/ws/lib\ooxml-batik\batik-svgrasterizer-1.14.jar>
[get] Destination already exists (skipping): <https://ci-builds.apache.org/job/POI/job/POI-DSL-Windows-1.16/ws/lib\ooxml-batik\batik-transcoder-1.14.jar>
[get] Destination already exists (skipping): <https://ci-builds.apache.org/job/POI/job/POI-DSL-Windows-1.16/ws/lib\ooxml-batik\batik-util-1.14.jar>
[get] Destination already exists (skipping): <https://ci-builds.apache.org/job/POI/job/POI-DSL-Windows-1.16/ws/lib\ooxml-batik\batik-xml-1.14.jar>
[get] Destination already exists (skipping): <https://ci-builds.apache.org/job/POI/job/POI-DSL-Windows-1.16/ws/lib\ooxml-batik\xml-apis-ext-1.3.04.jar>
[get] Destination already exists (skipping): <https://ci-builds.apache.org/job/POI/job/POI-DSL-Windows-1.16/ws/lib\ooxml-batik\xmlgraphics-commons-2.4.jar>
[get] Getting: https://repo1.maven.org/maven2/org/apache/pdfbox/pdfbox/2.0.24/pdfbox-2.0.24.jar
[get] To: <https://ci-builds.apache.org/job/POI/job/POI-DSL-Windows-1.16/ws/lib\ooxml-provided\pdfbox-2.0.24.jar>
[get] Getting: https://repo1.maven.org/maven2/org/apache/pdfbox/fontbox/2.0.24/fontbox-2.0.24.jar
[get] To: <https://ci-builds.apache.org/job/POI/job/POI-DSL-Windows-1.16/ws/lib\ooxml-provided\fontbox-2.0.24.jar>
[get] Getting: https://repo1.maven.org/maven2/de/rototor/pdfbox/graphics2d/0.32/graphics2d-0.32.jar
[get] To: <https://ci-builds.apache.org/job/POI/job/POI-DSL-Windows-1.16/ws/lib\ooxml-provided\graphics2d-0.32.jar>
init:
[mkdir] Created dir: <https://ci-builds.apache.org/job/POI/job/POI-DSL-Windows-1.16/ws/build>
[mkdir] Created dir: <https://ci-builds.apache.org/job/POI/job/POI-DSL-Windows-1.16/ws/poi\build\classes\ant\java>
[mkdir] Created dir: <https://ci-builds.apache.org/job/POI/job/POI-DSL-Windows-1.16/ws/poi\build\test-classes>
[mkdir] Created dir: <https://ci-builds.apache.org/job/POI/job/POI-DSL-Windows-1.16/ws/poi\build\test-results>
[mkdir] Created dir: <https://ci-builds.apache.org/job/POI/job/POI-DSL-Windows-1.16/ws/poi-scratchpad\build\classes\ant\java>
[mkdir] Created dir: <https://ci-builds.apache.org/job/POI/job/POI-DSL-Windows-1.16/ws/poi-scratchpad\build\test-classes>
[mkdir] Created dir: <https://ci-builds.apache.org/job/POI/job/POI-DSL-Windows-1.16/ws/poi-scratchpad\build\test-results>
[mkdir] Created dir: <https://ci-builds.apache.org/job/POI/job/POI-DSL-Windows-1.16/ws/poi-ooxml\build\classes\ant\java>
[mkdir] Created dir: <https://ci-builds.apache.org/job/POI/job/POI-DSL-Windows-1.16/ws/poi-ooxml\build\test-classes>
[mkdir] Created dir: <https://ci-builds.apache.org/job/POI/job/POI-DSL-Windows-1.16/ws/poi-ooxml-full\build\classes\ant\java>
[mkdir] Created dir: <https://ci-builds.apache.org/job/POI/job/POI-DSL-Windows-1.16/ws/poi-ooxml-full\build\test-classes>
[mkdir] Created dir: <https://ci-builds.apache.org/job/POI/job/POI-DSL-Windows-1.16/ws/poi-ooxml-full\build\generated-sources>
[mkdir] Created dir: <https://ci-builds.apache.org/job/POI/job/POI-DSL-Windows-1.16/ws/poi-ooxml-full\build\generated-classes>
[mkdir] Created dir: <https://ci-builds.apache.org/job/POI/job/POI-DSL-Windows-1.16/ws/poi-ooxml\build\test-results>
[mkdir] Created dir: <https://ci-builds.apache.org/job/POI/job/POI-DSL-Windows-1.16/ws/poi-excelant\build\classes\ant\java>
[mkdir] Created dir: <https://ci-builds.apache.org/job/POI/job/POI-DSL-Windows-1.16/ws/poi-excelant\build\test-classes>
[mkdir] Created dir: <https://ci-builds.apache.org/job/POI/job/POI-DSL-Windows-1.16/ws/poi-excelant\build\test-results>
[mkdir] Created dir: <https://ci-builds.apache.org/job/POI/job/POI-DSL-Windows-1.16/ws/poi-examples\build\classes\ant\java>
[mkdir] Created dir: <https://ci-builds.apache.org/job/POI/job/POI-DSL-Windows-1.16/ws/poi-integration\build\test-classes>
[mkdir] Created dir: <https://ci-builds.apache.org/job/POI/job/POI-DSL-Windows-1.16/ws/poi-integration\build\test-results>
[mkdir] Created dir: <https://ci-builds.apache.org/job/POI/job/POI-DSL-Windows-1.16/ws/build\dist>
[mkdir] Created dir: <https://ci-builds.apache.org/job/POI/job/POI-DSL-Windows-1.16/ws/build\site>
[echo] Using Ant: Apache Ant(TM) version 1.10.9 compiled on September 27 2020 from F:\\jenkins\\tools\\ant\\latest1.10, Ant detected Java 16 (may be different than actual Java sometimes...)
[echo] Using Java: 16-ea/16-ea+24-1553/16-ea+24-1553/OpenJDK 64-Bit Server VM from Oracle Corporation on Windows Server 2016: 10.0
[echo] Building Apache POI version 5.0.1-SNAPSHOT and RC: RC1, isJava8: false
[echo] Compiling for Java 9+
-version-java-check:
compile-version:
[mkdir] Created dir: <https://ci-builds.apache.org/job/POI/job/POI-DSL-Windows-1.16/ws/poi\build\generated-sources\org\apache\poi>
[copy] Copying 1 file to <https://ci-builds.apache.org/job/POI/job/POI-DSL-Windows-1.16/ws/poi\build\generated-sources\org\apache\poi>
[javac] Compiling 1 source file to <https://ci-builds.apache.org/job/POI/job/POI-DSL-Windows-1.16/ws/poi\build\classes\ant\java>
[javac] warning: [options] bootstrap class path not set in conjunction with -source 8
[javac] 1 warning
compile-main:
[javac] Compiling 1171 source files to <https://ci-builds.apache.org/job/POI/job/POI-DSL-Windows-1.16/ws/poi\build\classes\ant\java>
[javac] Ignoring source, target and bootclasspath as release has been set
[javac] Note: Some input files use or override a deprecated API.
[javac] Note: Recompile with -Xlint:deprecation for details.
[javac] Note: Some input files use unchecked or unsafe operations.
[javac] Note: Recompile with -Xlint:unchecked for details.
[javac] Creating empty <https://ci-builds.apache.org/job/POI/job/POI-DSL-Windows-1.16/ws/poi\build\classes\ant\java\org\apache\poi\ddf\package-info.class>
[javac] Creating empty <https://ci-builds.apache.org/job/POI/job/POI-DSL-Windows-1.16/ws/poi\build\classes\ant\java\org\apache\poi\hssf\package-info.class>
[javac] Creating empty <https://ci-builds.apache.org/job/POI/job/POI-DSL-Windows-1.16/ws/poi\build\classes\ant\java\org\apache\poi\poifs\dev\package-info.class>
[javac] Creating empty <https://ci-builds.apache.org/job/POI/job/POI-DSL-Windows-1.16/ws/poi\build\classes\ant\java\org\apache\poi\util\package-info.class>
[javac] Creating empty <https://ci-builds.apache.org/job/POI/job/POI-DSL-Windows-1.16/ws/poi\build\classes\ant\java\org\apache\poi\poifs\common\package-info.class>
[javac] Creating empty <https://ci-builds.apache.org/job/POI/job/POI-DSL-Windows-1.16/ws/poi\build\classes\ant\java\org\apache\poi\hssf\record\package-info.class>
[javac] Creating empty <https://ci-builds.apache.org/job/POI/job/POI-DSL-Windows-1.16/ws/poi\build\classes\ant\java\org\apache\poi\poifs\package-info.class>
[javac] Creating empty <https://ci-builds.apache.org/job/POI/job/POI-DSL-Windows-1.16/ws/poi\build\classes\ant\java\org\apache\poi\poifs\crypt\package-info.class>
[javac] Creating empty <https://ci-builds.apache.org/job/POI/job/POI-DSL-Windows-1.16/ws/poi\build\classes\ant\java\org\apache\poi\hpsf\wellknown\package-info.class>
[javac] Creating empty <https://ci-builds.apache.org/job/POI/job/POI-DSL-Windows-1.16/ws/poi\build\classes\ant\java\org\apache\poi\hssf\dev\package-info.class>
[javac] Creating empty <https://ci-builds.apache.org/job/POI/job/POI-DSL-Windows-1.16/ws/poi\build\classes\ant\java\org\apache\poi\ss\formula\package-info.class>
[javac] Creating empty <https://ci-builds.apache.org/job/POI/job/POI-DSL-Windows-1.16/ws/poi\build\classes\ant\java\org\apache\poi\hpsf\package-info.class>
[javac] Creating empty <https://ci-builds.apache.org/job/POI/job/POI-DSL-Windows-1.16/ws/poi\build\classes\ant\java\org\apache\poi\poifs\property\package-info.class>
[javac] Creating empty <https://ci-builds.apache.org/job/POI/job/POI-DSL-Windows-1.16/ws/poi\build\classes\ant\java\org\apache\poi\poifs\filesystem\package-info.class>
[javac] Creating empty <https://ci-builds.apache.org/job/POI/job/POI-DSL-Windows-1.16/ws/poi\build\classes\ant\java\org\apache\poi\ss\formula\ptg\package-info.class>
[javac] Creating empty <https://ci-builds.apache.org/job/POI/job/POI-DSL-Windows-1.16/ws/poi\build\classes\ant\java\org\apache\poi\poifs\storage\package-info.class>
[javac] Creating empty <https://ci-builds.apache.org/job/POI/job/POI-DSL-Windows-1.16/ws/poi\build\classes\ant\java\org\apache\poi\hssf\eventusermodel\package-info.class>
[javac] Creating empty <https://ci-builds.apache.org/job/POI/job/POI-DSL-Windows-1.16/ws/poi\build\classes\ant\java\org\apache\poi\hssf\record\aggregates\package-info.class>
[javac] Creating empty <https://ci-builds.apache.org/job/POI/job/POI-DSL-Windows-1.16/ws/poi\build\classes\ant\java\org\apache\poi\ss\format\package-info.class>
[javac] Creating empty <https://ci-builds.apache.org/job/POI/job/POI-DSL-Windows-1.16/ws/poi\build\classes\ant\java\org\apache\poi\hssf\model\package-info.class>
[javac] Creating empty <https://ci-builds.apache.org/job/POI/job/POI-DSL-Windows-1.16/ws/poi\build\classes\ant\java\org\apache\poi\hssf\usermodel\package-info.class>
[javac] Creating empty <https://ci-builds.apache.org/job/POI/job/POI-DSL-Windows-1.16/ws/poi\build\classes\ant\java\org\apache\poi\hssf\util\package-info.class>
[javac] Creating empty <https://ci-builds.apache.org/job/POI/job/POI-DSL-Windows-1.16/ws/poi\build\classes\ant\java\org\apache\poi\poifs\eventfilesystem\package-info.class>
[javac] Compiling 1 source file to <https://ci-builds.apache.org/job/POI/job/POI-DSL-Windows-1.16/ws/poi\src\main\java9>
[javac] <https://ci-builds.apache.org/job/POI/job/POI-DSL-Windows-1.16/ws/poi\src\main\java9\module-info.java>:21: error: module not found: org.apache.commons.compress
[javac] requires org.apache.commons.compress;
[javac] ^
[javac] 1 error
BUILD FAILED
<https://ci-builds.apache.org/job/POI/job/POI-DSL-Windows-1.16/ws/build.xml>:1208: The following error occurred while executing this line:
<https://ci-builds.apache.org/job/POI/job/POI-DSL-Windows-1.16/ws/build.xml>:1093: Compile failed; see the compiler error output for details.
Total time: 1 minute 7 seconds
Build step 'Invoke Ant' marked build as failure
[SpotBugs] Skipping execution of recorder since overall result is 'FAILURE'
Archiving artifacts
Skipping publisher since build result is FAILURE
Recording test results
ERROR: Step ‘Publish JUnit test result report’ failed: No test report files were found. Configuration error?
---------------------------------------------------------------------
To unsubscribe, e-mail: dev-unsubscribe@poi.apache.org
For additional commands, e-mail: dev-help@poi.apache.org