You are viewing a plain text version of this content. The canonical link for it is here.
Posted to oak-issues@jackrabbit.apache.org by "Chetan Mehrotra (JIRA)" <ji...@apache.org> on 2014/10/14 08:08:33 UTC

[jira] [Created] (OAK-2185) Fix intermittent failure in JaasConfigSpiTest

Chetan Mehrotra created OAK-2185:
------------------------------------

             Summary: Fix intermittent failure in JaasConfigSpiTest
                 Key: OAK-2185
                 URL: https://issues.apache.org/jira/browse/OAK-2185
             Project: Jackrabbit Oak
          Issue Type: Task
          Components: oak-pojosr
            Reporter: Chetan Mehrotra
            Assignee: Chetan Mehrotra
            Priority: Minor
             Fix For: 1.2


Intermittent failures on windows are observed in JaasConfigSpiTest with following exception

{noformat}
Tests run: 1, Failures: 0, Errors: 1, Skipped: 0, Time elapsed: 3.841 sec <<< FAILURE!
defaultConfigSpiAuth(org.apache.jackrabbit.oak.run.osgi.JaasConfigSpiTest)  Time elapsed: 3.835 sec  <<< ERROR!
java.lang.reflect.UndeclaredThrowableException
	at $Proxy7.login(Unknown Source)
	at javax.jcr.Repository$login.call(Unknown Source)
	at org.codehaus.groovy.runtime.callsite.CallSiteArray.defaultCall(CallSiteArray.java:45)
	at org.codehaus.groovy.runtime.callsite.AbstractCallSite.call(AbstractCallSite.java:108)
	at org.codehaus.groovy.runtime.callsite.AbstractCallSite.call(AbstractCallSite.java:116)
	at org.apache.jackrabbit.oak.run.osgi.JaasConfigSpiTest.defaultConfigSpiAuth(JaasConfigSpiTest.groovy:75)
	at sun.reflect.NativeMethodAccessorImpl.invoke0(Native Method)
	at sun.reflect.NativeMethodAccessorImpl.invoke(NativeMethodAccessorImpl.java:39)
	at sun.reflect.DelegatingMethodAccessorImpl.invoke(DelegatingMethodAccessorImpl.java:25)
	at java.lang.reflect.Method.invoke(Method.java:597)
	at org.junit.runners.model.FrameworkMethod$1.runReflectiveCall(FrameworkMethod.java:45)
	at org.junit.internal.runners.model.ReflectiveCallable.run(ReflectiveCallable.java:15)
	at org.junit.runners.model.FrameworkMethod.invokeExplosively(FrameworkMethod.java:42)
	at org.junit.internal.runners.statements.InvokeMethod.evaluate(InvokeMethod.java:20)
	at org.junit.internal.runners.statements.RunBefores.evaluate(RunBefores.java:28)
	at org.junit.internal.runners.statements.RunAfters.evaluate(RunAfters.java:30)
	at org.junit.runners.ParentRunner.runLeaf(ParentRunner.java:263)
	at org.junit.runners.BlockJUnit4ClassRunner.runChild(BlockJUnit4ClassRunner.java:68)
	at org.junit.runners.BlockJUnit4ClassRunner.runChild(BlockJUnit4ClassRunner.java:47)
	at org.junit.runners.ParentRunner$3.run(ParentRunner.java:231)
	at org.junit.runners.ParentRunner$1.schedule(ParentRunner.java:60)
	at org.junit.runners.ParentRunner.runChildren(ParentRunner.java:229)
	at org.junit.runners.ParentRunner.access$000(ParentRunner.java:50)
	at org.junit.runners.ParentRunner$2.evaluate(ParentRunner.java:222)
	at org.junit.runners.ParentRunner.run(ParentRunner.java:300)
	at org.apache.maven.surefire.junit4.JUnit4Provider.execute(JUnit4Provider.java:252)
	at org.apache.maven.surefire.junit4.JUnit4Provider.executeTestSet(JUnit4Provider.java:141)
	at org.apache.maven.surefire.junit4.JUnit4Provider.invoke(JUnit4Provider.java:112)
	at sun.reflect.NativeMethodAccessorImpl.invoke0(Native Method)
	at sun.reflect.NativeMethodAccessorImpl.invoke(NativeMethodAccessorImpl.java:39)
	at sun.reflect.DelegatingMethodAccessorImpl.invoke(DelegatingMethodAccessorImpl.java:25)
	at java.lang.reflect.Method.invoke(Method.java:597)
	at org.apache.maven.surefire.util.ReflectionUtils.invokeMethodWithArray(ReflectionUtils.java:189)
	at org.apache.maven.surefire.booter.ProviderFactory$ProviderProxy.invoke(ProviderFactory.java:165)
	at org.apache.maven.surefire.booter.ProviderFactory.invokeProvider(ProviderFactory.java:85)
	at org.apache.maven.surefire.booter.ForkedBooter.runSuitesInProcess(ForkedBooter.java:115)
	at org.apache.maven.surefire.booter.ForkedBooter.main(ForkedBooter.java:75)
Caused by: java.lang.reflect.InvocationTargetException
	at sun.reflect.NativeMethodAccessorImpl.invoke0(Native Method)
	at sun.reflect.NativeMethodAccessorImpl.invoke(NativeMethodAccessorImpl.java:39)
	at sun.reflect.DelegatingMethodAccessorImpl.invoke(DelegatingMethodAccessorImpl.java:25)
	at java.lang.reflect.Method.invoke(Method.java:597)
	at org.apache.jackrabbit.oak.run.osgi.OakOSGiRepositoryFactory$RepositoryProxy.invoke(OakOSGiRepositoryFactory.java:325)
	... 37 more
Caused by: javax.jcr.LoginException: No LoginModules configured for jackrabbit.oak
	at org.apache.jackrabbit.oak.jcr.repository.RepositoryImpl.login(RepositoryImpl.java:264)
	at org.apache.jackrabbit.oak.jcr.repository.RepositoryImpl.login(RepositoryImpl.java:222)
	... 42 more
Caused by: javax.security.auth.login.LoginException: No LoginModules configured for jackrabbit.oak
	at javax.security.auth.login.LoginContext.init(LoginContext.java:256)
	at javax.security.auth.login.LoginContext.<init>(LoginContext.java:499)
	at org.apache.jackrabbit.oak.spi.security.authentication.JaasLoginContext.<init>(JaasLoginContext.java:49)
	at org.apache.jackrabbit.oak.security.authentication.LoginContextProviderImpl.getLoginContext(LoginContextProviderImpl.java:85)
	at org.apache.jackrabbit.oak.core.ContentRepositoryImpl.login(ContentRepositoryImpl.java:161)
	at org.apache.jackrabbit.oak.jcr.repository.RepositoryImpl.login(RepositoryImpl.java:256)
	... 43 more

Running org.apache.jackrabbit.oak.run.osgi.JsonConfigRepFactoryTest
{noformat}



--
This message was sent by Atlassian JIRA
(v6.3.4#6332)