You are viewing a plain text version of this content. The canonical link for it is here.
Posted to builds@hbase.apache.org by Apache Jenkins Server <je...@builds.apache.org> on 2015/01/27 18:25:23 UTC
Build failed in Jenkins: HBase-TRUNK #6062
See <https://builds.apache.org/job/HBase-TRUNK/6062/changes>
Changes:
[tedyu] HBASE-12929 TableMapReduceUtil.initTableMapperJob unnecessarily limits the types of outputKeyClass and outputValueClass (Will Temperley)
------------------------------------------
[...truncated 5195 lines...]
at sun.reflect.DelegatingMethodAccessorImpl.invoke(DelegatingMethodAccessorImpl.java:43)
at java.lang.reflect.Method.invoke(Method.java:606)
at org.apache.hadoop.io.retry.RetryInvocationHandler.invokeMethod(RetryInvocationHandler.java:187)
at org.apache.hadoop.io.retry.RetryInvocationHandler.invoke(RetryInvocationHandler.java:102)
at com.sun.proxy.$Proxy20.getBlockLocations(Unknown Source)
at org.apache.hadoop.hdfs.protocolPB.ClientNamenodeProtocolTranslatorPB.getBlockLocations(ClientNamenodeProtocolTranslatorPB.java:225)
at sun.reflect.GeneratedMethodAccessor32.invoke(Unknown Source)
at sun.reflect.DelegatingMethodAccessorImpl.invoke(DelegatingMethodAccessorImpl.java:43)
at java.lang.reflect.Method.invoke(Method.java:606)
at org.apache.hadoop.hbase.fs.HFileSystem$1.invoke(HFileSystem.java:279)
at com.sun.proxy.$Proxy21.getBlockLocations(Unknown Source)
at org.apache.hadoop.hdfs.DFSClient.callGetBlockLocations(DFSClient.java:1165)
... 25 more
at org.apache.hadoop.hbase.ipc.AsyncServerResponseHandler.createRemoteException(AsyncServerResponseHandler.java:124)
at org.apache.hadoop.hbase.ipc.AsyncServerResponseHandler.channelRead(AsyncServerResponseHandler.java:83)
at io.netty.channel.AbstractChannelHandlerContext.invokeChannelRead(AbstractChannelHandlerContext.java:333)
at io.netty.channel.AbstractChannelHandlerContext.fireChannelRead(AbstractChannelHandlerContext.java:319)
at io.netty.handler.codec.ByteToMessageDecoder.channelRead(ByteToMessageDecoder.java:163)
at io.netty.channel.AbstractChannelHandlerContext.invokeChannelRead(AbstractChannelHandlerContext.java:333)
at io.netty.channel.AbstractChannelHandlerContext.fireChannelRead(AbstractChannelHandlerContext.java:319)
at io.netty.channel.DefaultChannelPipeline.fireChannelRead(DefaultChannelPipeline.java:787)
at io.netty.channel.nio.AbstractNioByteChannel$NioByteUnsafe.read(AbstractNioByteChannel.java:130)
at io.netty.channel.nio.NioEventLoop.processSelectedKey(NioEventLoop.java:511)
at io.netty.channel.nio.NioEventLoop.processSelectedKeysOptimized(NioEventLoop.java:468)
at io.netty.channel.nio.NioEventLoop.processSelectedKeys(NioEventLoop.java:382)
at io.netty.channel.nio.NioEventLoop.run(NioEventLoop.java:354)
at io.netty.util.concurrent.SingleThreadEventExecutor$2.run(SingleThreadEventExecutor.java:116)
at java.lang.Thread.run(Thread.java:724)
Tests run: 5, Failures: 0, Errors: 0, Skipped: 0, Time elapsed: 69.142 sec - in org.apache.hadoop.hbase.client.TestCloneSnapshotFromClientWithRegionReplicas
Running org.apache.hadoop.hbase.client.TestFromClientSide
Running org.apache.hadoop.hbase.client.TestUpdateConfiguration
Tests run: 2, Failures: 0, Errors: 0, Skipped: 0, Time elapsed: 0.194 sec - in org.apache.hadoop.hbase.client.TestUpdateConfiguration
Running org.apache.hadoop.hbase.client.TestClientPushback
Tests run: 1, Failures: 0, Errors: 0, Skipped: 0, Time elapsed: 1.463 sec - in org.apache.hadoop.hbase.client.TestClientPushback
Running org.apache.hadoop.hbase.client.TestRestoreSnapshotFromClientWithRegionReplicas
Tests run: 1, Failures: 0, Errors: 0, Skipped: 0, Time elapsed: 54.701 sec - in org.apache.hadoop.hbase.client.TestClientOperationInterrupt
Running org.apache.hadoop.hbase.client.TestReplicaWithCluster
Tests run: 21, Failures: 0, Errors: 0, Skipped: 3, Time elapsed: 153.037 sec - in org.apache.hadoop.hbase.client.TestHCM
Running org.apache.hadoop.hbase.client.TestHTableMultiplexer
Running org.apache.hadoop.hbase.client.TestScannerTimeout
Tests run: 1, Failures: 0, Errors: 0, Skipped: 0, Time elapsed: 7.92 sec - in org.apache.hadoop.hbase.client.TestHTableMultiplexer
Running org.apache.hadoop.hbase.client.TestReplicasClient
Tests run: 4, Failures: 0, Errors: 0, Skipped: 0, Time elapsed: 27.243 sec - in org.apache.hadoop.hbase.client.TestReplicaWithCluster
Running org.apache.hadoop.hbase.client.TestTableSnapshotScanner
Tests run: 4, Failures: 0, Errors: 0, Skipped: 0, Time elapsed: 39.662 sec - in org.apache.hadoop.hbase.client.TestScannerTimeout
Running org.apache.hadoop.hbase.client.TestFromClientSide3
Tests run: 3, Failures: 0, Errors: 0, Skipped: 0, Time elapsed: 39.009 sec - in org.apache.hadoop.hbase.client.TestTableSnapshotScanner
Running org.apache.hadoop.hbase.client.TestRestoreSnapshotFromClient
Tests run: 80, Failures: 0, Errors: 0, Skipped: 4, Time elapsed: 103.675 sec - in org.apache.hadoop.hbase.client.TestFromClientSide
Tests run: 5, Failures: 0, Errors: 0, Skipped: 0, Time elapsed: 92.579 sec - in org.apache.hadoop.hbase.client.TestRestoreSnapshotFromClientWithRegionReplicas
Running org.apache.hadoop.hbase.client.TestSnapshotMetadata
Tests run: 6, Failures: 0, Errors: 0, Skipped: 0, Time elapsed: 33.621 sec - in org.apache.hadoop.hbase.client.TestFromClientSide3
Running org.apache.hadoop.hbase.client.TestHTableMultiplexerFlushCache
Tests run: 1, Failures: 0, Errors: 0, Skipped: 0, Time elapsed: 4.471 sec - in org.apache.hadoop.hbase.client.TestHTableMultiplexerFlushCache
Running org.apache.hadoop.hbase.TestMultiVersions
Tests run: 4, Failures: 0, Errors: 0, Skipped: 0, Time elapsed: 14.607 sec - in org.apache.hadoop.hbase.client.TestSnapshotMetadata
Running org.apache.hadoop.hbase.TestHColumnDescriptorDefaultVersions
Tests run: 3, Failures: 0, Errors: 0, Skipped: 0, Time elapsed: 6.397 sec - in org.apache.hadoop.hbase.TestMultiVersions
Running org.apache.hadoop.hbase.procedure.TestZKProcedure
Running org.apache.hadoop.hbase.procedure.TestZKProcedureControllers
Tests run: 4, Failures: 0, Errors: 0, Skipped: 0, Time elapsed: 2.358 sec - in org.apache.hadoop.hbase.procedure.TestZKProcedure
Tests run: 4, Failures: 0, Errors: 0, Skipped: 0, Time elapsed: 1.684 sec - in org.apache.hadoop.hbase.procedure.TestZKProcedureControllers
Tests run: 3, Failures: 0, Errors: 0, Skipped: 0, Time elapsed: 11.077 sec - in org.apache.hadoop.hbase.TestHColumnDescriptorDefaultVersions
Running org.apache.hadoop.hbase.TestNamespace
Running org.apache.hadoop.hbase.constraint.TestConstraint
Running org.apache.hadoop.hbase.TestZooKeeper
Tests run: 9, Failures: 0, Errors: 0, Skipped: 1, Time elapsed: 7.89 sec - in org.apache.hadoop.hbase.TestNamespace
Tests run: 13, Failures: 0, Errors: 0, Skipped: 0, Time elapsed: 104.435 sec - in org.apache.hadoop.hbase.client.TestReplicasClient
Tests run: 5, Failures: 0, Errors: 0, Skipped: 0, Time elapsed: 8.156 sec - in org.apache.hadoop.hbase.constraint.TestConstraint
Running org.apache.hadoop.hbase.snapshot.TestFlushSnapshotFromClient
Running org.apache.hadoop.hbase.snapshot.TestExportSnapshot
Running org.apache.hadoop.hbase.snapshot.TestSecureExportSnapshot
Tests run: 5, Failures: 0, Errors: 0, Skipped: 0, Time elapsed: 84.99 sec - in org.apache.hadoop.hbase.client.TestRestoreSnapshotFromClient
Running org.apache.hadoop.hbase.snapshot.TestRestoreFlushSnapshotFromClient
Tests run: 9, Failures: 0, Errors: 0, Skipped: 0, Time elapsed: 49.138 sec - in org.apache.hadoop.hbase.snapshot.TestFlushSnapshotFromClient
Running org.apache.hadoop.hbase.snapshot.TestSnapshotDescriptionUtils
Tests run: 2, Failures: 0, Errors: 0, Skipped: 0, Time elapsed: 0.16 sec - in org.apache.hadoop.hbase.snapshot.TestSnapshotDescriptionUtils
Running org.apache.hadoop.hbase.TestIOFencing
Tests run: 5, Failures: 0, Errors: 0, Skipped: 0, Time elapsed: 51.112 sec - in org.apache.hadoop.hbase.snapshot.TestRestoreFlushSnapshotFromClient
Running org.apache.hadoop.hbase.coprocessor.TestRegionObserverScannerOpenHook
Tests run: 3, Failures: 0, Errors: 0, Skipped: 0, Time elapsed: 10.738 sec - in org.apache.hadoop.hbase.coprocessor.TestRegionObserverScannerOpenHook
Running org.apache.hadoop.hbase.coprocessor.TestOpenTableInCoprocessor
Tests run: 2, Failures: 0, Errors: 0, Skipped: 0, Time elapsed: 5.964 sec - in org.apache.hadoop.hbase.coprocessor.TestOpenTableInCoprocessor
Running org.apache.hadoop.hbase.coprocessor.TestMasterCoprocessorExceptionWithAbort
Tests run: 1, Failures: 0, Errors: 0, Skipped: 0, Time elapsed: 27.33 sec - in org.apache.hadoop.hbase.coprocessor.TestMasterCoprocessorExceptionWithAbort
Running org.apache.hadoop.hbase.coprocessor.TestRegionServerCoprocessorEndpoint
Tests run: 1, Failures: 0, Errors: 0, Skipped: 0, Time elapsed: 1.138 sec - in org.apache.hadoop.hbase.coprocessor.TestRegionServerCoprocessorEndpoint
Running org.apache.hadoop.hbase.coprocessor.TestRegionObserverInterface
Tests run: 11, Failures: 0, Errors: 0, Skipped: 0, Time elapsed: 198.47 sec - in org.apache.hadoop.hbase.TestZooKeeper
Running org.apache.hadoop.hbase.coprocessor.TestMasterCoprocessorExceptionWithRemove
Tests run: 1, Failures: 0, Errors: 0, Skipped: 0, Time elapsed: 4.781 sec - in org.apache.hadoop.hbase.coprocessor.TestMasterCoprocessorExceptionWithRemove
Tests run: 13, Failures: 0, Errors: 0, Skipped: 0, Time elapsed: 41.301 sec - in org.apache.hadoop.hbase.coprocessor.TestRegionObserverInterface
Running org.apache.hadoop.hbase.coprocessor.TestAggregateProtocol
Tests run: 44, Failures: 0, Errors: 0, Skipped: 0, Time elapsed: 7.455 sec - in org.apache.hadoop.hbase.coprocessor.TestAggregateProtocol
Running org.apache.hadoop.hbase.coprocessor.TestBatchCoprocessorEndpoint
Tests run: 4, Failures: 0, Errors: 0, Skipped: 0, Time elapsed: 1.416 sec - in org.apache.hadoop.hbase.coprocessor.TestBatchCoprocessorEndpoint
Running org.apache.hadoop.hbase.coprocessor.TestRegionServerObserver
Running org.apache.hadoop.hbase.coprocessor.TestHTableWrapper
Tests run: 1, Failures: 0, Errors: 0, Skipped: 0, Time elapsed: 3.361 sec - in org.apache.hadoop.hbase.coprocessor.TestHTableWrapper
Tests run: 1, Failures: 0, Errors: 0, Skipped: 0, Time elapsed: 12.59 sec - in org.apache.hadoop.hbase.coprocessor.TestRegionServerObserver
Running org.apache.hadoop.hbase.coprocessor.TestRegionServerCoprocessorExceptionWithAbort
Running org.apache.hadoop.hbase.coprocessor.TestClassLoading
Tests run: 2, Failures: 0, Errors: 0, Skipped: 0, Time elapsed: 185.915 sec - in org.apache.hadoop.hbase.TestIOFencing
Running org.apache.hadoop.hbase.coprocessor.TestDoubleColumnInterpreter
Tests run: 2, Failures: 0, Errors: 0, Skipped: 0, Time elapsed: 14.308 sec - in org.apache.hadoop.hbase.coprocessor.TestRegionServerCoprocessorExceptionWithAbort
Tests run: 9, Failures: 0, Errors: 0, Skipped: 0, Time elapsed: 17.347 sec - in org.apache.hadoop.hbase.coprocessor.TestClassLoading
Tests run: 38, Failures: 0, Errors: 0, Skipped: 0, Time elapsed: 5.937 sec - in org.apache.hadoop.hbase.coprocessor.TestDoubleColumnInterpreter
Running org.apache.hadoop.hbase.coprocessor.TestRegionObserverBypass
Tests run: 2, Failures: 0, Errors: 0, Skipped: 0, Time elapsed: 3.848 sec - in org.apache.hadoop.hbase.coprocessor.TestRegionObserverBypass
Running org.apache.hadoop.hbase.coprocessor.TestRowProcessorEndpoint
Running org.apache.hadoop.hbase.coprocessor.TestCoprocessorStop
Running org.apache.hadoop.hbase.coprocessor.TestRegionServerCoprocessorExceptionWithRemove
Tests run: 4, Failures: 0, Errors: 0, Skipped: 0, Time elapsed: 8.951 sec - in org.apache.hadoop.hbase.coprocessor.TestRowProcessorEndpoint
Tests run: 1, Failures: 0, Errors: 0, Skipped: 0, Time elapsed: 16.04 sec - in org.apache.hadoop.hbase.coprocessor.TestCoprocessorStop
Running org.apache.hadoop.hbase.coprocessor.TestBigDecimalColumnInterpreter
Tests run: 1, Failures: 0, Errors: 0, Skipped: 0, Time elapsed: 13.772 sec - in org.apache.hadoop.hbase.coprocessor.TestRegionServerCoprocessorExceptionWithRemove
Tests run: 38, Failures: 0, Errors: 0, Skipped: 0, Time elapsed: 6.599 sec - in org.apache.hadoop.hbase.coprocessor.TestBigDecimalColumnInterpreter
Running org.apache.hadoop.hbase.coprocessor.TestMasterObserver
Running org.apache.hadoop.hbase.coprocessor.TestCoprocessorEndpoint
Running org.apache.hadoop.hbase.coprocessor.TestWALObserver
Tests run: 7, Failures: 0, Errors: 0, Skipped: 0, Time elapsed: 13.842 sec - in org.apache.hadoop.hbase.coprocessor.TestMasterObserver
Running org.apache.hadoop.hbase.TestGlobalMemStoreSize
Tests run: 6, Failures: 0, Errors: 0, Skipped: 0, Time elapsed: 7.969 sec - in org.apache.hadoop.hbase.coprocessor.TestWALObserver
Running org.apache.hadoop.hbase.TestJMXListener
Tests run: 1, Failures: 0, Errors: 0, Skipped: 0, Time elapsed: 11.868 sec - in org.apache.hadoop.hbase.TestGlobalMemStoreSize
Running org.apache.hadoop.hbase.TestMetaTableLocator
Tests run: 7, Failures: 0, Errors: 0, Skipped: 0, Time elapsed: 3.433 sec - in org.apache.hadoop.hbase.TestMetaTableLocator
Tests run: 9, Failures: 0, Errors: 0, Skipped: 0, Time elapsed: 305.622 sec - in org.apache.hadoop.hbase.snapshot.TestSecureExportSnapshot
Running org.apache.hadoop.hbase.zookeeper.TestZKMulti
Tests run: 8, Failures: 0, Errors: 0, Skipped: 0, Time elapsed: 0.584 sec - in org.apache.hadoop.hbase.zookeeper.TestZKMulti
Running org.apache.hadoop.hbase.zookeeper.lock.TestZKInterProcessReadWriteLock
Running org.apache.hadoop.hbase.zookeeper.TestZooKeeperACL
Tests run: 6, Failures: 0, Errors: 0, Skipped: 0, Time elapsed: 0.315 sec - in org.apache.hadoop.hbase.zookeeper.TestZooKeeperACL
Tests run: 9, Failures: 0, Errors: 0, Skipped: 0, Time elapsed: 312.002 sec - in org.apache.hadoop.hbase.snapshot.TestExportSnapshot
Tests run: 2, Failures: 0, Errors: 0, Skipped: 0, Time elapsed: 16.283 sec - in org.apache.hadoop.hbase.TestJMXListener
Running org.apache.hadoop.hbase.zookeeper.TestZKLeaderManager
Tests run: 1, Failures: 0, Errors: 0, Skipped: 0, Time elapsed: 0.118 sec - in org.apache.hadoop.hbase.zookeeper.TestZKLeaderManager
Running org.apache.hadoop.hbase.zookeeper.TestRecoverableZooKeeper
Running org.apache.hadoop.hbase.zookeeper.TestHQuorumPeer
Running org.apache.hadoop.hbase.zookeeper.TestZooKeeperNodeTracker
Tests run: 1, Failures: 0, Errors: 0, Skipped: 0, Time elapsed: 1.227 sec - in org.apache.hadoop.hbase.zookeeper.TestRecoverableZooKeeper
Tests run: 3, Failures: 0, Errors: 0, Skipped: 0, Time elapsed: 0.896 sec - in org.apache.hadoop.hbase.zookeeper.TestZooKeeperNodeTracker
Running org.apache.hadoop.hbase.TestClusterBootOrder
Tests run: 3, Failures: 0, Errors: 0, Skipped: 0, Time elapsed: 15.688 sec - in org.apache.hadoop.hbase.zookeeper.TestHQuorumPeer
Tests run: 6, Failures: 0, Errors: 0, Skipped: 0, Time elapsed: 24.465 sec - in org.apache.hadoop.hbase.zookeeper.lock.TestZKInterProcessReadWriteLock
Tests run: 2, Failures: 0, Errors: 0, Skipped: 0, Time elapsed: 25.603 sec - in org.apache.hadoop.hbase.TestClusterBootOrder
Tests run: 6, Failures: 0, Errors: 0, Skipped: 0, Time elapsed: 552.719 sec - in org.apache.hadoop.hbase.coprocessor.TestCoprocessorEndpoint
Results :
Failed tests:
TestMasterFailover.testPendingOpenOrCloseWhenMasterFailover:307 Waiting timed out after [60,000] msec
Tests in error:
TestLoadIncrementalHFiles.testRegionCrossingLoad:116->runTest:207->runTest:217->runTest:230->runTest:256 » IO
TestAccessController.testTruncatePerms:2530 HBaseIO org.apache.hadoop.hbase.Ta...
Tests run: 2233, Failures: 1, Errors: 2, Skipped: 25
[INFO] ------------------------------------------------------------------------
[INFO] Reactor Summary:
[INFO]
[INFO] HBase ............................................. SUCCESS [3.025s]
[INFO] HBase - Checkstyle ................................ SUCCESS [0.669s]
[INFO] HBase - Annotations ............................... SUCCESS [0.841s]
[INFO] HBase - Protocol .................................. SUCCESS [12.954s]
[INFO] HBase - Common .................................... SUCCESS [1:02.120s]
[INFO] HBase - Client .................................... SUCCESS [1:23.686s]
[INFO] HBase - Hadoop Compatibility ...................... SUCCESS [6.994s]
[INFO] HBase - Hadoop Two Compatibility .................. SUCCESS [6.147s]
[INFO] HBase - Prefix Tree ............................... SUCCESS [8.363s]
[INFO] HBase - Server .................................... FAILURE [1:14:56.733s]
[INFO] HBase - Testing Util .............................. SKIPPED
[INFO] HBase - Thrift .................................... SKIPPED
[INFO] HBase - Shell ..................................... SKIPPED
[INFO] HBase - Integration Tests ......................... SKIPPED
[INFO] HBase - Examples .................................. SKIPPED
[INFO] HBase - Rest ...................................... SKIPPED
[INFO] HBase - Assembly .................................. SKIPPED
[INFO] ------------------------------------------------------------------------
[INFO] BUILD FAILURE
[INFO] ------------------------------------------------------------------------
[INFO] Total time: 1:18:02.346s
[INFO] Finished at: Tue Jan 27 17:23:23 UTC 2015
[INFO] Final Memory: 57M/872M
[INFO] ------------------------------------------------------------------------
[ERROR] Failed to execute goal org.apache.maven.plugins:maven-surefire-plugin:2.18:test (secondPartTestsExecution) on project hbase-server: There are test failures.
[ERROR]
[ERROR] Please refer to <https://builds.apache.org/job/HBase-TRUNK/ws/hbase-server/target/surefire-reports> for the individual test results.
[ERROR] -> [Help 1]
[ERROR]
[ERROR] To see the full stack trace of the errors, re-run Maven with the -e switch.
[ERROR] Re-run Maven using the -X switch to enable full debug logging.
[ERROR]
[ERROR] For more information about the errors and possible solutions, please read the following articles:
[ERROR] [Help 1] http://cwiki.apache.org/confluence/display/MAVEN/MojoFailureException
[ERROR]
[ERROR] After correcting the problems, you can resume the build with the command
[ERROR] mvn <goals> -rf :hbase-server
Build step 'Invoke top-level Maven targets' marked build as failure
[FINDBUGS] Skipping publisher since build result is FAILURE
Performing Post build task...
Match found for :.* : True
Logical operation result is TRUE
Running script : ZOMBIE_TESTS_COUNT=`jps | grep surefirebooter | wc -l`
if [[ $ZOMBIE_TESTS_COUNT != 0 ]] ; then
#It seems sometimes the tests are not dying immediately. Let's give them 10s
echo "Suspicious java process found - waiting 10s to see if there are just slow to stop"
sleep 10
ZOMBIE_TESTS_COUNT=`jps | grep surefirebooter | wc -l`
if [[ $ZOMBIE_TESTS_COUNT != 0 ]] ; then
echo "There are $ZOMBIE_TESTS_COUNT zombie tests, they should have been killed by surefire but survived"
echo "************ BEGIN zombies jstack extract"
ZB_STACK=`jps | grep surefirebooter | cut -d ' ' -f 1 | xargs -n 1 jstack | grep ".test" | grep "\.java"`
jps | grep surefirebooter | cut -d ' ' -f 1 | xargs -n 1 jstack
echo "************ END zombies jstack extract"
JIRA_COMMENT="$JIRA_COMMENT
{color:red}-1 core zombie tests{color}. There are ${ZOMBIE_TESTS_COUNT} zombie test(s): ${ZB_STACK}"
BAD=1
jps | grep surefirebooter | cut -d ' ' -f 1 | xargs kill -9
else
echo "We're ok: there is no zombie test, but some tests took some time to stop"
fi
else
echo "We're ok: there is no zombie test"
fi
[HBase-TRUNK] $ /bin/bash -xe /tmp/hudson5200983022490456980.sh
++ jps
++ grep surefirebooter
++ wc -l
+ ZOMBIE_TESTS_COUNT=0
+ [[ 0 != 0 ]]
+ echo 'We'\''re ok: there is no zombie test'
We're ok: there is no zombie test
POST BUILD TASK : SUCCESS
END OF POST BUILD TASK : 0
Archiving artifacts
Sending artifact delta relative to HBase-TRUNK #6052
Archived 1835 artifacts
Archive block size is 32768
Received 31 blocks and 386033165 bytes
Compression is 0.3%
Took 1 min 46 sec
Recording test results
Updating HBASE-12929
Jenkins build is back to normal : HBase-TRUNK #6068
Posted by Apache Jenkins Server <je...@builds.apache.org>.
See <https://builds.apache.org/job/HBase-TRUNK/6068/changes>
Build failed in Jenkins: HBase-TRUNK #6067
Posted by Apache Jenkins Server <je...@builds.apache.org>.
See <https://builds.apache.org/job/HBase-TRUNK/6067/changes>
Changes:
[tedyu] HBASE-12936 Quota support for namespace should take region merge into account
------------------------------------------
[...truncated 1870 lines...]
Running org.apache.hadoop.hbase.TestGlobalMemStoreSize
Tests run: 9, Failures: 0, Errors: 0, Skipped: 0, Time elapsed: 299.662 sec - in org.apache.hadoop.hbase.snapshot.TestSecureExportSnapshot
Tests run: 37, Failures: 0, Errors: 0, Skipped: 0, Time elapsed: 45.634 sec - in org.apache.hadoop.hbase.security.visibility.TestVisibilityLabelsWithDeletes
Running org.apache.hadoop.hbase.TestNamespace
Running org.apache.hadoop.hbase.constraint.TestConstraint
Tests run: 1, Failures: 0, Errors: 0, Skipped: 0, Time elapsed: 12.175 sec - in org.apache.hadoop.hbase.TestGlobalMemStoreSize
Tests run: 5, Failures: 0, Errors: 0, Skipped: 0, Time elapsed: 7.416 sec - in org.apache.hadoop.hbase.constraint.TestConstraint
Tests run: 9, Failures: 0, Errors: 0, Skipped: 1, Time elapsed: 7.693 sec - in org.apache.hadoop.hbase.TestNamespace
Running org.apache.hadoop.hbase.filter.TestFuzzyRowAndColumnRangeFilter
Tests run: 1, Failures: 0, Errors: 0, Skipped: 0, Time elapsed: 2.968 sec - in org.apache.hadoop.hbase.filter.TestFuzzyRowAndColumnRangeFilter
Running org.apache.hadoop.hbase.filter.TestMultiRowRangeFilter
Running org.apache.hadoop.hbase.filter.TestFilterWrapper
Tests run: 9, Failures: 0, Errors: 0, Skipped: 0, Time elapsed: 297.015 sec - in org.apache.hadoop.hbase.snapshot.TestExportSnapshot
Tests run: 1, Failures: 0, Errors: 0, Skipped: 0, Time elapsed: 1.903 sec - in org.apache.hadoop.hbase.filter.TestFilterWrapper
Running org.apache.hadoop.hbase.filter.TestColumnRangeFilter
Running org.apache.hadoop.hbase.filter.TestScanRowPrefix
Tests run: 18, Failures: 0, Errors: 0, Skipped: 0, Time elapsed: 11.849 sec - in org.apache.hadoop.hbase.filter.TestMultiRowRangeFilter
Running org.apache.hadoop.hbase.TestHBaseTestingUtility
Tests run: 1, Failures: 0, Errors: 0, Skipped: 0, Time elapsed: 7.231 sec - in org.apache.hadoop.hbase.filter.TestColumnRangeFilter
Tests run: 1, Failures: 0, Errors: 0, Skipped: 0, Time elapsed: 3.455 sec - in org.apache.hadoop.hbase.filter.TestScanRowPrefix
Running org.apache.hadoop.hbase.filter.TestFilterWithScanLimits
Tests run: 1, Failures: 0, Errors: 0, Skipped: 0, Time elapsed: 1.875 sec - in org.apache.hadoop.hbase.filter.TestFilterWithScanLimits
Running org.apache.hadoop.hbase.quotas.TestQuotaAdmin
Running org.apache.hadoop.hbase.quotas.TestQuotaThrottle
Running org.apache.hadoop.hbase.quotas.TestQuotaTableUtil
Tests run: 2, Failures: 0, Errors: 0, Skipped: 0, Time elapsed: 4.422 sec - in org.apache.hadoop.hbase.quotas.TestQuotaAdmin
Tests run: 3, Failures: 0, Errors: 0, Skipped: 0, Time elapsed: 2.219 sec - in org.apache.hadoop.hbase.quotas.TestQuotaTableUtil
Running org.apache.hadoop.hbase.io.encoding.TestDataBlockEncoders
Running org.apache.hadoop.hbase.io.encoding.TestChangingEncoding
Tests run: 7, Failures: 0, Errors: 0, Skipped: 0, Time elapsed: 27.289 sec - in org.apache.hadoop.hbase.TestHBaseTestingUtility
Tests run: 7, Failures: 0, Errors: 0, Skipped: 0, Time elapsed: 15.18 sec - in org.apache.hadoop.hbase.quotas.TestQuotaThrottle
Running org.apache.hadoop.hbase.io.encoding.TestEncodedSeekers
Running org.apache.hadoop.hbase.io.encoding.TestBufferedDataBlockEncoder
Tests run: 1, Failures: 0, Errors: 0, Skipped: 0, Time elapsed: 27.014 sec - in org.apache.hadoop.hbase.io.encoding.TestBufferedDataBlockEncoder
Running org.apache.hadoop.hbase.io.encoding.TestLoadAndSwitchEncodeOnDisk
Tests run: 1, Failures: 0, Errors: 0, Skipped: 0, Time elapsed: 24.381 sec - in org.apache.hadoop.hbase.io.encoding.TestLoadAndSwitchEncodeOnDisk
Tests run: 3, Failures: 0, Errors: 0, Skipped: 0, Time elapsed: 57.782 sec - in org.apache.hadoop.hbase.io.encoding.TestChangingEncoding
Running org.apache.hadoop.hbase.io.hfile.TestScannerSelectionUsingTTL
Running org.apache.hadoop.hbase.io.hfile.TestHFileBlock
Tests run: 20, Failures: 0, Errors: 0, Skipped: 0, Time elapsed: 94.378 sec - in org.apache.hadoop.hbase.io.encoding.TestEncodedSeekers
Running org.apache.hadoop.hbase.io.hfile.TestCacheOnWrite
Tests run: 6, Failures: 0, Errors: 0, Skipped: 0, Time elapsed: 62.722 sec - in org.apache.hadoop.hbase.io.hfile.TestScannerSelectionUsingTTL
Running org.apache.hadoop.hbase.io.hfile.TestHFileBlockIndex
Tests run: 2, Failures: 0, Errors: 0, Skipped: 0, Time elapsed: 0.985 sec - in org.apache.hadoop.hbase.io.hfile.TestHFileBlockIndex
Running org.apache.hadoop.hbase.io.hfile.TestHFileSeek
Tests run: 1, Failures: 0, Errors: 0, Skipped: 0, Time elapsed: 2.144 sec - in org.apache.hadoop.hbase.io.hfile.TestHFileSeek
Running org.apache.hadoop.hbase.io.hfile.TestCacheConfig
Tests run: 6, Failures: 0, Errors: 0, Skipped: 0, Time elapsed: 1.799 sec - in org.apache.hadoop.hbase.io.hfile.TestCacheConfig
Running org.apache.hadoop.hbase.io.hfile.TestForceCacheImportantBlocks
Tests run: 28, Failures: 0, Errors: 0, Skipped: 0, Time elapsed: 92.793 sec - in org.apache.hadoop.hbase.io.hfile.TestHFileBlock
Running org.apache.hadoop.hbase.io.TestFileLink
Tests run: 3, Failures: 0, Errors: 0, Skipped: 0, Time elapsed: 13.603 sec - in org.apache.hadoop.hbase.io.TestFileLink
Running org.apache.hadoop.hbase.procedure.TestZKProcedure
Tests run: 4, Failures: 0, Errors: 0, Skipped: 0, Time elapsed: 2.887 sec - in org.apache.hadoop.hbase.procedure.TestZKProcedure
Running org.apache.hadoop.hbase.procedure.TestZKProcedureControllers
Tests run: 4, Failures: 0, Errors: 0, Skipped: 0, Time elapsed: 35.668 sec - in org.apache.hadoop.hbase.io.hfile.TestForceCacheImportantBlocks
Tests run: 4, Failures: 0, Errors: 0, Skipped: 0, Time elapsed: 1.44 sec - in org.apache.hadoop.hbase.procedure.TestZKProcedureControllers
Running org.apache.hadoop.hbase.ipc.TestHBaseClient
Tests run: 1, Failures: 0, Errors: 0, Skipped: 0, Time elapsed: 0.345 sec - in org.apache.hadoop.hbase.ipc.TestHBaseClient
Running org.apache.hadoop.hbase.ipc.TestDelayedRpc
Running org.apache.hadoop.hbase.ipc.TestProtoBufRpc
Tests run: 1, Failures: 0, Errors: 0, Skipped: 0, Time elapsed: 1.584 sec - in org.apache.hadoop.hbase.ipc.TestProtoBufRpc
Running org.apache.hadoop.hbase.TestLocalHBaseCluster
Tests run: 4, Failures: 0, Errors: 0, Skipped: 0, Time elapsed: 3.327 sec - in org.apache.hadoop.hbase.ipc.TestDelayedRpc
Running org.apache.hadoop.hbase.TestAcidGuarantees
Tests run: 1, Failures: 0, Errors: 0, Skipped: 0, Time elapsed: 7.562 sec - in org.apache.hadoop.hbase.TestLocalHBaseCluster
Running org.apache.hadoop.hbase.zookeeper.TestZooKeeperACL
Tests run: 6, Failures: 0, Errors: 0, Skipped: 0, Time elapsed: 0.35 sec - in org.apache.hadoop.hbase.zookeeper.TestZooKeeperACL
Running org.apache.hadoop.hbase.zookeeper.TestRecoverableZooKeeper
Tests run: 1, Failures: 0, Errors: 0, Skipped: 0, Time elapsed: 1.325 sec - in org.apache.hadoop.hbase.zookeeper.TestRecoverableZooKeeper
Running org.apache.hadoop.hbase.zookeeper.TestZooKeeperNodeTracker
Tests run: 3, Failures: 0, Errors: 0, Skipped: 0, Time elapsed: 1.257 sec - in org.apache.hadoop.hbase.zookeeper.TestZooKeeperNodeTracker
Running org.apache.hadoop.hbase.zookeeper.TestHQuorumPeer
Tests run: 3, Failures: 0, Errors: 0, Skipped: 0, Time elapsed: 6.702 sec - in org.apache.hadoop.hbase.zookeeper.TestHQuorumPeer
Running org.apache.hadoop.hbase.zookeeper.TestZKLeaderManager
Tests run: 1, Failures: 0, Errors: 0, Skipped: 0, Time elapsed: 0.129 sec - in org.apache.hadoop.hbase.zookeeper.TestZKLeaderManager
Running org.apache.hadoop.hbase.zookeeper.TestZKMulti
Tests run: 8, Failures: 0, Errors: 0, Skipped: 0, Time elapsed: 0.691 sec - in org.apache.hadoop.hbase.zookeeper.TestZKMulti
Running org.apache.hadoop.hbase.zookeeper.lock.TestZKInterProcessReadWriteLock
Tests run: 28, Failures: 0, Errors: 0, Skipped: 0, Time elapsed: 248.576 sec - in org.apache.hadoop.hbase.io.encoding.TestDataBlockEncoders
Tests run: 6, Failures: 0, Errors: 0, Skipped: 0, Time elapsed: 24.52 sec - in org.apache.hadoop.hbase.zookeeper.lock.TestZKInterProcessReadWriteLock
Running org.apache.hadoop.hbase.TestMetaTableAccessorNoCluster
Tests run: 2, Failures: 0, Errors: 0, Skipped: 0, Time elapsed: 4.135 sec - in org.apache.hadoop.hbase.TestMetaTableAccessorNoCluster
Running org.apache.hadoop.hbase.TestJMXListener
Running org.apache.hadoop.hbase.TestZooKeeper
Tests run: 2, Failures: 0, Errors: 0, Skipped: 0, Time elapsed: 16.631 sec - in org.apache.hadoop.hbase.TestJMXListener
Tests run: 3, Failures: 0, Errors: 0, Skipped: 0, Time elapsed: 86.402 sec - in org.apache.hadoop.hbase.TestAcidGuarantees
Running org.apache.hadoop.hbase.replication.regionserver.TestRegionReplicaReplicationEndpoint
Tests run: 7, Failures: 0, Errors: 0, Skipped: 7, Time elapsed: 0.007 sec - in org.apache.hadoop.hbase.replication.regionserver.TestRegionReplicaReplicationEndpoint
Running org.apache.hadoop.hbase.replication.regionserver.TestReplicationWALReaderManager
Running org.apache.hadoop.hbase.replication.regionserver.TestRegionReplicaReplicationEndpointNoMaster
Tests run: 3, Failures: 0, Errors: 0, Skipped: 0, Time elapsed: 39.414 sec - in org.apache.hadoop.hbase.replication.regionserver.TestRegionReplicaReplicationEndpointNoMaster
Running org.apache.hadoop.hbase.replication.regionserver.TestReplicationSink
Tests run: 5, Failures: 0, Errors: 0, Skipped: 0, Time elapsed: 3.059 sec - in org.apache.hadoop.hbase.replication.regionserver.TestReplicationSink
Running org.apache.hadoop.hbase.replication.regionserver.TestReplicationSourceManager
Tests run: 4, Failures: 0, Errors: 0, Skipped: 0, Time elapsed: 3.335 sec - in org.apache.hadoop.hbase.replication.regionserver.TestReplicationSourceManager
Running org.apache.hadoop.hbase.replication.TestReplicationTrackerZKImpl
Tests run: 5, Failures: 0, Errors: 0, Skipped: 0, Time elapsed: 2.007 sec - in org.apache.hadoop.hbase.replication.TestReplicationTrackerZKImpl
Running org.apache.hadoop.hbase.replication.TestReplicationKillMasterRSCompressed
Tests run: 1, Failures: 0, Errors: 0, Skipped: 0, Time elapsed: 25.872 sec - in org.apache.hadoop.hbase.replication.TestReplicationKillMasterRSCompressed
Running org.apache.hadoop.hbase.replication.TestReplicationKillMasterRS
Running org.apache.hadoop.hbase.replication.TestMultiSlaveReplication
Tests run: 1, Failures: 0, Errors: 0, Skipped: 0, Time elapsed: 22.799 sec - in org.apache.hadoop.hbase.replication.TestReplicationKillMasterRS
Tests run: 1, Failures: 0, Errors: 0, Skipped: 0, Time elapsed: 23.128 sec - in org.apache.hadoop.hbase.replication.TestMultiSlaveReplication
Running org.apache.hadoop.hbase.replication.TestReplicationChangingPeerRegionservers
Tests run: 1, Failures: 0, Errors: 0, Skipped: 0, Time elapsed: 6.684 sec - in org.apache.hadoop.hbase.replication.TestReplicationChangingPeerRegionservers
Running org.apache.hadoop.hbase.replication.TestReplicationKillSlaveRS
Tests run: 11, Failures: 0, Errors: 0, Skipped: 0, Time elapsed: 198.942 sec - in org.apache.hadoop.hbase.TestZooKeeper
Running org.apache.hadoop.hbase.replication.TestPerTableCFReplication
Tests run: 216, Failures: 0, Errors: 0, Skipped: 0, Time elapsed: 368.315 sec - in org.apache.hadoop.hbase.io.hfile.TestCacheOnWrite
Running org.apache.hadoop.hbase.replication.TestMasterReplication
Running org.apache.hadoop.hbase.replication.TestReplicationDisableInactivePeer
Tests run: 1, Failures: 0, Errors: 0, Skipped: 0, Time elapsed: 22.741 sec - in org.apache.hadoop.hbase.replication.TestReplicationKillSlaveRS
Tests run: 2, Failures: 0, Errors: 0, Skipped: 0, Time elapsed: 28.758 sec - in org.apache.hadoop.hbase.replication.TestPerTableCFReplication
Tests run: 1, Failures: 0, Errors: 0, Skipped: 0, Time elapsed: 19.258 sec - in org.apache.hadoop.hbase.replication.TestReplicationDisableInactivePeer
Running org.apache.hadoop.hbase.replication.TestReplicationWithTags
Tests run: 8, Failures: 0, Errors: 0, Skipped: 0, Time elapsed: 219.986 sec - in org.apache.hadoop.hbase.replication.regionserver.TestReplicationWALReaderManager
Tests run: 1, Failures: 0, Errors: 0, Skipped: 0, Time elapsed: 2.832 sec - in org.apache.hadoop.hbase.replication.TestReplicationWithTags
Running org.apache.hadoop.hbase.replication.TestReplicationSource
Tests run: 1, Failures: 0, Errors: 0, Skipped: 0, Time elapsed: 0.32 sec - in org.apache.hadoop.hbase.replication.TestReplicationSource
Running org.apache.hadoop.hbase.replication.TestReplicationStateZKImpl
Tests run: 6, Failures: 0, Errors: 0, Skipped: 0, Time elapsed: 0.977 sec - in org.apache.hadoop.hbase.replication.TestReplicationStateZKImpl
Running org.apache.hadoop.hbase.fs.TestBlockReorder
Running org.apache.hadoop.hbase.replication.TestReplicationEndpoint
Tests run: 3, Failures: 0, Errors: 0, Skipped: 0, Time elapsed: 2.328 sec - in org.apache.hadoop.hbase.replication.TestReplicationEndpoint
Running org.apache.hadoop.hbase.replication.TestReplicationSmallTests
Running org.apache.hadoop.hbase.replication.TestReplicationSyncUpTool
Tests run: 3, Failures: 0, Errors: 0, Skipped: 0, Time elapsed: 50.274 sec - in org.apache.hadoop.hbase.replication.TestMasterReplication
Running org.apache.hadoop.hbase.trace.TestHTraceHooks
Tests run: 1, Failures: 0, Errors: 0, Skipped: 0, Time elapsed: 2.761 sec - in org.apache.hadoop.hbase.trace.TestHTraceHooks
Tests run: 3, Failures: 0, Errors: 0, Skipped: 0, Time elapsed: 19.787 sec - in org.apache.hadoop.hbase.fs.TestBlockReorder
Running org.apache.hadoop.hbase.TestMetaTableLocator
Tests run: 7, Failures: 0, Errors: 0, Skipped: 0, Time elapsed: 3.5 sec - in org.apache.hadoop.hbase.TestMetaTableLocator
Running org.apache.hadoop.hbase.mapred.TestTableSnapshotInputFormat
Running org.apache.hadoop.hbase.namespace.TestNamespaceAuditor
Running org.apache.hadoop.hbase.mapred.TestTableMapReduceUtil
Tests run: 9, Failures: 0, Errors: 0, Skipped: 0, Time elapsed: 51.818 sec - in org.apache.hadoop.hbase.replication.TestReplicationSmallTests
Tests run: 1, Failures: 0, Errors: 0, Skipped: 0, Time elapsed: 50.814 sec - in org.apache.hadoop.hbase.replication.TestReplicationSyncUpTool
Running org.apache.hadoop.hbase.mapred.TestTableInputFormat
Tests run: 10, Failures: 0, Errors: 0, Skipped: 0, Time elapsed: 6.874 sec - in org.apache.hadoop.hbase.mapred.TestTableInputFormat
Running org.apache.hadoop.hbase.TestMultiVersions
Tests run: 3, Failures: 0, Errors: 0, Skipped: 0, Time elapsed: 7.297 sec - in org.apache.hadoop.hbase.TestMultiVersions
Running org.apache.hadoop.hbase.mapred.TestTableMapReduce
Tests run: 4, Failures: 0, Errors: 0, Skipped: 0, Time elapsed: 95.689 sec - in org.apache.hadoop.hbase.mapred.TestTableMapReduceUtil
Tests run: 6, Failures: 0, Errors: 0, Skipped: 0, Time elapsed: 144.258 sec - in org.apache.hadoop.hbase.namespace.TestNamespaceAuditor
Tests run: 2, Failures: 0, Errors: 0, Skipped: 0, Time elapsed: 101.148 sec - in org.apache.hadoop.hbase.mapred.TestTableMapReduce
Tests run: 6, Failures: 0, Errors: 0, Skipped: 0, Time elapsed: 274.527 sec - in org.apache.hadoop.hbase.mapred.TestTableSnapshotInputFormat
Results :
Failed tests:
TestSplitLogManager.testGetPreviousRecoveryMode:656 Mode4=LOG_SPLITTING
Tests run: 2233, Failures: 1, Errors: 0, Skipped: 25
[INFO] ------------------------------------------------------------------------
[INFO] Reactor Summary:
[INFO]
[INFO] HBase ............................................. SUCCESS [3.096s]
[INFO] HBase - Checkstyle ................................ SUCCESS [0.727s]
[INFO] HBase - Annotations ............................... SUCCESS [0.908s]
[INFO] HBase - Protocol .................................. SUCCESS [12.813s]
[INFO] HBase - Common .................................... SUCCESS [1:01.372s]
[INFO] HBase - Client .................................... SUCCESS [1:16.794s]
[INFO] HBase - Hadoop Compatibility ...................... SUCCESS [7.035s]
[INFO] HBase - Hadoop Two Compatibility .................. SUCCESS [6.180s]
[INFO] HBase - Prefix Tree ............................... SUCCESS [8.398s]
[INFO] HBase - Server .................................... FAILURE [1:10:45.592s]
[INFO] HBase - Testing Util .............................. SKIPPED
[INFO] HBase - Thrift .................................... SKIPPED
[INFO] HBase - Shell ..................................... SKIPPED
[INFO] HBase - Integration Tests ......................... SKIPPED
[INFO] HBase - Examples .................................. SKIPPED
[INFO] HBase - Rest ...................................... SKIPPED
[INFO] HBase - Assembly .................................. SKIPPED
[INFO] ------------------------------------------------------------------------
[INFO] BUILD FAILURE
[INFO] ------------------------------------------------------------------------
[INFO] Total time: 1:13:43.719s
[INFO] Finished at: Thu Jan 29 19:19:08 UTC 2015
[INFO] Final Memory: 58M/808M
[INFO] ------------------------------------------------------------------------
[ERROR] Failed to execute goal org.apache.maven.plugins:maven-surefire-plugin:2.18:test (secondPartTestsExecution) on project hbase-server: There was a timeout or other error in the fork -> [Help 1]
[ERROR]
[ERROR] To see the full stack trace of the errors, re-run Maven with the -e switch.
[ERROR] Re-run Maven using the -X switch to enable full debug logging.
[ERROR]
[ERROR] For more information about the errors and possible solutions, please read the following articles:
[ERROR] [Help 1] http://cwiki.apache.org/confluence/display/MAVEN/MojoFailureException
[ERROR]
[ERROR] After correcting the problems, you can resume the build with the command
[ERROR] mvn <goals> -rf :hbase-server
Build step 'Invoke top-level Maven targets' marked build as failure
[FINDBUGS] Skipping publisher since build result is FAILURE
Performing Post build task...
Match found for :.* : True
Logical operation result is TRUE
Running script : ZOMBIE_TESTS_COUNT=`jps | grep surefirebooter | wc -l`
if [[ $ZOMBIE_TESTS_COUNT != 0 ]] ; then
#It seems sometimes the tests are not dying immediately. Let's give them 10s
echo "Suspicious java process found - waiting 10s to see if there are just slow to stop"
sleep 10
ZOMBIE_TESTS_COUNT=`jps | grep surefirebooter | wc -l`
if [[ $ZOMBIE_TESTS_COUNT != 0 ]] ; then
echo "There are $ZOMBIE_TESTS_COUNT zombie tests, they should have been killed by surefire but survived"
echo "************ BEGIN zombies jstack extract"
ZB_STACK=`jps | grep surefirebooter | cut -d ' ' -f 1 | xargs -n 1 jstack | grep ".test" | grep "\.java"`
jps | grep surefirebooter | cut -d ' ' -f 1 | xargs -n 1 jstack
echo "************ END zombies jstack extract"
JIRA_COMMENT="$JIRA_COMMENT
{color:red}-1 core zombie tests{color}. There are ${ZOMBIE_TESTS_COUNT} zombie test(s): ${ZB_STACK}"
BAD=1
jps | grep surefirebooter | cut -d ' ' -f 1 | xargs kill -9
else
echo "We're ok: there is no zombie test, but some tests took some time to stop"
fi
else
echo "We're ok: there is no zombie test"
fi
[HBase-TRUNK] $ /bin/bash -xe /tmp/hudson9100638882585027012.sh
++ jps
++ grep surefirebooter
++ wc -l
+ ZOMBIE_TESTS_COUNT=1
+ [[ 1 != 0 ]]
+ echo 'Suspicious java process found - waiting 10s to see if there are just slow to stop'
Suspicious java process found - waiting 10s to see if there are just slow to stop
+ sleep 10
++ jps
++ grep surefirebooter
++ wc -l
+ ZOMBIE_TESTS_COUNT=0
+ [[ 0 != 0 ]]
+ echo 'We'\''re ok: there is no zombie test, but some tests took some time to stop'
We're ok: there is no zombie test, but some tests took some time to stop
POST BUILD TASK : SUCCESS
END OF POST BUILD TASK : 0
Archiving artifacts
Sending artifact delta relative to HBase-TRUNK #6052
Archived 1836 artifacts
Archive block size is 32768
Received 31 blocks and 389063813 bytes
Compression is 0.3%
Took 1 min 47 sec
Recording test results
Updating HBASE-12936
Build failed in Jenkins: HBase-TRUNK #6066
Posted by Apache Jenkins Server <je...@builds.apache.org>.
See <https://builds.apache.org/job/HBase-TRUNK/6066/changes>
Changes:
[ddas] HBASE-11574. Addendum that should fix a unit test (TestMetaWithReplicas#testChangingReplicaCount) that fails once in a while
------------------------------------------
[...truncated 5118 lines...]
at java.lang.reflect.Method.invoke(Method.java:606)
at org.apache.hadoop.hbase.fs.HFileSystem$1.invoke(HFileSystem.java:279)
at com.sun.proxy.$Proxy21.getBlockLocations(Unknown Source)
at org.apache.hadoop.hdfs.DFSClient.callGetBlockLocations(DFSClient.java:1165)
... 25 more
at org.apache.hadoop.hbase.ipc.AsyncServerResponseHandler.createRemoteException(AsyncServerResponseHandler.java:124)
at org.apache.hadoop.hbase.ipc.AsyncServerResponseHandler.channelRead(AsyncServerResponseHandler.java:83)
at io.netty.channel.AbstractChannelHandlerContext.invokeChannelRead(AbstractChannelHandlerContext.java:333)
at io.netty.channel.AbstractChannelHandlerContext.fireChannelRead(AbstractChannelHandlerContext.java:319)
at io.netty.handler.codec.ByteToMessageDecoder.channelRead(ByteToMessageDecoder.java:163)
at io.netty.channel.AbstractChannelHandlerContext.invokeChannelRead(AbstractChannelHandlerContext.java:333)
at io.netty.channel.AbstractChannelHandlerContext.fireChannelRead(AbstractChannelHandlerContext.java:319)
at io.netty.channel.DefaultChannelPipeline.fireChannelRead(DefaultChannelPipeline.java:787)
at io.netty.channel.nio.AbstractNioByteChannel$NioByteUnsafe.read(AbstractNioByteChannel.java:130)
at io.netty.channel.nio.NioEventLoop.processSelectedKey(NioEventLoop.java:511)
at io.netty.channel.nio.NioEventLoop.processSelectedKeysOptimized(NioEventLoop.java:468)
at io.netty.channel.nio.NioEventLoop.processSelectedKeys(NioEventLoop.java:382)
at io.netty.channel.nio.NioEventLoop.run(NioEventLoop.java:354)
at io.netty.util.concurrent.SingleThreadEventExecutor$2.run(SingleThreadEventExecutor.java:116)
at java.lang.Thread.run(Thread.java:724)
Running org.apache.hadoop.hbase.client.TestFromClientSide
Running org.apache.hadoop.hbase.client.TestUpdateConfiguration
Tests run: 2, Failures: 0, Errors: 0, Skipped: 0, Time elapsed: 0.205 sec - in org.apache.hadoop.hbase.client.TestUpdateConfiguration
Running org.apache.hadoop.hbase.client.TestClientPushback
Tests run: 1, Failures: 0, Errors: 0, Skipped: 0, Time elapsed: 1.196 sec - in org.apache.hadoop.hbase.client.TestClientPushback
Running org.apache.hadoop.hbase.client.TestRestoreSnapshotFromClientWithRegionReplicas
Tests run: 1, Failures: 0, Errors: 0, Skipped: 0, Time elapsed: 54.002 sec - in org.apache.hadoop.hbase.client.TestClientOperationInterrupt
Running org.apache.hadoop.hbase.client.TestReplicaWithCluster
Running org.apache.hadoop.hbase.client.TestHTableMultiplexer
Tests run: 21, Failures: 0, Errors: 0, Skipped: 3, Time elapsed: 152.536 sec - in org.apache.hadoop.hbase.client.TestHCM
Tests run: 1, Failures: 0, Errors: 0, Skipped: 0, Time elapsed: 8.214 sec - in org.apache.hadoop.hbase.client.TestHTableMultiplexer
Running org.apache.hadoop.hbase.client.TestScannerTimeout
Running org.apache.hadoop.hbase.client.TestReplicasClient
Tests run: 4, Failures: 0, Errors: 0, Skipped: 0, Time elapsed: 35.923 sec - in org.apache.hadoop.hbase.client.TestReplicaWithCluster
Running org.apache.hadoop.hbase.client.TestTableSnapshotScanner
Tests run: 3, Failures: 0, Errors: 0, Skipped: 0, Time elapsed: 37.468 sec - in org.apache.hadoop.hbase.client.TestTableSnapshotScanner
Running org.apache.hadoop.hbase.client.TestFromClientSide3
Tests run: 5, Failures: 0, Errors: 0, Skipped: 0, Time elapsed: 92.146 sec - in org.apache.hadoop.hbase.client.TestRestoreSnapshotFromClientWithRegionReplicas
Tests run: 80, Failures: 0, Errors: 0, Skipped: 4, Time elapsed: 104.316 sec - in org.apache.hadoop.hbase.client.TestFromClientSide
Running org.apache.hadoop.hbase.client.TestMetaWithReplicas
Running org.apache.hadoop.hbase.client.TestRestoreSnapshotFromClient
Tests run: 4, Failures: 0, Errors: 0, Skipped: 0, Time elapsed: 98.323 sec - in org.apache.hadoop.hbase.client.TestScannerTimeout
Running org.apache.hadoop.hbase.client.TestSnapshotMetadata
Tests run: 6, Failures: 0, Errors: 0, Skipped: 0, Time elapsed: 44.981 sec - in org.apache.hadoop.hbase.client.TestFromClientSide3
Tests run: 13, Failures: 0, Errors: 0, Skipped: 0, Time elapsed: 105.791 sec - in org.apache.hadoop.hbase.client.TestReplicasClient
Running org.apache.hadoop.hbase.client.TestHTableMultiplexerFlushCache
Tests run: 4, Failures: 0, Errors: 0, Skipped: 0, Time elapsed: 14.636 sec - in org.apache.hadoop.hbase.client.TestSnapshotMetadata
Tests run: 1, Failures: 0, Errors: 0, Skipped: 0, Time elapsed: 4.537 sec - in org.apache.hadoop.hbase.client.TestHTableMultiplexerFlushCache
Running org.apache.hadoop.hbase.TestMultiVersions
Running org.apache.hadoop.hbase.procedure.TestZKProcedure
Tests run: 4, Failures: 0, Errors: 0, Skipped: 0, Time elapsed: 2.122 sec - in org.apache.hadoop.hbase.procedure.TestZKProcedure
Running org.apache.hadoop.hbase.procedure.TestZKProcedureControllers
Running org.apache.hadoop.hbase.TestHColumnDescriptorDefaultVersions
Tests run: 3, Failures: 0, Errors: 0, Skipped: 0, Time elapsed: 6.511 sec - in org.apache.hadoop.hbase.TestMultiVersions
Tests run: 4, Failures: 0, Errors: 0, Skipped: 0, Time elapsed: 1.749 sec - in org.apache.hadoop.hbase.procedure.TestZKProcedureControllers
Running org.apache.hadoop.hbase.constraint.TestConstraint
Running org.apache.hadoop.hbase.TestNamespace
Tests run: 3, Failures: 0, Errors: 0, Skipped: 0, Time elapsed: 11.487 sec - in org.apache.hadoop.hbase.TestHColumnDescriptorDefaultVersions
Tests run: 5, Failures: 0, Errors: 0, Skipped: 0, Time elapsed: 6.375 sec - in org.apache.hadoop.hbase.constraint.TestConstraint
Tests run: 9, Failures: 0, Errors: 0, Skipped: 1, Time elapsed: 7.833 sec - in org.apache.hadoop.hbase.TestNamespace
Running org.apache.hadoop.hbase.TestZooKeeper
Running org.apache.hadoop.hbase.snapshot.TestFlushSnapshotFromClient
Tests run: 5, Failures: 0, Errors: 0, Skipped: 0, Time elapsed: 89.615 sec - in org.apache.hadoop.hbase.client.TestRestoreSnapshotFromClient
Tests run: 11, Failures: 0, Errors: 0, Skipped: 0, Time elapsed: 98.696 sec - in org.apache.hadoop.hbase.client.TestMetaWithReplicas
Running org.apache.hadoop.hbase.snapshot.TestExportSnapshot
Running org.apache.hadoop.hbase.snapshot.TestRestoreFlushSnapshotFromClient
Running org.apache.hadoop.hbase.snapshot.TestSecureExportSnapshot
Tests run: 9, Failures: 0, Errors: 0, Skipped: 0, Time elapsed: 49.257 sec - in org.apache.hadoop.hbase.snapshot.TestFlushSnapshotFromClient
Running org.apache.hadoop.hbase.snapshot.TestSnapshotDescriptionUtils
Tests run: 2, Failures: 0, Errors: 0, Skipped: 0, Time elapsed: 0.196 sec - in org.apache.hadoop.hbase.snapshot.TestSnapshotDescriptionUtils
Running org.apache.hadoop.hbase.TestIOFencing
Tests run: 5, Failures: 0, Errors: 0, Skipped: 0, Time elapsed: 52.065 sec - in org.apache.hadoop.hbase.snapshot.TestRestoreFlushSnapshotFromClient
Running org.apache.hadoop.hbase.coprocessor.TestRegionObserverScannerOpenHook
Tests run: 3, Failures: 0, Errors: 0, Skipped: 0, Time elapsed: 10.712 sec - in org.apache.hadoop.hbase.coprocessor.TestRegionObserverScannerOpenHook
Running org.apache.hadoop.hbase.coprocessor.TestOpenTableInCoprocessor
Tests run: 2, Failures: 0, Errors: 0, Skipped: 0, Time elapsed: 4.899 sec - in org.apache.hadoop.hbase.coprocessor.TestOpenTableInCoprocessor
Running org.apache.hadoop.hbase.coprocessor.TestMasterCoprocessorExceptionWithAbort
Tests run: 1, Failures: 0, Errors: 0, Skipped: 0, Time elapsed: 16.95 sec - in org.apache.hadoop.hbase.coprocessor.TestMasterCoprocessorExceptionWithAbort
Running org.apache.hadoop.hbase.coprocessor.TestRegionServerCoprocessorEndpoint
Tests run: 1, Failures: 0, Errors: 0, Skipped: 0, Time elapsed: 1.39 sec - in org.apache.hadoop.hbase.coprocessor.TestRegionServerCoprocessorEndpoint
Running org.apache.hadoop.hbase.coprocessor.TestRegionObserverInterface
Tests run: 13, Failures: 0, Errors: 0, Skipped: 0, Time elapsed: 39.459 sec - in org.apache.hadoop.hbase.coprocessor.TestRegionObserverInterface
Tests run: 11, Failures: 0, Errors: 0, Skipped: 0, Time elapsed: 200.145 sec - in org.apache.hadoop.hbase.TestZooKeeper
Running org.apache.hadoop.hbase.coprocessor.TestMasterCoprocessorExceptionWithRemove
Tests run: 1, Failures: 0, Errors: 0, Skipped: 0, Time elapsed: 4.638 sec - in org.apache.hadoop.hbase.coprocessor.TestMasterCoprocessorExceptionWithRemove
Running org.apache.hadoop.hbase.coprocessor.TestAggregateProtocol
Running org.apache.hadoop.hbase.coprocessor.TestBatchCoprocessorEndpoint
Tests run: 44, Failures: 0, Errors: 0, Skipped: 0, Time elapsed: 7.844 sec - in org.apache.hadoop.hbase.coprocessor.TestAggregateProtocol
Tests run: 4, Failures: 0, Errors: 0, Skipped: 0, Time elapsed: 1.732 sec - in org.apache.hadoop.hbase.coprocessor.TestBatchCoprocessorEndpoint
Running org.apache.hadoop.hbase.coprocessor.TestRegionServerObserver
Running org.apache.hadoop.hbase.coprocessor.TestHTableWrapper
Tests run: 1, Failures: 0, Errors: 0, Skipped: 0, Time elapsed: 3.524 sec - in org.apache.hadoop.hbase.coprocessor.TestHTableWrapper
Tests run: 1, Failures: 0, Errors: 0, Skipped: 0, Time elapsed: 12.595 sec - in org.apache.hadoop.hbase.coprocessor.TestRegionServerObserver
Running org.apache.hadoop.hbase.coprocessor.TestRegionServerCoprocessorExceptionWithAbort
Running org.apache.hadoop.hbase.coprocessor.TestClassLoading
Tests run: 2, Failures: 0, Errors: 0, Skipped: 0, Time elapsed: 185.837 sec - in org.apache.hadoop.hbase.TestIOFencing
Tests run: 2, Failures: 0, Errors: 0, Skipped: 0, Time elapsed: 14.932 sec - in org.apache.hadoop.hbase.coprocessor.TestRegionServerCoprocessorExceptionWithAbort
Tests run: 9, Failures: 0, Errors: 0, Skipped: 0, Time elapsed: 16.195 sec - in org.apache.hadoop.hbase.coprocessor.TestClassLoading
Running org.apache.hadoop.hbase.coprocessor.TestDoubleColumnInterpreter
Running org.apache.hadoop.hbase.coprocessor.TestRegionObserverBypass
Tests run: 2, Failures: 0, Errors: 0, Skipped: 0, Time elapsed: 3.479 sec - in org.apache.hadoop.hbase.coprocessor.TestRegionObserverBypass
Running org.apache.hadoop.hbase.coprocessor.TestRowProcessorEndpoint
Tests run: 38, Failures: 0, Errors: 0, Skipped: 0, Time elapsed: 6.787 sec - in org.apache.hadoop.hbase.coprocessor.TestDoubleColumnInterpreter
Running org.apache.hadoop.hbase.coprocessor.TestCoprocessorStop
Running org.apache.hadoop.hbase.coprocessor.TestRegionServerCoprocessorExceptionWithRemove
Tests run: 4, Failures: 1, Errors: 0, Skipped: 0, Time elapsed: 10.026 sec <<< FAILURE! - in org.apache.hadoop.hbase.coprocessor.TestRowProcessorEndpoint
testMultipleRows(org.apache.hadoop.hbase.coprocessor.TestRowProcessorEndpoint) Time elapsed: 2.755 sec <<< FAILURE!
java.lang.AssertionError: expected:<3> but was:<2>
at org.junit.Assert.fail(Assert.java:88)
at org.junit.Assert.failNotEquals(Assert.java:743)
at org.junit.Assert.assertEquals(Assert.java:118)
at org.junit.Assert.assertEquals(Assert.java:555)
at org.junit.Assert.assertEquals(Assert.java:542)
at org.apache.hadoop.hbase.coprocessor.TestRowProcessorEndpoint.testMultipleRows(TestRowProcessorEndpoint.java:247)
Running org.apache.hadoop.hbase.coprocessor.TestBigDecimalColumnInterpreter
Tests run: 1, Failures: 0, Errors: 0, Skipped: 0, Time elapsed: 16.188 sec - in org.apache.hadoop.hbase.coprocessor.TestCoprocessorStop
Tests run: 1, Failures: 0, Errors: 0, Skipped: 0, Time elapsed: 13.493 sec - in org.apache.hadoop.hbase.coprocessor.TestRegionServerCoprocessorExceptionWithRemove
Tests run: 38, Failures: 0, Errors: 0, Skipped: 0, Time elapsed: 6.628 sec - in org.apache.hadoop.hbase.coprocessor.TestBigDecimalColumnInterpreter
Running org.apache.hadoop.hbase.coprocessor.TestMasterObserver
Running org.apache.hadoop.hbase.coprocessor.TestCoprocessorEndpoint
Running org.apache.hadoop.hbase.coprocessor.TestWALObserver
Tests run: 7, Failures: 0, Errors: 0, Skipped: 0, Time elapsed: 13.048 sec - in org.apache.hadoop.hbase.coprocessor.TestMasterObserver
Running org.apache.hadoop.hbase.TestGlobalMemStoreSize
Tests run: 6, Failures: 0, Errors: 0, Skipped: 0, Time elapsed: 7.616 sec - in org.apache.hadoop.hbase.coprocessor.TestWALObserver
Running org.apache.hadoop.hbase.TestJMXListener
Tests run: 9, Failures: 0, Errors: 0, Skipped: 0, Time elapsed: 294.735 sec - in org.apache.hadoop.hbase.snapshot.TestExportSnapshot
Tests run: 1, Failures: 0, Errors: 0, Skipped: 0, Time elapsed: 11.538 sec - in org.apache.hadoop.hbase.TestGlobalMemStoreSize
Running org.apache.hadoop.hbase.TestMetaTableLocator
Tests run: 7, Failures: 0, Errors: 0, Skipped: 0, Time elapsed: 3.394 sec - in org.apache.hadoop.hbase.TestMetaTableLocator
Running org.apache.hadoop.hbase.zookeeper.TestZKMulti
Tests run: 8, Failures: 0, Errors: 0, Skipped: 0, Time elapsed: 0.585 sec - in org.apache.hadoop.hbase.zookeeper.TestZKMulti
Running org.apache.hadoop.hbase.zookeeper.TestZooKeeperACL
Running org.apache.hadoop.hbase.zookeeper.lock.TestZKInterProcessReadWriteLock
Tests run: 6, Failures: 0, Errors: 0, Skipped: 0, Time elapsed: 0.305 sec - in org.apache.hadoop.hbase.zookeeper.TestZooKeeperACL
Running org.apache.hadoop.hbase.zookeeper.TestZKLeaderManager
Tests run: 1, Failures: 0, Errors: 0, Skipped: 0, Time elapsed: 0.121 sec - in org.apache.hadoop.hbase.zookeeper.TestZKLeaderManager
Running org.apache.hadoop.hbase.zookeeper.TestRecoverableZooKeeper
Tests run: 2, Failures: 0, Errors: 0, Skipped: 0, Time elapsed: 16.447 sec - in org.apache.hadoop.hbase.TestJMXListener
Tests run: 1, Failures: 0, Errors: 0, Skipped: 0, Time elapsed: 1.223 sec - in org.apache.hadoop.hbase.zookeeper.TestRecoverableZooKeeper
Running org.apache.hadoop.hbase.zookeeper.TestZooKeeperNodeTracker
Running org.apache.hadoop.hbase.zookeeper.TestHQuorumPeer
Tests run: 3, Failures: 0, Errors: 0, Skipped: 0, Time elapsed: 0.978 sec - in org.apache.hadoop.hbase.zookeeper.TestZooKeeperNodeTracker
Running org.apache.hadoop.hbase.TestClusterBootOrder
Tests run: 9, Failures: 0, Errors: 0, Skipped: 0, Time elapsed: 297.095 sec - in org.apache.hadoop.hbase.snapshot.TestSecureExportSnapshot
Tests run: 3, Failures: 0, Errors: 0, Skipped: 0, Time elapsed: 6.961 sec - in org.apache.hadoop.hbase.zookeeper.TestHQuorumPeer
Tests run: 6, Failures: 0, Errors: 0, Skipped: 0, Time elapsed: 24.466 sec - in org.apache.hadoop.hbase.zookeeper.lock.TestZKInterProcessReadWriteLock
Tests run: 2, Failures: 0, Errors: 0, Skipped: 0, Time elapsed: 26.354 sec - in org.apache.hadoop.hbase.TestClusterBootOrder
Tests run: 6, Failures: 0, Errors: 0, Skipped: 0, Time elapsed: 552.806 sec - in org.apache.hadoop.hbase.coprocessor.TestCoprocessorEndpoint
Results :
Failed tests:
TestRowProcessorEndpoint.testMultipleRows:247 expected:<3> but was:<2>
Tests in error:
TestLoadIncrementalHFiles.testSimpleHFileSplit:153->runTest:217->runTest:230->runTest:256 » IO
Tests run: 2189, Failures: 1, Errors: 1, Skipped: 25
[INFO] ------------------------------------------------------------------------
[INFO] Reactor Summary:
[INFO]
[INFO] HBase ............................................. SUCCESS [3.067s]
[INFO] HBase - Checkstyle ................................ SUCCESS [0.803s]
[INFO] HBase - Annotations ............................... SUCCESS [0.844s]
[INFO] HBase - Protocol .................................. SUCCESS [13.198s]
[INFO] HBase - Common .................................... SUCCESS [1:01.782s]
[INFO] HBase - Client .................................... SUCCESS [1:16.242s]
[INFO] HBase - Hadoop Compatibility ...................... SUCCESS [6.980s]
[INFO] HBase - Hadoop Two Compatibility .................. SUCCESS [6.154s]
[INFO] HBase - Prefix Tree ............................... SUCCESS [8.352s]
[INFO] HBase - Server .................................... FAILURE [1:14:35.841s]
[INFO] HBase - Testing Util .............................. SKIPPED
[INFO] HBase - Thrift .................................... SKIPPED
[INFO] HBase - Shell ..................................... SKIPPED
[INFO] HBase - Integration Tests ......................... SKIPPED
[INFO] HBase - Examples .................................. SKIPPED
[INFO] HBase - Rest ...................................... SKIPPED
[INFO] HBase - Assembly .................................. SKIPPED
[INFO] ------------------------------------------------------------------------
[INFO] BUILD FAILURE
[INFO] ------------------------------------------------------------------------
[INFO] Total time: 1:17:34.085s
[INFO] Finished at: Thu Jan 29 10:22:53 UTC 2015
[INFO] Final Memory: 57M/1283M
[INFO] ------------------------------------------------------------------------
[ERROR] Failed to execute goal org.apache.maven.plugins:maven-surefire-plugin:2.18:test (secondPartTestsExecution) on project hbase-server: ExecutionException: java.lang.RuntimeException: The forked VM terminated without properly saying goodbye. VM crash or System.exit called?
[ERROR] Command was /bin/sh -c cd <https://builds.apache.org/job/HBase-TRUNK/ws/hbase-server> && /home/jenkins/tools/java/jdk1.7.0_25-32/jre/bin/java -enableassertions -XX:MaxDirectMemorySize=1G -Xmx1900m -XX:MaxPermSize=256m -Djava.security.egd=file:/dev/./urandom -Djava.net.preferIPv4Stack=true -Djava.awt.headless=true -jar <https://builds.apache.org/job/HBase-TRUNK/ws/hbase-server/target/surefire/surefirebooter2084025993217576362.jar> <https://builds.apache.org/job/HBase-TRUNK/ws/hbase-server/target/surefire/surefire187328378591873219tmp> <https://builds.apache.org/job/HBase-TRUNK/ws/hbase-server/target/surefire/surefire_9198531233643493735276tmp>
[ERROR] -> [Help 1]
[ERROR]
[ERROR] To see the full stack trace of the errors, re-run Maven with the -e switch.
[ERROR] Re-run Maven using the -X switch to enable full debug logging.
[ERROR]
[ERROR] For more information about the errors and possible solutions, please read the following articles:
[ERROR] [Help 1] http://cwiki.apache.org/confluence/display/MAVEN/MojoFailureException
[ERROR]
[ERROR] After correcting the problems, you can resume the build with the command
[ERROR] mvn <goals> -rf :hbase-server
Build step 'Invoke top-level Maven targets' marked build as failure
[FINDBUGS] Skipping publisher since build result is FAILURE
Performing Post build task...
Match found for :.* : True
Logical operation result is TRUE
Running script : ZOMBIE_TESTS_COUNT=`jps | grep surefirebooter | wc -l`
if [[ $ZOMBIE_TESTS_COUNT != 0 ]] ; then
#It seems sometimes the tests are not dying immediately. Let's give them 10s
echo "Suspicious java process found - waiting 10s to see if there are just slow to stop"
sleep 10
ZOMBIE_TESTS_COUNT=`jps | grep surefirebooter | wc -l`
if [[ $ZOMBIE_TESTS_COUNT != 0 ]] ; then
echo "There are $ZOMBIE_TESTS_COUNT zombie tests, they should have been killed by surefire but survived"
echo "************ BEGIN zombies jstack extract"
ZB_STACK=`jps | grep surefirebooter | cut -d ' ' -f 1 | xargs -n 1 jstack | grep ".test" | grep "\.java"`
jps | grep surefirebooter | cut -d ' ' -f 1 | xargs -n 1 jstack
echo "************ END zombies jstack extract"
JIRA_COMMENT="$JIRA_COMMENT
{color:red}-1 core zombie tests{color}. There are ${ZOMBIE_TESTS_COUNT} zombie test(s): ${ZB_STACK}"
BAD=1
jps | grep surefirebooter | cut -d ' ' -f 1 | xargs kill -9
else
echo "We're ok: there is no zombie test, but some tests took some time to stop"
fi
else
echo "We're ok: there is no zombie test"
fi
[HBase-TRUNK] $ /bin/bash -xe /tmp/hudson7317770860156499741.sh
++ jps
++ grep surefirebooter
++ wc -l
+ ZOMBIE_TESTS_COUNT=0
+ [[ 0 != 0 ]]
+ echo 'We'\''re ok: there is no zombie test'
We're ok: there is no zombie test
POST BUILD TASK : SUCCESS
END OF POST BUILD TASK : 0
Archiving artifacts
Sending artifact delta relative to HBase-TRUNK #6052
Archived 1836 artifacts
Archive block size is 32768
Received 31 blocks and 392501409 bytes
Compression is 0.3%
Took 1 min 40 sec
Recording test results
Updating HBASE-11574
Build failed in Jenkins: HBase-TRUNK #6065
Posted by Apache Jenkins Server <je...@builds.apache.org>.
See <https://builds.apache.org/job/HBase-TRUNK/6065/changes>
Changes:
[busbey] HBASE-12831 Changing the set of vis labels a user has access to doesn't generate an audit log event
[busbey] HBASE-12808 Use Java API Compliance Checker for binary/source compatibility
------------------------------------------
[...truncated 1870 lines...]
Running org.apache.hadoop.hbase.security.visibility.TestVisibilityLabelReplicationWithExpAsString
Running org.apache.hadoop.hbase.security.visibility.TestVisibilityWithCheckAuths
Tests run: 2, Failures: 0, Errors: 0, Skipped: 0, Time elapsed: 3.536 sec - in org.apache.hadoop.hbase.security.visibility.TestVisibilityWithCheckAuths
Running org.apache.hadoop.hbase.TestGlobalMemStoreSize
Tests run: 1, Failures: 0, Errors: 0, Skipped: 0, Time elapsed: 17.542 sec - in org.apache.hadoop.hbase.security.visibility.TestVisibilityLabelReplicationWithExpAsString
Tests run: 1, Failures: 0, Errors: 0, Skipped: 0, Time elapsed: 12.954 sec - in org.apache.hadoop.hbase.TestGlobalMemStoreSize
Running org.apache.hadoop.hbase.TestNamespace
Running org.apache.hadoop.hbase.constraint.TestConstraint
Tests run: 9, Failures: 0, Errors: 0, Skipped: 1, Time elapsed: 8.321 sec - in org.apache.hadoop.hbase.TestNamespace
Tests run: 5, Failures: 0, Errors: 0, Skipped: 0, Time elapsed: 10.194 sec - in org.apache.hadoop.hbase.constraint.TestConstraint
Tests run: 37, Failures: 0, Errors: 0, Skipped: 0, Time elapsed: 49.54 sec - in org.apache.hadoop.hbase.security.visibility.TestVisibilityLabelsWithDeletes
Running org.apache.hadoop.hbase.filter.TestFuzzyRowAndColumnRangeFilter
Tests run: 1, Failures: 0, Errors: 0, Skipped: 0, Time elapsed: 3.242 sec - in org.apache.hadoop.hbase.filter.TestFuzzyRowAndColumnRangeFilter
Running org.apache.hadoop.hbase.filter.TestFilterWrapper
Running org.apache.hadoop.hbase.filter.TestMultiRowRangeFilter
Tests run: 1, Failures: 0, Errors: 0, Skipped: 0, Time elapsed: 2.108 sec - in org.apache.hadoop.hbase.filter.TestFilterWrapper
Running org.apache.hadoop.hbase.filter.TestColumnRangeFilter
Running org.apache.hadoop.hbase.filter.TestScanRowPrefix
Tests run: 18, Failures: 0, Errors: 0, Skipped: 0, Time elapsed: 11.69 sec - in org.apache.hadoop.hbase.filter.TestMultiRowRangeFilter
Tests run: 1, Failures: 0, Errors: 0, Skipped: 0, Time elapsed: 2.684 sec - in org.apache.hadoop.hbase.filter.TestScanRowPrefix
Running org.apache.hadoop.hbase.TestHBaseTestingUtility
Tests run: 1, Failures: 0, Errors: 0, Skipped: 0, Time elapsed: 7.093 sec - in org.apache.hadoop.hbase.filter.TestColumnRangeFilter
Running org.apache.hadoop.hbase.filter.TestFilterWithScanLimits
Tests run: 1, Failures: 0, Errors: 0, Skipped: 0, Time elapsed: 1.509 sec - in org.apache.hadoop.hbase.filter.TestFilterWithScanLimits
Running org.apache.hadoop.hbase.quotas.TestQuotaThrottle
Tests run: 9, Failures: 0, Errors: 0, Skipped: 0, Time elapsed: 306.635 sec - in org.apache.hadoop.hbase.snapshot.TestSecureExportSnapshot
Running org.apache.hadoop.hbase.quotas.TestQuotaAdmin
Tests run: 2, Failures: 0, Errors: 0, Skipped: 0, Time elapsed: 4.288 sec - in org.apache.hadoop.hbase.quotas.TestQuotaAdmin
Running org.apache.hadoop.hbase.io.encoding.TestDataBlockEncoders
Running org.apache.hadoop.hbase.quotas.TestQuotaTableUtil
Tests run: 7, Failures: 0, Errors: 0, Skipped: 0, Time elapsed: 15.335 sec - in org.apache.hadoop.hbase.quotas.TestQuotaThrottle
Tests run: 3, Failures: 0, Errors: 0, Skipped: 0, Time elapsed: 1.672 sec - in org.apache.hadoop.hbase.quotas.TestQuotaTableUtil
Tests run: 7, Failures: 0, Errors: 0, Skipped: 0, Time elapsed: 28.668 sec - in org.apache.hadoop.hbase.TestHBaseTestingUtility
Running org.apache.hadoop.hbase.io.encoding.TestEncodedSeekers
Running org.apache.hadoop.hbase.io.encoding.TestBufferedDataBlockEncoder
Running org.apache.hadoop.hbase.io.encoding.TestChangingEncoding
Tests run: 9, Failures: 0, Errors: 0, Skipped: 0, Time elapsed: 302.028 sec - in org.apache.hadoop.hbase.snapshot.TestExportSnapshot
Running org.apache.hadoop.hbase.io.encoding.TestLoadAndSwitchEncodeOnDisk
Tests run: 1, Failures: 0, Errors: 0, Skipped: 0, Time elapsed: 26.95 sec - in org.apache.hadoop.hbase.io.encoding.TestBufferedDataBlockEncoder
Running org.apache.hadoop.hbase.io.hfile.TestScannerSelectionUsingTTL
Tests run: 1, Failures: 0, Errors: 0, Skipped: 0, Time elapsed: 23.434 sec - in org.apache.hadoop.hbase.io.encoding.TestLoadAndSwitchEncodeOnDisk
Running org.apache.hadoop.hbase.io.hfile.TestHFileBlock
Tests run: 3, Failures: 0, Errors: 0, Skipped: 0, Time elapsed: 62.165 sec - in org.apache.hadoop.hbase.io.encoding.TestChangingEncoding
Running org.apache.hadoop.hbase.io.hfile.TestCacheOnWrite
Tests run: 6, Failures: 0, Errors: 0, Skipped: 0, Time elapsed: 62.976 sec - in org.apache.hadoop.hbase.io.hfile.TestScannerSelectionUsingTTL
Tests run: 20, Failures: 0, Errors: 0, Skipped: 0, Time elapsed: 100.196 sec - in org.apache.hadoop.hbase.io.encoding.TestEncodedSeekers
Running org.apache.hadoop.hbase.io.hfile.TestHFileSeek
Running org.apache.hadoop.hbase.io.hfile.TestHFileBlockIndex
Tests run: 2, Failures: 0, Errors: 0, Skipped: 0, Time elapsed: 1.086 sec - in org.apache.hadoop.hbase.io.hfile.TestHFileBlockIndex
Tests run: 1, Failures: 0, Errors: 0, Skipped: 0, Time elapsed: 2.161 sec - in org.apache.hadoop.hbase.io.hfile.TestHFileSeek
Running org.apache.hadoop.hbase.io.hfile.TestCacheConfig
Tests run: 6, Failures: 0, Errors: 0, Skipped: 0, Time elapsed: 1.902 sec - in org.apache.hadoop.hbase.io.hfile.TestCacheConfig
Running org.apache.hadoop.hbase.io.hfile.TestForceCacheImportantBlocks
Running org.apache.hadoop.hbase.io.TestFileLink
Tests run: 3, Failures: 0, Errors: 0, Skipped: 0, Time elapsed: 15.866 sec - in org.apache.hadoop.hbase.io.TestFileLink
Running org.apache.hadoop.hbase.procedure.TestZKProcedure
Tests run: 4, Failures: 0, Errors: 0, Skipped: 0, Time elapsed: 1.97 sec - in org.apache.hadoop.hbase.procedure.TestZKProcedure
Running org.apache.hadoop.hbase.procedure.TestZKProcedureControllers
Tests run: 4, Failures: 0, Errors: 0, Skipped: 0, Time elapsed: 1.651 sec - in org.apache.hadoop.hbase.procedure.TestZKProcedureControllers
Tests run: 28, Failures: 0, Errors: 0, Skipped: 0, Time elapsed: 93.21 sec - in org.apache.hadoop.hbase.io.hfile.TestHFileBlock
Running org.apache.hadoop.hbase.ipc.TestHBaseClient
Tests run: 1, Failures: 0, Errors: 0, Skipped: 0, Time elapsed: 0.37 sec - in org.apache.hadoop.hbase.ipc.TestHBaseClient
Running org.apache.hadoop.hbase.ipc.TestProtoBufRpc
Running org.apache.hadoop.hbase.ipc.TestDelayedRpc
Tests run: 1, Failures: 0, Errors: 0, Skipped: 0, Time elapsed: 1.873 sec - in org.apache.hadoop.hbase.ipc.TestProtoBufRpc
Running org.apache.hadoop.hbase.TestLocalHBaseCluster
Tests run: 4, Failures: 0, Errors: 0, Skipped: 0, Time elapsed: 3.389 sec - in org.apache.hadoop.hbase.ipc.TestDelayedRpc
Running org.apache.hadoop.hbase.TestAcidGuarantees
Tests run: 1, Failures: 0, Errors: 0, Skipped: 0, Time elapsed: 7.774 sec - in org.apache.hadoop.hbase.TestLocalHBaseCluster
Tests run: 4, Failures: 0, Errors: 0, Skipped: 0, Time elapsed: 41.293 sec - in org.apache.hadoop.hbase.io.hfile.TestForceCacheImportantBlocks
Running org.apache.hadoop.hbase.zookeeper.TestRecoverableZooKeeper
Tests run: 1, Failures: 0, Errors: 0, Skipped: 0, Time elapsed: 1.33 sec - in org.apache.hadoop.hbase.zookeeper.TestRecoverableZooKeeper
Running org.apache.hadoop.hbase.zookeeper.TestZooKeeperNodeTracker
Tests run: 3, Failures: 0, Errors: 0, Skipped: 0, Time elapsed: 1.302 sec - in org.apache.hadoop.hbase.zookeeper.TestZooKeeperNodeTracker
Running org.apache.hadoop.hbase.zookeeper.TestHQuorumPeer
Running org.apache.hadoop.hbase.zookeeper.TestZooKeeperACL
Tests run: 6, Failures: 0, Errors: 0, Skipped: 0, Time elapsed: 0.456 sec - in org.apache.hadoop.hbase.zookeeper.TestZooKeeperACL
Tests run: 3, Failures: 0, Errors: 0, Skipped: 0, Time elapsed: 2.099 sec - in org.apache.hadoop.hbase.zookeeper.TestHQuorumPeer
Running org.apache.hadoop.hbase.zookeeper.TestZKLeaderManager
Tests run: 1, Failures: 0, Errors: 0, Skipped: 0, Time elapsed: 0.129 sec - in org.apache.hadoop.hbase.zookeeper.TestZKLeaderManager
Running org.apache.hadoop.hbase.zookeeper.TestZKMulti
Running org.apache.hadoop.hbase.zookeeper.lock.TestZKInterProcessReadWriteLock
Tests run: 8, Failures: 0, Errors: 0, Skipped: 0, Time elapsed: 0.691 sec - in org.apache.hadoop.hbase.zookeeper.TestZKMulti
Running org.apache.hadoop.hbase.TestJMXListener
Tests run: 6, Failures: 0, Errors: 0, Skipped: 0, Time elapsed: 24.529 sec - in org.apache.hadoop.hbase.zookeeper.lock.TestZKInterProcessReadWriteLock
Tests run: 2, Failures: 0, Errors: 0, Skipped: 0, Time elapsed: 15.994 sec - in org.apache.hadoop.hbase.TestJMXListener
Running org.apache.hadoop.hbase.TestMetaTableAccessorNoCluster
Tests run: 2, Failures: 0, Errors: 0, Skipped: 0, Time elapsed: 3.973 sec - in org.apache.hadoop.hbase.TestMetaTableAccessorNoCluster
Running org.apache.hadoop.hbase.TestZooKeeper
Running org.apache.hadoop.hbase.replication.regionserver.TestReplicationWALReaderManager
Tests run: 3, Failures: 0, Errors: 0, Skipped: 0, Time elapsed: 88.432 sec - in org.apache.hadoop.hbase.TestAcidGuarantees
Running org.apache.hadoop.hbase.replication.regionserver.TestRegionReplicaReplicationEndpoint
Tests run: 7, Failures: 0, Errors: 0, Skipped: 7, Time elapsed: 0.004 sec - in org.apache.hadoop.hbase.replication.regionserver.TestRegionReplicaReplicationEndpoint
Running org.apache.hadoop.hbase.replication.regionserver.TestRegionReplicaReplicationEndpointNoMaster
Tests run: 28, Failures: 0, Errors: 0, Skipped: 0, Time elapsed: 261.554 sec - in org.apache.hadoop.hbase.io.encoding.TestDataBlockEncoders
Running org.apache.hadoop.hbase.replication.regionserver.TestReplicationSink
Tests run: 5, Failures: 0, Errors: 0, Skipped: 0, Time elapsed: 2.97 sec - in org.apache.hadoop.hbase.replication.regionserver.TestReplicationSink
Running org.apache.hadoop.hbase.replication.regionserver.TestReplicationSourceManager
Tests run: 4, Failures: 0, Errors: 0, Skipped: 0, Time elapsed: 3.224 sec - in org.apache.hadoop.hbase.replication.regionserver.TestReplicationSourceManager
Running org.apache.hadoop.hbase.replication.TestReplicationTrackerZKImpl
Tests run: 5, Failures: 0, Errors: 0, Skipped: 0, Time elapsed: 1.042 sec - in org.apache.hadoop.hbase.replication.TestReplicationTrackerZKImpl
Tests run: 3, Failures: 0, Errors: 0, Skipped: 0, Time elapsed: 36.82 sec - in org.apache.hadoop.hbase.replication.regionserver.TestRegionReplicaReplicationEndpointNoMaster
Running org.apache.hadoop.hbase.replication.TestReplicationKillMasterRSCompressed
Running org.apache.hadoop.hbase.replication.TestReplicationKillMasterRS
Tests run: 1, Failures: 0, Errors: 0, Skipped: 0, Time elapsed: 24.675 sec - in org.apache.hadoop.hbase.replication.TestReplicationKillMasterRSCompressed
Tests run: 1, Failures: 0, Errors: 0, Skipped: 0, Time elapsed: 24.088 sec - in org.apache.hadoop.hbase.replication.TestReplicationKillMasterRS
Running org.apache.hadoop.hbase.replication.TestMultiSlaveReplication
Running org.apache.hadoop.hbase.replication.TestReplicationChangingPeerRegionservers
Tests run: 1, Failures: 0, Errors: 0, Skipped: 0, Time elapsed: 22.136 sec - in org.apache.hadoop.hbase.replication.TestMultiSlaveReplication
Tests run: 1, Failures: 0, Errors: 0, Skipped: 0, Time elapsed: 6.276 sec - in org.apache.hadoop.hbase.replication.TestReplicationChangingPeerRegionservers
Running org.apache.hadoop.hbase.replication.TestPerTableCFReplication
Running org.apache.hadoop.hbase.replication.TestReplicationKillSlaveRS
Tests run: 2, Failures: 0, Errors: 0, Skipped: 0, Time elapsed: 26.355 sec - in org.apache.hadoop.hbase.replication.TestPerTableCFReplication
Tests run: 1, Failures: 0, Errors: 0, Skipped: 0, Time elapsed: 21.363 sec - in org.apache.hadoop.hbase.replication.TestReplicationKillSlaveRS
Running org.apache.hadoop.hbase.replication.TestMasterReplication
Tests run: 11, Failures: 0, Errors: 0, Skipped: 0, Time elapsed: 201.545 sec - in org.apache.hadoop.hbase.TestZooKeeper
Running org.apache.hadoop.hbase.replication.TestReplicationDisableInactivePeer
Tests run: 8, Failures: 0, Errors: 0, Skipped: 0, Time elapsed: 207.868 sec - in org.apache.hadoop.hbase.replication.regionserver.TestReplicationWALReaderManager
Running org.apache.hadoop.hbase.replication.TestReplicationWithTags
Tests run: 1, Failures: 0, Errors: 0, Skipped: 0, Time elapsed: 2.84 sec - in org.apache.hadoop.hbase.replication.TestReplicationWithTags
Tests run: 1, Failures: 0, Errors: 0, Skipped: 0, Time elapsed: 19.171 sec - in org.apache.hadoop.hbase.replication.TestReplicationDisableInactivePeer
Running org.apache.hadoop.hbase.replication.TestReplicationSource
Tests run: 1, Failures: 0, Errors: 0, Skipped: 0, Time elapsed: 0.315 sec - in org.apache.hadoop.hbase.replication.TestReplicationSource
Tests run: 3, Failures: 0, Errors: 0, Skipped: 0, Time elapsed: 42.158 sec - in org.apache.hadoop.hbase.replication.TestMasterReplication
Running org.apache.hadoop.hbase.replication.TestReplicationEndpoint
Tests run: 3, Failures: 0, Errors: 0, Skipped: 0, Time elapsed: 1.847 sec - in org.apache.hadoop.hbase.replication.TestReplicationEndpoint
Running org.apache.hadoop.hbase.replication.TestReplicationStateZKImpl
Tests run: 6, Failures: 0, Errors: 0, Skipped: 0, Time elapsed: 0.941 sec - in org.apache.hadoop.hbase.replication.TestReplicationStateZKImpl
Running org.apache.hadoop.hbase.fs.TestBlockReorder
Running org.apache.hadoop.hbase.replication.TestReplicationSmallTests
Running org.apache.hadoop.hbase.trace.TestHTraceHooks
Running org.apache.hadoop.hbase.replication.TestReplicationSyncUpTool
Tests run: 1, Failures: 0, Errors: 0, Skipped: 0, Time elapsed: 2.264 sec - in org.apache.hadoop.hbase.trace.TestHTraceHooks
Tests run: 3, Failures: 0, Errors: 0, Skipped: 0, Time elapsed: 18.096 sec - in org.apache.hadoop.hbase.fs.TestBlockReorder
Tests run: 216, Failures: 0, Errors: 0, Skipped: 0, Time elapsed: 379.251 sec - in org.apache.hadoop.hbase.io.hfile.TestCacheOnWrite
Running org.apache.hadoop.hbase.TestMetaTableLocator
Tests run: 7, Failures: 0, Errors: 0, Skipped: 0, Time elapsed: 3.828 sec - in org.apache.hadoop.hbase.TestMetaTableLocator
Running org.apache.hadoop.hbase.mapred.TestTableSnapshotInputFormat
Running org.apache.hadoop.hbase.namespace.TestNamespaceAuditor
Running org.apache.hadoop.hbase.mapred.TestTableMapReduceUtil
Tests run: 9, Failures: 0, Errors: 0, Skipped: 0, Time elapsed: 50.05 sec - in org.apache.hadoop.hbase.replication.TestReplicationSmallTests
Running org.apache.hadoop.hbase.mapred.TestTableInputFormat
Tests run: 10, Failures: 0, Errors: 0, Skipped: 0, Time elapsed: 8.707 sec - in org.apache.hadoop.hbase.mapred.TestTableInputFormat
Tests run: 1, Failures: 0, Errors: 0, Skipped: 0, Time elapsed: 61.549 sec - in org.apache.hadoop.hbase.replication.TestReplicationSyncUpTool
Running org.apache.hadoop.hbase.TestMultiVersions
Tests run: 3, Failures: 0, Errors: 0, Skipped: 0, Time elapsed: 7.615 sec - in org.apache.hadoop.hbase.TestMultiVersions
Running org.apache.hadoop.hbase.mapred.TestTableMapReduce
Tests run: 4, Failures: 0, Errors: 0, Skipped: 0, Time elapsed: 95.402 sec - in org.apache.hadoop.hbase.mapred.TestTableMapReduceUtil
Tests run: 5, Failures: 0, Errors: 0, Skipped: 0, Time elapsed: 135.878 sec - in org.apache.hadoop.hbase.namespace.TestNamespaceAuditor
Tests run: 2, Failures: 0, Errors: 0, Skipped: 0, Time elapsed: 96.896 sec - in org.apache.hadoop.hbase.mapred.TestTableMapReduce
Tests run: 6, Failures: 0, Errors: 0, Skipped: 0, Time elapsed: 277.361 sec - in org.apache.hadoop.hbase.mapred.TestTableSnapshotInputFormat
Results :
Failed tests:
TestHCM.testConnectionCloseAllowsInterrupt:293->testConnectionClose:405 Waiting timed out after [40,000] msec
Tests run: 2246, Failures: 1, Errors: 0, Skipped: 25
[INFO] ------------------------------------------------------------------------
[INFO] Reactor Summary:
[INFO]
[INFO] HBase ............................................. SUCCESS [3.339s]
[INFO] HBase - Checkstyle ................................ SUCCESS [0.744s]
[INFO] HBase - Annotations ............................... SUCCESS [0.921s]
[INFO] HBase - Protocol .................................. SUCCESS [13.360s]
[INFO] HBase - Common .................................... SUCCESS [1:02.494s]
[INFO] HBase - Client .................................... SUCCESS [1:16.315s]
[INFO] HBase - Hadoop Compatibility ...................... SUCCESS [7.061s]
[INFO] HBase - Hadoop Two Compatibility .................. SUCCESS [6.157s]
[INFO] HBase - Prefix Tree ............................... SUCCESS [8.432s]
[INFO] HBase - Server .................................... FAILURE [1:07:31.515s]
[INFO] HBase - Testing Util .............................. SKIPPED
[INFO] HBase - Thrift .................................... SKIPPED
[INFO] HBase - Shell ..................................... SKIPPED
[INFO] HBase - Integration Tests ......................... SKIPPED
[INFO] HBase - Examples .................................. SKIPPED
[INFO] HBase - Rest ...................................... SKIPPED
[INFO] HBase - Assembly .................................. SKIPPED
[INFO] ------------------------------------------------------------------------
[INFO] BUILD FAILURE
[INFO] ------------------------------------------------------------------------
[INFO] Total time: 1:10:31.138s
[INFO] Finished at: Thu Jan 29 05:16:14 UTC 2015
[INFO] Final Memory: 57M/1165M
[INFO] ------------------------------------------------------------------------
[ERROR] Failed to execute goal org.apache.maven.plugins:maven-surefire-plugin:2.18:test (secondPartTestsExecution) on project hbase-server: There are test failures.
[ERROR]
[ERROR] Please refer to <https://builds.apache.org/job/HBase-TRUNK/ws/hbase-server/target/surefire-reports> for the individual test results.
[ERROR] -> [Help 1]
[ERROR]
[ERROR] To see the full stack trace of the errors, re-run Maven with the -e switch.
[ERROR] Re-run Maven using the -X switch to enable full debug logging.
[ERROR]
[ERROR] For more information about the errors and possible solutions, please read the following articles:
[ERROR] [Help 1] http://cwiki.apache.org/confluence/display/MAVEN/MojoFailureException
[ERROR]
[ERROR] After correcting the problems, you can resume the build with the command
[ERROR] mvn <goals> -rf :hbase-server
Build step 'Invoke top-level Maven targets' marked build as failure
[FINDBUGS] Skipping publisher since build result is FAILURE
Performing Post build task...
Match found for :.* : True
Logical operation result is TRUE
Running script : ZOMBIE_TESTS_COUNT=`jps | grep surefirebooter | wc -l`
if [[ $ZOMBIE_TESTS_COUNT != 0 ]] ; then
#It seems sometimes the tests are not dying immediately. Let's give them 10s
echo "Suspicious java process found - waiting 10s to see if there are just slow to stop"
sleep 10
ZOMBIE_TESTS_COUNT=`jps | grep surefirebooter | wc -l`
if [[ $ZOMBIE_TESTS_COUNT != 0 ]] ; then
echo "There are $ZOMBIE_TESTS_COUNT zombie tests, they should have been killed by surefire but survived"
echo "************ BEGIN zombies jstack extract"
ZB_STACK=`jps | grep surefirebooter | cut -d ' ' -f 1 | xargs -n 1 jstack | grep ".test" | grep "\.java"`
jps | grep surefirebooter | cut -d ' ' -f 1 | xargs -n 1 jstack
echo "************ END zombies jstack extract"
JIRA_COMMENT="$JIRA_COMMENT
{color:red}-1 core zombie tests{color}. There are ${ZOMBIE_TESTS_COUNT} zombie test(s): ${ZB_STACK}"
BAD=1
jps | grep surefirebooter | cut -d ' ' -f 1 | xargs kill -9
else
echo "We're ok: there is no zombie test, but some tests took some time to stop"
fi
else
echo "We're ok: there is no zombie test"
fi
[HBase-TRUNK] $ /bin/bash -xe /tmp/hudson2527923286683584142.sh
++ jps
++ grep surefirebooter
++ wc -l
+ ZOMBIE_TESTS_COUNT=0
+ [[ 0 != 0 ]]
+ echo 'We'\''re ok: there is no zombie test'
We're ok: there is no zombie test
POST BUILD TASK : SUCCESS
END OF POST BUILD TASK : 0
Archiving artifacts
Sending artifact delta relative to HBase-TRUNK #6052
Archived 1838 artifacts
Archive block size is 32768
Received 31 blocks and 387718378 bytes
Compression is 0.3%
Took 1 min 39 sec
Recording test results
Updating HBASE-12831
Updating HBASE-12808
Build failed in Jenkins: HBase-TRUNK #6064
Posted by Apache Jenkins Server <je...@builds.apache.org>.
See <https://builds.apache.org/job/HBase-TRUNK/6064/changes>
Changes:
[ddas] HBASE-11574. hbase:meta's regions can be replicated
------------------------------------------
[...truncated 1882 lines...]
Tests run: 5, Failures: 0, Errors: 0, Skipped: 0, Time elapsed: 0.399 sec - in org.apache.hadoop.hbase.client.replication.TestReplicationAdmin
Running org.apache.hadoop.hbase.client.TestSnapshotCloneIndependence
Tests run: 24, Failures: 0, Errors: 0, Skipped: 0, Time elapsed: 66.028 sec - in org.apache.hadoop.hbase.client.TestAdmin1
Running org.apache.hadoop.hbase.client.TestCloneSnapshotFromClientWithRegionReplicas
Tests run: 6, Failures: 0, Errors: 0, Skipped: 0, Time elapsed: 27.835 sec - in org.apache.hadoop.hbase.client.TestSnapshotCloneIndependence
Running org.apache.hadoop.hbase.client.TestClientScannerRPCTimeout
Tests run: 1, Failures: 0, Errors: 0, Skipped: 0, Time elapsed: 8.038 sec - in org.apache.hadoop.hbase.client.TestClientScannerRPCTimeout
Tests run: 23, Failures: 0, Errors: 0, Skipped: 0, Time elapsed: 56.391 sec - in org.apache.hadoop.hbase.client.TestAdmin2
Running org.apache.hadoop.hbase.client.TestClientOperationInterrupt
Running org.apache.hadoop.hbase.client.TestRpcControllerFactory
Tests run: 1, Failures: 0, Errors: 0, Skipped: 0, Time elapsed: 2.168 sec - in org.apache.hadoop.hbase.client.TestRpcControllerFactory
Running org.apache.hadoop.hbase.client.TestScannersFromClientSide
Tests run: 5, Failures: 0, Errors: 0, Skipped: 0, Time elapsed: 5.608 sec - in org.apache.hadoop.hbase.client.TestScannersFromClientSide
Running org.apache.hadoop.hbase.client.TestCheckAndMutate
Tests run: 1, Failures: 0, Errors: 0, Skipped: 0, Time elapsed: 2.25 sec - in org.apache.hadoop.hbase.client.TestCheckAndMutate
Tests run: 5, Failures: 0, Errors: 0, Skipped: 0, Time elapsed: 71.338 sec - in org.apache.hadoop.hbase.client.TestCloneSnapshotFromClientWithRegionReplicas
Running org.apache.hadoop.hbase.client.TestFromClientSide
Running org.apache.hadoop.hbase.client.TestUpdateConfiguration
Tests run: 2, Failures: 0, Errors: 0, Skipped: 0, Time elapsed: 0.215 sec - in org.apache.hadoop.hbase.client.TestUpdateConfiguration
Running org.apache.hadoop.hbase.client.TestClientPushback
Tests run: 1, Failures: 0, Errors: 0, Skipped: 0, Time elapsed: 1.444 sec - in org.apache.hadoop.hbase.client.TestClientPushback
Tests run: 1, Failures: 0, Errors: 0, Skipped: 0, Time elapsed: 53.714 sec - in org.apache.hadoop.hbase.client.TestClientOperationInterrupt
Tests run: 21, Failures: 0, Errors: 0, Skipped: 3, Time elapsed: 153.225 sec - in org.apache.hadoop.hbase.client.TestHCM
Running org.apache.hadoop.hbase.client.TestRestoreSnapshotFromClientWithRegionReplicas
Running org.apache.hadoop.hbase.client.TestReplicaWithCluster
Running org.apache.hadoop.hbase.client.TestHTableMultiplexer
Tests run: 1, Failures: 0, Errors: 0, Skipped: 0, Time elapsed: 8.675 sec - in org.apache.hadoop.hbase.client.TestHTableMultiplexer
Running org.apache.hadoop.hbase.client.TestScannerTimeout
Tests run: 4, Failures: 0, Errors: 0, Skipped: 0, Time elapsed: 32.029 sec - in org.apache.hadoop.hbase.client.TestReplicaWithCluster
Running org.apache.hadoop.hbase.client.TestReplicasClient
Tests run: 4, Failures: 0, Errors: 0, Skipped: 0, Time elapsed: 39.657 sec - in org.apache.hadoop.hbase.client.TestScannerTimeout
Running org.apache.hadoop.hbase.client.TestTableSnapshotScanner
Tests run: 80, Failures: 0, Errors: 0, Skipped: 4, Time elapsed: 101.579 sec - in org.apache.hadoop.hbase.client.TestFromClientSide
Running org.apache.hadoop.hbase.client.TestFromClientSide3
Tests run: 5, Failures: 0, Errors: 0, Skipped: 0, Time elapsed: 94.626 sec - in org.apache.hadoop.hbase.client.TestRestoreSnapshotFromClientWithRegionReplicas
Running org.apache.hadoop.hbase.client.TestMetaWithReplicas
Tests run: 3, Failures: 0, Errors: 0, Skipped: 0, Time elapsed: 36.888 sec - in org.apache.hadoop.hbase.client.TestTableSnapshotScanner
Running org.apache.hadoop.hbase.client.TestRestoreSnapshotFromClient
Tests run: 6, Failures: 0, Errors: 0, Skipped: 0, Time elapsed: 44.084 sec - in org.apache.hadoop.hbase.client.TestFromClientSide3
Running org.apache.hadoop.hbase.client.TestSnapshotMetadata
Tests run: 13, Failures: 0, Errors: 0, Skipped: 0, Time elapsed: 103.589 sec - in org.apache.hadoop.hbase.client.TestReplicasClient
Tests run: 4, Failures: 0, Errors: 0, Skipped: 0, Time elapsed: 13.808 sec - in org.apache.hadoop.hbase.client.TestSnapshotMetadata
Running org.apache.hadoop.hbase.client.TestHTableMultiplexerFlushCache
Tests run: 1, Failures: 0, Errors: 0, Skipped: 0, Time elapsed: 4.752 sec - in org.apache.hadoop.hbase.client.TestHTableMultiplexerFlushCache
Running org.apache.hadoop.hbase.TestMultiVersions
Tests run: 3, Failures: 0, Errors: 0, Skipped: 0, Time elapsed: 6.778 sec - in org.apache.hadoop.hbase.TestMultiVersions
Running org.apache.hadoop.hbase.TestHColumnDescriptorDefaultVersions
Running org.apache.hadoop.hbase.procedure.TestZKProcedure
Tests run: 4, Failures: 0, Errors: 0, Skipped: 0, Time elapsed: 2.048 sec - in org.apache.hadoop.hbase.procedure.TestZKProcedure
Running org.apache.hadoop.hbase.procedure.TestZKProcedureControllers
Tests run: 4, Failures: 0, Errors: 0, Skipped: 0, Time elapsed: 1.624 sec - in org.apache.hadoop.hbase.procedure.TestZKProcedureControllers
Tests run: 3, Failures: 0, Errors: 0, Skipped: 0, Time elapsed: 11.048 sec - in org.apache.hadoop.hbase.TestHColumnDescriptorDefaultVersions
Running org.apache.hadoop.hbase.TestNamespace
Running org.apache.hadoop.hbase.constraint.TestConstraint
Tests run: 11, Failures: 1, Errors: 0, Skipped: 0, Time elapsed: 95.466 sec <<< FAILURE! - in org.apache.hadoop.hbase.client.TestMetaWithReplicas
testChangingReplicaCount(org.apache.hadoop.hbase.client.TestMetaWithReplicas) Time elapsed: 8.951 sec <<< FAILURE!
java.lang.AssertionError: expected:<[]> but was:<[NULL_META_REGION, NO_META_REGION, UNKNOWN]>
at org.junit.Assert.fail(Assert.java:88)
at org.junit.Assert.failNotEquals(Assert.java:743)
at org.junit.Assert.assertEquals(Assert.java:118)
at org.junit.Assert.assertEquals(Assert.java:144)
at org.apache.hadoop.hbase.util.hbck.HbckTestingUtil.assertNoErrors(HbckTestingUtil.java:89)
at org.apache.hadoop.hbase.client.TestMetaWithReplicas.stopMasterAndValidateReplicaCount(TestMetaWithReplicas.java:252)
at org.apache.hadoop.hbase.client.TestMetaWithReplicas.testChangingReplicaCount(TestMetaWithReplicas.java:224)
Tests run: 5, Failures: 0, Errors: 0, Skipped: 0, Time elapsed: 81.563 sec - in org.apache.hadoop.hbase.client.TestRestoreSnapshotFromClient
Tests run: 9, Failures: 0, Errors: 0, Skipped: 1, Time elapsed: 8.474 sec - in org.apache.hadoop.hbase.TestNamespace
Running org.apache.hadoop.hbase.TestZooKeeper
Tests run: 5, Failures: 0, Errors: 0, Skipped: 0, Time elapsed: 8.702 sec - in org.apache.hadoop.hbase.constraint.TestConstraint
Running org.apache.hadoop.hbase.snapshot.TestFlushSnapshotFromClient
Running org.apache.hadoop.hbase.snapshot.TestExportSnapshot
Running org.apache.hadoop.hbase.snapshot.TestSecureExportSnapshot
Tests run: 9, Failures: 0, Errors: 0, Skipped: 0, Time elapsed: 47.017 sec - in org.apache.hadoop.hbase.snapshot.TestFlushSnapshotFromClient
Running org.apache.hadoop.hbase.snapshot.TestSnapshotDescriptionUtils
Tests run: 2, Failures: 0, Errors: 0, Skipped: 0, Time elapsed: 0.176 sec - in org.apache.hadoop.hbase.snapshot.TestSnapshotDescriptionUtils
Running org.apache.hadoop.hbase.TestIOFencing
Running org.apache.hadoop.hbase.snapshot.TestRestoreFlushSnapshotFromClient
Tests run: 5, Failures: 0, Errors: 0, Skipped: 0, Time elapsed: 51.041 sec - in org.apache.hadoop.hbase.snapshot.TestRestoreFlushSnapshotFromClient
Running org.apache.hadoop.hbase.coprocessor.TestRegionObserverScannerOpenHook
Tests run: 3, Failures: 0, Errors: 0, Skipped: 0, Time elapsed: 9.65 sec - in org.apache.hadoop.hbase.coprocessor.TestRegionObserverScannerOpenHook
Running org.apache.hadoop.hbase.coprocessor.TestOpenTableInCoprocessor
Tests run: 2, Failures: 0, Errors: 0, Skipped: 0, Time elapsed: 6.166 sec - in org.apache.hadoop.hbase.coprocessor.TestOpenTableInCoprocessor
Running org.apache.hadoop.hbase.coprocessor.TestMasterCoprocessorExceptionWithAbort
Tests run: 1, Failures: 0, Errors: 0, Skipped: 0, Time elapsed: 18.318 sec - in org.apache.hadoop.hbase.coprocessor.TestMasterCoprocessorExceptionWithAbort
Running org.apache.hadoop.hbase.coprocessor.TestRegionServerCoprocessorEndpoint
Tests run: 1, Failures: 0, Errors: 0, Skipped: 0, Time elapsed: 1.175 sec - in org.apache.hadoop.hbase.coprocessor.TestRegionServerCoprocessorEndpoint
Running org.apache.hadoop.hbase.coprocessor.TestRegionObserverInterface
Tests run: 11, Failures: 0, Errors: 0, Skipped: 0, Time elapsed: 199.131 sec - in org.apache.hadoop.hbase.TestZooKeeper
Running org.apache.hadoop.hbase.coprocessor.TestMasterCoprocessorExceptionWithRemove
Tests run: 1, Failures: 0, Errors: 0, Skipped: 0, Time elapsed: 4.639 sec - in org.apache.hadoop.hbase.coprocessor.TestMasterCoprocessorExceptionWithRemove
Running org.apache.hadoop.hbase.coprocessor.TestAggregateProtocol
Tests run: 13, Failures: 0, Errors: 0, Skipped: 0, Time elapsed: 40.288 sec - in org.apache.hadoop.hbase.coprocessor.TestRegionObserverInterface
Tests run: 44, Failures: 0, Errors: 0, Skipped: 0, Time elapsed: 7.362 sec - in org.apache.hadoop.hbase.coprocessor.TestAggregateProtocol
Running org.apache.hadoop.hbase.coprocessor.TestBatchCoprocessorEndpoint
Tests run: 4, Failures: 0, Errors: 0, Skipped: 0, Time elapsed: 1.86 sec - in org.apache.hadoop.hbase.coprocessor.TestBatchCoprocessorEndpoint
Running org.apache.hadoop.hbase.coprocessor.TestRegionServerObserver
Running org.apache.hadoop.hbase.coprocessor.TestHTableWrapper
Tests run: 1, Failures: 0, Errors: 0, Skipped: 0, Time elapsed: 3.418 sec - in org.apache.hadoop.hbase.coprocessor.TestHTableWrapper
Tests run: 2, Failures: 0, Errors: 0, Skipped: 0, Time elapsed: 186.893 sec - in org.apache.hadoop.hbase.TestIOFencing
Running org.apache.hadoop.hbase.coprocessor.TestRegionServerCoprocessorExceptionWithAbort
Tests run: 1, Failures: 0, Errors: 0, Skipped: 0, Time elapsed: 12.591 sec - in org.apache.hadoop.hbase.coprocessor.TestRegionServerObserver
Running org.apache.hadoop.hbase.coprocessor.TestClassLoading
Running org.apache.hadoop.hbase.coprocessor.TestDoubleColumnInterpreter
Tests run: 2, Failures: 0, Errors: 0, Skipped: 0, Time elapsed: 15.316 sec - in org.apache.hadoop.hbase.coprocessor.TestRegionServerCoprocessorExceptionWithAbort
Tests run: 38, Failures: 0, Errors: 0, Skipped: 0, Time elapsed: 6.764 sec - in org.apache.hadoop.hbase.coprocessor.TestDoubleColumnInterpreter
Running org.apache.hadoop.hbase.coprocessor.TestRegionObserverBypass
Tests run: 9, Failures: 0, Errors: 0, Skipped: 0, Time elapsed: 20.334 sec - in org.apache.hadoop.hbase.coprocessor.TestClassLoading
Tests run: 2, Failures: 0, Errors: 0, Skipped: 0, Time elapsed: 3.746 sec - in org.apache.hadoop.hbase.coprocessor.TestRegionObserverBypass
Running org.apache.hadoop.hbase.coprocessor.TestRowProcessorEndpoint
Running org.apache.hadoop.hbase.coprocessor.TestCoprocessorStop
Running org.apache.hadoop.hbase.coprocessor.TestRegionServerCoprocessorExceptionWithRemove
Tests run: 4, Failures: 0, Errors: 0, Skipped: 0, Time elapsed: 8.703 sec - in org.apache.hadoop.hbase.coprocessor.TestRowProcessorEndpoint
Running org.apache.hadoop.hbase.coprocessor.TestBigDecimalColumnInterpreter
Tests run: 1, Failures: 0, Errors: 0, Skipped: 0, Time elapsed: 16.409 sec - in org.apache.hadoop.hbase.coprocessor.TestCoprocessorStop
Tests run: 1, Failures: 0, Errors: 0, Skipped: 0, Time elapsed: 15.741 sec - in org.apache.hadoop.hbase.coprocessor.TestRegionServerCoprocessorExceptionWithRemove
Tests run: 38, Failures: 0, Errors: 0, Skipped: 0, Time elapsed: 7.251 sec - in org.apache.hadoop.hbase.coprocessor.TestBigDecimalColumnInterpreter
Running org.apache.hadoop.hbase.coprocessor.TestMasterObserver
Running org.apache.hadoop.hbase.coprocessor.TestCoprocessorEndpoint
Running org.apache.hadoop.hbase.coprocessor.TestWALObserver
Tests run: 6, Failures: 0, Errors: 0, Skipped: 0, Time elapsed: 7.389 sec - in org.apache.hadoop.hbase.coprocessor.TestWALObserver
Tests run: 7, Failures: 0, Errors: 0, Skipped: 0, Time elapsed: 11.461 sec - in org.apache.hadoop.hbase.coprocessor.TestMasterObserver
Running org.apache.hadoop.hbase.TestGlobalMemStoreSize
Tests run: 9, Failures: 0, Errors: 0, Skipped: 0, Time elapsed: 298.278 sec - in org.apache.hadoop.hbase.snapshot.TestExportSnapshot
Running org.apache.hadoop.hbase.TestMetaTableLocator
Tests run: 7, Failures: 0, Errors: 0, Skipped: 0, Time elapsed: 3.598 sec - in org.apache.hadoop.hbase.TestMetaTableLocator
Running org.apache.hadoop.hbase.TestJMXListener
Tests run: 1, Failures: 0, Errors: 0, Skipped: 0, Time elapsed: 11.741 sec - in org.apache.hadoop.hbase.TestGlobalMemStoreSize
Running org.apache.hadoop.hbase.zookeeper.TestZKMulti
Tests run: 8, Failures: 0, Errors: 0, Skipped: 0, Time elapsed: 0.561 sec - in org.apache.hadoop.hbase.zookeeper.TestZKMulti
Running org.apache.hadoop.hbase.zookeeper.TestZooKeeperACL
Running org.apache.hadoop.hbase.zookeeper.lock.TestZKInterProcessReadWriteLock
Tests run: 6, Failures: 0, Errors: 0, Skipped: 0, Time elapsed: 0.291 sec - in org.apache.hadoop.hbase.zookeeper.TestZooKeeperACL
Running org.apache.hadoop.hbase.zookeeper.TestZKLeaderManager
Tests run: 1, Failures: 0, Errors: 0, Skipped: 0, Time elapsed: 0.121 sec - in org.apache.hadoop.hbase.zookeeper.TestZKLeaderManager
Running org.apache.hadoop.hbase.zookeeper.TestRecoverableZooKeeper
Tests run: 9, Failures: 0, Errors: 0, Skipped: 0, Time elapsed: 311.85 sec - in org.apache.hadoop.hbase.snapshot.TestSecureExportSnapshot
Tests run: 1, Failures: 0, Errors: 0, Skipped: 0, Time elapsed: 1.227 sec - in org.apache.hadoop.hbase.zookeeper.TestRecoverableZooKeeper
Running org.apache.hadoop.hbase.zookeeper.TestZooKeeperNodeTracker
Running org.apache.hadoop.hbase.zookeeper.TestHQuorumPeer
Tests run: 3, Failures: 0, Errors: 0, Skipped: 0, Time elapsed: 0.853 sec - in org.apache.hadoop.hbase.zookeeper.TestZooKeeperNodeTracker
Running org.apache.hadoop.hbase.TestClusterBootOrder
Tests run: 2, Failures: 0, Errors: 0, Skipped: 0, Time elapsed: 16.533 sec - in org.apache.hadoop.hbase.TestJMXListener
Tests run: 3, Failures: 0, Errors: 0, Skipped: 0, Time elapsed: 1.768 sec - in org.apache.hadoop.hbase.zookeeper.TestHQuorumPeer
Tests run: 6, Failures: 0, Errors: 0, Skipped: 0, Time elapsed: 24.494 sec - in org.apache.hadoop.hbase.zookeeper.lock.TestZKInterProcessReadWriteLock
Tests run: 2, Failures: 0, Errors: 0, Skipped: 0, Time elapsed: 24.979 sec - in org.apache.hadoop.hbase.TestClusterBootOrder
Tests run: 6, Failures: 0, Errors: 0, Skipped: 0, Time elapsed: 553.423 sec - in org.apache.hadoop.hbase.coprocessor.TestCoprocessorEndpoint
Results :
Failed tests:
TestMetaWithReplicas.testChangingReplicaCount:224->stopMasterAndValidateReplicaCount:252 expected:<[]> but was:<[NULL_META_REGION, NO_META_REGION, UNKNOWN]>
TestMasterFailover.testPendingOpenOrCloseWhenMasterFailover:307 Waiting timed out after [60,000] msec
Tests run: 2172, Failures: 2, Errors: 0, Skipped: 25
[INFO] ------------------------------------------------------------------------
[INFO] Reactor Summary:
[INFO]
[INFO] HBase ............................................. SUCCESS [3.056s]
[INFO] HBase - Checkstyle ................................ SUCCESS [0.684s]
[INFO] HBase - Annotations ............................... SUCCESS [0.857s]
[INFO] HBase - Protocol .................................. SUCCESS [13.023s]
[INFO] HBase - Common .................................... SUCCESS [1:03.350s]
[INFO] HBase - Client .................................... SUCCESS [1:16.141s]
[INFO] HBase - Hadoop Compatibility ...................... SUCCESS [6.953s]
[INFO] HBase - Hadoop Two Compatibility .................. SUCCESS [6.082s]
[INFO] HBase - Prefix Tree ............................... SUCCESS [8.262s]
[INFO] HBase - Server .................................... FAILURE [1:20:12.978s]
[INFO] HBase - Testing Util .............................. SKIPPED
[INFO] HBase - Thrift .................................... SKIPPED
[INFO] HBase - Shell ..................................... SKIPPED
[INFO] HBase - Integration Tests ......................... SKIPPED
[INFO] HBase - Examples .................................. SKIPPED
[INFO] HBase - Rest ...................................... SKIPPED
[INFO] HBase - Assembly .................................. SKIPPED
[INFO] ------------------------------------------------------------------------
[INFO] BUILD FAILURE
[INFO] ------------------------------------------------------------------------
[INFO] Total time: 1:23:12.179s
[INFO] Finished at: Wed Jan 28 02:50:30 UTC 2015
[INFO] Final Memory: 65M/857M
[INFO] ------------------------------------------------------------------------
[ERROR] Failed to execute goal org.apache.maven.plugins:maven-surefire-plugin:2.18:test (secondPartTestsExecution) on project hbase-server: There was a timeout or other error in the fork -> [Help 1]
[ERROR]
[ERROR] To see the full stack trace of the errors, re-run Maven with the -e switch.
[ERROR] Re-run Maven using the -X switch to enable full debug logging.
[ERROR]
[ERROR] For more information about the errors and possible solutions, please read the following articles:
[ERROR] [Help 1] http://cwiki.apache.org/confluence/display/MAVEN/MojoFailureException
[ERROR]
[ERROR] After correcting the problems, you can resume the build with the command
[ERROR] mvn <goals> -rf :hbase-server
Build step 'Invoke top-level Maven targets' marked build as failure
[FINDBUGS] Skipping publisher since build result is FAILURE
Performing Post build task...
Match found for :.* : True
Logical operation result is TRUE
Running script : ZOMBIE_TESTS_COUNT=`jps | grep surefirebooter | wc -l`
if [[ $ZOMBIE_TESTS_COUNT != 0 ]] ; then
#It seems sometimes the tests are not dying immediately. Let's give them 10s
echo "Suspicious java process found - waiting 10s to see if there are just slow to stop"
sleep 10
ZOMBIE_TESTS_COUNT=`jps | grep surefirebooter | wc -l`
if [[ $ZOMBIE_TESTS_COUNT != 0 ]] ; then
echo "There are $ZOMBIE_TESTS_COUNT zombie tests, they should have been killed by surefire but survived"
echo "************ BEGIN zombies jstack extract"
ZB_STACK=`jps | grep surefirebooter | cut -d ' ' -f 1 | xargs -n 1 jstack | grep ".test" | grep "\.java"`
jps | grep surefirebooter | cut -d ' ' -f 1 | xargs -n 1 jstack
echo "************ END zombies jstack extract"
JIRA_COMMENT="$JIRA_COMMENT
{color:red}-1 core zombie tests{color}. There are ${ZOMBIE_TESTS_COUNT} zombie test(s): ${ZB_STACK}"
BAD=1
jps | grep surefirebooter | cut -d ' ' -f 1 | xargs kill -9
else
echo "We're ok: there is no zombie test, but some tests took some time to stop"
fi
else
echo "We're ok: there is no zombie test"
fi
[HBase-TRUNK] $ /bin/bash -xe /tmp/hudson7468584875444248220.sh
++ jps
++ grep surefirebooter
++ wc -l
+ ZOMBIE_TESTS_COUNT=1
+ [[ 1 != 0 ]]
+ echo 'Suspicious java process found - waiting 10s to see if there are just slow to stop'
Suspicious java process found - waiting 10s to see if there are just slow to stop
+ sleep 10
++ jps
++ grep surefirebooter
++ wc -l
+ ZOMBIE_TESTS_COUNT=0
+ [[ 0 != 0 ]]
+ echo 'We'\''re ok: there is no zombie test, but some tests took some time to stop'
We're ok: there is no zombie test, but some tests took some time to stop
POST BUILD TASK : SUCCESS
END OF POST BUILD TASK : 0
Archiving artifacts
Sending artifact delta relative to HBase-TRUNK #6052
Archived 1832 artifacts
Archive block size is 32768
Received 31 blocks and 382626312 bytes
Compression is 0.3%
Took 1 min 35 sec
Recording test results
Updating HBASE-11574
Build failed in Jenkins: HBase-TRUNK #6063
Posted by Apache Jenkins Server <je...@builds.apache.org>.
See <https://builds.apache.org/job/HBase-TRUNK/6063/changes>
Changes:
[enis] HBASE-12916 No access control for replicating WAL entries (Liu Shaohui)
------------------------------------------
[...truncated 4914 lines...]
at java.util.concurrent.LinkedBlockingQueue.take(LinkedBlockingQueue.java:442)
at org.apache.zookeeper.ClientCnxn$EventThread.run(ClientCnxn.java:494)
"main-SendThread(localhost:53868)" daemon prio=10 tid=0x4f7fa400 nid=0x4cbb waiting on condition [0x4f45c000]
java.lang.Thread.State: TIMED_WAITING (sleeping)
at java.lang.Thread.sleep(Native Method)
at org.apache.zookeeper.ClientCnxn$SendThread.run(ClientCnxn.java:994)
"main-EventThread" daemon prio=10 tid=0x4fcfac00 nid=0x4cb5 waiting on condition [0x4f4ad000]
java.lang.Thread.State: WAITING (parking)
at sun.misc.Unsafe.park(Native Method)
- parking to wait for <0x7e8cf938> (a java.util.concurrent.locks.AbstractQueuedSynchronizer$ConditionObject)
at java.util.concurrent.locks.LockSupport.park(LockSupport.java:186)
at java.util.concurrent.locks.AbstractQueuedSynchronizer$ConditionObject.await(AbstractQueuedSynchronizer.java:2043)
at java.util.concurrent.LinkedBlockingQueue.take(LinkedBlockingQueue.java:442)
at org.apache.zookeeper.ClientCnxn$EventThread.run(ClientCnxn.java:494)
"main-SendThread(localhost:53868)" daemon prio=10 tid=0x4fbfa400 nid=0x4cb4 waiting on condition [0x4f4fe000]
java.lang.Thread.State: TIMED_WAITING (sleeping)
at java.lang.Thread.sleep(Native Method)
at org.apache.zookeeper.ClientCnxn$SendThread.run(ClientCnxn.java:994)
"main-EventThread" daemon prio=10 tid=0x4fdfa400 nid=0x4cb1 waiting on condition [0x50276000]
java.lang.Thread.State: WAITING (parking)
at sun.misc.Unsafe.park(Native Method)
- parking to wait for <0x7e5a9c80> (a java.util.concurrent.locks.AbstractQueuedSynchronizer$ConditionObject)
at java.util.concurrent.locks.LockSupport.park(LockSupport.java:186)
at java.util.concurrent.locks.AbstractQueuedSynchronizer$ConditionObject.await(AbstractQueuedSynchronizer.java:2043)
at java.util.concurrent.LinkedBlockingQueue.take(LinkedBlockingQueue.java:442)
at org.apache.zookeeper.ClientCnxn$EventThread.run(ClientCnxn.java:494)
"main-SendThread(localhost:53868)" daemon prio=10 tid=0x500fac00 nid=0x4cb0 waiting on condition [0x50318000]
java.lang.Thread.State: TIMED_WAITING (sleeping)
at java.lang.Thread.sleep(Native Method)
at org.apache.zookeeper.client.StaticHostProvider.next(StaticHostProvider.java:101)
at org.apache.zookeeper.ClientCnxn$SendThread.startConnect(ClientCnxn.java:940)
at org.apache.zookeeper.ClientCnxn$SendThread.run(ClientCnxn.java:1003)
"main-EventThread" daemon prio=10 tid=0x500fa400 nid=0x4ca5 waiting on condition [0x502c7000]
java.lang.Thread.State: WAITING (parking)
at sun.misc.Unsafe.park(Native Method)
- parking to wait for <0x7ee14850> (a java.util.concurrent.locks.AbstractQueuedSynchronizer$ConditionObject)
at java.util.concurrent.locks.LockSupport.park(LockSupport.java:186)
at java.util.concurrent.locks.AbstractQueuedSynchronizer$ConditionObject.await(AbstractQueuedSynchronizer.java:2043)
at java.util.concurrent.LinkedBlockingQueue.take(LinkedBlockingQueue.java:442)
at org.apache.zookeeper.ClientCnxn$EventThread.run(ClientCnxn.java:494)
"main-SendThread(localhost:53868)" daemon prio=10 tid=0x4fffa800 nid=0x4ca4 waiting on condition [0x50369000]
java.lang.Thread.State: TIMED_WAITING (sleeping)
at java.lang.Thread.sleep(Native Method)
at org.apache.zookeeper.ClientCnxn$SendThread.run(ClientCnxn.java:994)
"main-EventThread" daemon prio=10 tid=0x4fffa400 nid=0x4c97 waiting on condition [0x503ba000]
java.lang.Thread.State: WAITING (parking)
at sun.misc.Unsafe.park(Native Method)
- parking to wait for <0x7ecda7c0> (a java.util.concurrent.locks.AbstractQueuedSynchronizer$ConditionObject)
at java.util.concurrent.locks.LockSupport.park(LockSupport.java:186)
at java.util.concurrent.locks.AbstractQueuedSynchronizer$ConditionObject.await(AbstractQueuedSynchronizer.java:2043)
at java.util.concurrent.LinkedBlockingQueue.take(LinkedBlockingQueue.java:442)
at org.apache.zookeeper.ClientCnxn$EventThread.run(ClientCnxn.java:494)
"main-SendThread(localhost:53868)" daemon prio=10 tid=0x505fa800 nid=0x4c96 waiting on condition [0x5065c000]
java.lang.Thread.State: TIMED_WAITING (sleeping)
at java.lang.Thread.sleep(Native Method)
at org.apache.zookeeper.ClientCnxn$SendThread.run(ClientCnxn.java:994)
"main-EventThread" daemon prio=10 tid=0x505fa400 nid=0x4c8e waiting on condition [0x504ad000]
java.lang.Thread.State: WAITING (parking)
at sun.misc.Unsafe.park(Native Method)
- parking to wait for <0x7e58c260> (a java.util.concurrent.locks.AbstractQueuedSynchronizer$ConditionObject)
at java.util.concurrent.locks.LockSupport.park(LockSupport.java:186)
at java.util.concurrent.locks.AbstractQueuedSynchronizer$ConditionObject.await(AbstractQueuedSynchronizer.java:2043)
at java.util.concurrent.LinkedBlockingQueue.take(LinkedBlockingQueue.java:442)
at org.apache.zookeeper.ClientCnxn$EventThread.run(ClientCnxn.java:494)
"main-SendThread(localhost:53868)" daemon prio=10 tid=0x6291b400 nid=0x4c8d waiting on condition [0x504fe000]
java.lang.Thread.State: TIMED_WAITING (sleeping)
at java.lang.Thread.sleep(Native Method)
at org.apache.zookeeper.client.StaticHostProvider.next(StaticHostProvider.java:101)
at org.apache.zookeeper.ClientCnxn$SendThread.startConnect(ClientCnxn.java:940)
at org.apache.zookeeper.ClientCnxn$SendThread.run(ClientCnxn.java:1003)
"HBase-Metrics2-1" daemon prio=10 tid=0x088c7000 nid=0x495b waiting on condition [0x5b33e000]
java.lang.Thread.State: TIMED_WAITING (parking)
at sun.misc.Unsafe.park(Native Method)
- parking to wait for <0x7ee8b518> (a java.util.concurrent.locks.AbstractQueuedSynchronizer$ConditionObject)
at java.util.concurrent.locks.LockSupport.parkNanos(LockSupport.java:226)
at java.util.concurrent.locks.AbstractQueuedSynchronizer$ConditionObject.awaitNanos(AbstractQueuedSynchronizer.java:2082)
at java.util.concurrent.ScheduledThreadPoolExecutor$DelayedWorkQueue.take(ScheduledThreadPoolExecutor.java:1090)
at java.util.concurrent.ScheduledThreadPoolExecutor$DelayedWorkQueue.take(ScheduledThreadPoolExecutor.java:807)
at java.util.concurrent.ThreadPoolExecutor.getTask(ThreadPoolExecutor.java:1068)
at java.util.concurrent.ThreadPoolExecutor.runWorker(ThreadPoolExecutor.java:1130)
at java.util.concurrent.ThreadPoolExecutor$Worker.run(ThreadPoolExecutor.java:615)
at java.lang.Thread.run(Thread.java:724)
"threadDeathWatcher-2-1" daemon prio=10 tid=0x62674400 nid=0x494f waiting on condition [0x5c70b000]
java.lang.Thread.State: TIMED_WAITING (sleeping)
at java.lang.Thread.sleep(Native Method)
at io.netty.util.ThreadDeathWatcher$Watcher.run(ThreadDeathWatcher.java:137)
at io.netty.util.concurrent.DefaultThreadFactory$DefaultRunnableDecorator.run(DefaultThreadFactory.java:137)
at java.lang.Thread.run(Thread.java:724)
"pool-10-thread-1" prio=10 tid=0x5cb2ac00 nid=0x4940 waiting on condition [0x5c9ad000]
java.lang.Thread.State: TIMED_WAITING (sleeping)
at java.lang.Thread.sleep(Native Method)
at io.netty.util.HashedWheelTimer$Worker.waitForNextTick(HashedWheelTimer.java:461)
at io.netty.util.HashedWheelTimer$Worker.run(HashedWheelTimer.java:360)
at java.lang.Thread.run(Thread.java:724)
"org.apache.hadoop.hdfs.PeerCache@e37fcd" daemon prio=10 tid=0x6b316400 nid=0x479e waiting on condition [0x5d976000]
java.lang.Thread.State: TIMED_WAITING (sleeping)
at java.lang.Thread.sleep(Native Method)
at org.apache.hadoop.hdfs.PeerCache.run(PeerCache.java:244)
at org.apache.hadoop.hdfs.PeerCache.access$000(PeerCache.java:41)
at org.apache.hadoop.hdfs.PeerCache$1.run(PeerCache.java:119)
at java.lang.Thread.run(Thread.java:724)
"Timer for 'NameNode' metrics system" daemon prio=10 tid=0x618f5000 nid=0x41a8 in Object.wait() [0x6427d000]
java.lang.Thread.State: TIMED_WAITING (on object monitor)
at java.lang.Object.wait(Native Method)
at java.util.TimerThread.mainLoop(Timer.java:552)
- locked <0x7dd8f0f0> (a java.util.TaskQueue)
at java.util.TimerThread.run(Timer.java:505)
"Service Thread" daemon prio=10 tid=0x64cf7800 nid=0x3e0b runnable [0x00000000]
java.lang.Thread.State: RUNNABLE
"C2 CompilerThread1" daemon prio=10 tid=0x64cf5c00 nid=0x3e09 waiting on condition [0x00000000]
java.lang.Thread.State: RUNNABLE
"C2 CompilerThread0" daemon prio=10 tid=0x64cf3c00 nid=0x3e08 waiting on condition [0x00000000]
java.lang.Thread.State: RUNNABLE
"Signal Dispatcher" daemon prio=10 tid=0x64cf2000 nid=0x3e07 runnable [0x00000000]
java.lang.Thread.State: RUNNABLE
"Finalizer" daemon prio=10 tid=0x64cb7000 nid=0x3de8 in Object.wait() [0x6be7d000]
java.lang.Thread.State: WAITING (on object monitor)
at java.lang.Object.wait(Native Method)
at java.lang.ref.ReferenceQueue.remove(ReferenceQueue.java:135)
- locked <0x7cb2cc30> (a java.lang.ref.ReferenceQueue$Lock)
at java.lang.ref.ReferenceQueue.remove(ReferenceQueue.java:151)
at java.lang.ref.Finalizer$FinalizerThread.run(Finalizer.java:189)
"Reference Handler" daemon prio=10 tid=0x64cb5400 nid=0x3de7 in Object.wait() [0x6c07d000]
java.lang.Thread.State: WAITING (on object monitor)
at java.lang.Object.wait(Native Method)
at java.lang.Object.wait(Object.java:503)
at java.lang.ref.Reference$ReferenceHandler.run(Reference.java:133)
- locked <0x7cb5c880> (a java.lang.ref.Reference$Lock)
"main" prio=10 tid=0xf6706800 nid=0x3db5 in Object.wait() [0xf68a7000]
java.lang.Thread.State: WAITING (on object monitor)
at java.lang.Object.wait(Native Method)
at java.lang.Thread.join(Thread.java:1260)
- locked <0xb4ed1d90> (a org.apache.hadoop.hbase.TestAcidGuarantees$AtomicityWriter)
at java.lang.Thread.join(Thread.java:1334)
at org.apache.hadoop.hbase.MultithreadedTestUtil$TestContext.stop(MultithreadedTestUtil.java:103)
at org.apache.hadoop.hbase.TestAcidGuarantees.runTestAtomicity(TestAcidGuarantees.java:323)
at org.apache.hadoop.hbase.TestAcidGuarantees.runTestAtomicity(TestAcidGuarantees.java:261)
at org.apache.hadoop.hbase.TestAcidGuarantees.testScanAtomicity(TestAcidGuarantees.java:354)
at sun.reflect.NativeMethodAccessorImpl.invoke0(Native Method)
at sun.reflect.NativeMethodAccessorImpl.invoke(NativeMethodAccessorImpl.java:57)
at sun.reflect.DelegatingMethodAccessorImpl.invoke(DelegatingMethodAccessorImpl.java:43)
at java.lang.reflect.Method.invoke(Method.java:606)
at org.junit.runners.model.FrameworkMethod$1.runReflectiveCall(FrameworkMethod.java:47)
at org.junit.internal.runners.model.ReflectiveCallable.run(ReflectiveCallable.java:12)
at org.junit.runners.model.FrameworkMethod.invokeExplosively(FrameworkMethod.java:44)
at org.junit.internal.runners.statements.InvokeMethod.evaluate(InvokeMethod.java:17)
at org.junit.runners.ParentRunner.runLeaf(ParentRunner.java:271)
at org.junit.runners.BlockJUnit4ClassRunner.runChild(BlockJUnit4ClassRunner.java:70)
at org.junit.runners.BlockJUnit4ClassRunner.runChild(BlockJUnit4ClassRunner.java:50)
at org.junit.runners.ParentRunner$3.run(ParentRunner.java:238)
at org.junit.runners.ParentRunner$1.schedule(ParentRunner.java:63)
at org.junit.runners.ParentRunner.runChildren(ParentRunner.java:236)
at org.junit.runners.ParentRunner.access$000(ParentRunner.java:53)
at org.junit.runners.ParentRunner$2.evaluate(ParentRunner.java:229)
at org.junit.runners.ParentRunner.run(ParentRunner.java:309)
at org.junit.runners.Suite.runChild(Suite.java:127)
at org.junit.runners.Suite.runChild(Suite.java:26)
at org.junit.runners.ParentRunner$3.run(ParentRunner.java:238)
at org.junit.runners.ParentRunner$1.schedule(ParentRunner.java:63)
at org.junit.runners.ParentRunner.runChildren(ParentRunner.java:236)
at org.junit.runners.ParentRunner.access$000(ParentRunner.java:53)
at org.junit.runners.ParentRunner$2.evaluate(ParentRunner.java:229)
at org.junit.runners.ParentRunner.run(ParentRunner.java:309)
at org.junit.runner.JUnitCore.run(JUnitCore.java:160)
at org.junit.runner.JUnitCore.run(JUnitCore.java:138)
at org.apache.maven.surefire.junitcore.JUnitCoreWrapper.createRequestAndRun(JUnitCoreWrapper.java:107)
at org.apache.maven.surefire.junitcore.JUnitCoreWrapper.executeEager(JUnitCoreWrapper.java:77)
at org.apache.maven.surefire.junitcore.JUnitCoreWrapper.execute(JUnitCoreWrapper.java:53)
at org.apache.maven.surefire.junitcore.JUnitCoreProvider.invoke(JUnitCoreProvider.java:144)
at org.apache.maven.surefire.booter.ForkedBooter.invokeProviderInSameClassLoader(ForkedBooter.java:203)
at org.apache.maven.surefire.booter.ForkedBooter.runSuitesInProcess(ForkedBooter.java:155)
at org.apache.maven.surefire.booter.ForkedBooter.main(ForkedBooter.java:103)
"VM Thread" prio=10 tid=0x64bf8800 nid=0x3de2 runnable
"GC task thread#0 (ParallelGC)" prio=10 tid=0xf6710800 nid=0x3db7 runnable
"GC task thread#1 (ParallelGC)" prio=10 tid=0xf6712000 nid=0x3db9 runnable
"GC task thread#2 (ParallelGC)" prio=10 tid=0xf6713800 nid=0x3dba runnable
"GC task thread#3 (ParallelGC)" prio=10 tid=0xf6715000 nid=0x3dbb runnable
"GC task thread#4 (ParallelGC)" prio=10 tid=0xf6716400 nid=0x3dbc runnable
"GC task thread#5 (ParallelGC)" prio=10 tid=0xf6717c00 nid=0x3dbd runnable
"GC task thread#6 (ParallelGC)" prio=10 tid=0xf6719400 nid=0x3dbf runnable
"GC task thread#7 (ParallelGC)" prio=10 tid=0xf671a800 nid=0x3dc4 runnable
"GC task thread#8 (ParallelGC)" prio=10 tid=0xf671c000 nid=0x3dc5 runnable
"GC task thread#9 (ParallelGC)" prio=10 tid=0xf671d800 nid=0x3dc8 runnable
"GC task thread#10 (ParallelGC)" prio=10 tid=0xf671ec00 nid=0x3dc9 runnable
"GC task thread#11 (ParallelGC)" prio=10 tid=0xf6720400 nid=0x3dca runnable
"GC task thread#12 (ParallelGC)" prio=10 tid=0xf6721c00 nid=0x3dcb runnable
"VM Periodic Task Thread" prio=10 tid=0x64cf9800 nid=0x3e0c waiting on condition
JNI global references: 378
+ echo '************ END zombies jstack extract'
************ END zombies jstack extract
+ JIRA_COMMENT='
{color:red}-1 core zombie tests{color}. There are 1 zombie test(s): at org.apache.hadoop.hbase.TestAcidGuarantees.testScanAtomicity(TestAcidGuarantees.java:354)'
+ BAD=1
+ jps
+ grep surefirebooter
+ xargs kill -9
+ cut -d ' ' -f 1
POST BUILD TASK : SUCCESS
END OF POST BUILD TASK : 0
Archiving artifacts
Sending artifact delta relative to HBase-TRUNK #6052
Archived 1833 artifacts
Archive block size is 32768
Received 31 blocks and 375759338 bytes
Compression is 0.3%
Took 1 min 49 sec
Recording test results
Updating HBASE-12916