You are viewing a plain text version of this content. The canonical link for it is here.
Posted to dev@geronimo.apache.org by db...@apache.org on 2004/07/31 11:45:15 UTC
[status] build: FAILED, test: FAILED | Linux 2.4.26, 2004-07-31
NIGHTLY BUILD/TEST
Date: Sat Jul 31 05:33:18 EDT 2004
Kernel: Linux 2.4.26
Host: beaver.codehaus.org
Java: 1.4.2_04-b05, mixed mode
Maven: 1.0
CHECKOUT: incubator-geronimo
BUILDING: incubator-geronimo
BUILD FAILED
BUILD FAILED
Total time: 11 minutes 15 seconds
Finished at: Sat Jul 31 05:45:15 EDT 2004