You are viewing a plain text version of this content. The canonical link for it is here.
Posted to dev@lucene.apache.org by Policeman Jenkins Server <je...@thetaphi.de> on 2017/07/04 08:55:07 UTC

[JENKINS] Lucene-Solr-master-MacOSX (64bit/jdk1.8.0) - Build # 4129 - Still Unstable!

Build: https://jenkins.thetaphi.de/job/Lucene-Solr-master-MacOSX/4129/
Java: 64bit/jdk1.8.0 -XX:-UseCompressedOops -XX:+UseSerialGC

5 tests failed.
FAILED:  org.apache.solr.cloud.DocValuesNotIndexedTest.testDistribFaceting

Error Message:
No live SolrServers available to handle this request:[http://127.0.0.1:63512/solr/dv_coll, http://127.0.0.1:63513/solr/dv_coll]

Stack Trace:
org.apache.solr.client.solrj.SolrServerException: No live SolrServers available to handle this request:[http://127.0.0.1:63512/solr/dv_coll, http://127.0.0.1:63513/solr/dv_coll]
	at __randomizedtesting.SeedInfo.seed([19A3076A21894501:7B12F95745926ED3]:0)
	at org.apache.solr.client.solrj.impl.LBHttpSolrClient.request(LBHttpSolrClient.java:462)
	at org.apache.solr.client.solrj.impl.CloudSolrClient.sendRequest(CloudSolrClient.java:1121)
	at org.apache.solr.client.solrj.impl.CloudSolrClient.requestWithRetryOnStaleState(CloudSolrClient.java:862)
	at org.apache.solr.client.solrj.impl.CloudSolrClient.request(CloudSolrClient.java:793)
	at org.apache.solr.client.solrj.SolrRequest.process(SolrRequest.java:178)
	at org.apache.solr.client.solrj.SolrClient.query(SolrClient.java:942)
	at org.apache.solr.cloud.DocValuesNotIndexedTest.testDistribFaceting(DocValuesNotIndexedTest.java:212)
	at sun.reflect.NativeMethodAccessorImpl.invoke0(Native Method)
	at sun.reflect.NativeMethodAccessorImpl.invoke(NativeMethodAccessorImpl.java:62)
	at sun.reflect.DelegatingMethodAccessorImpl.invoke(DelegatingMethodAccessorImpl.java:43)
	at java.lang.reflect.Method.invoke(Method.java:498)
	at com.carrotsearch.randomizedtesting.RandomizedRunner.invoke(RandomizedRunner.java:1713)
	at com.carrotsearch.randomizedtesting.RandomizedRunner$8.evaluate(RandomizedRunner.java:907)
	at com.carrotsearch.randomizedtesting.RandomizedRunner$9.evaluate(RandomizedRunner.java:943)
	at com.carrotsearch.randomizedtesting.RandomizedRunner$10.evaluate(RandomizedRunner.java:957)
	at com.carrotsearch.randomizedtesting.rules.SystemPropertiesRestoreRule$1.evaluate(SystemPropertiesRestoreRule.java:57)
	at org.apache.lucene.util.TestRuleSetupTeardownChained$1.evaluate(TestRuleSetupTeardownChained.java:49)
	at org.apache.lucene.util.AbstractBeforeAfterRule$1.evaluate(AbstractBeforeAfterRule.java:45)
	at org.apache.lucene.util.TestRuleThreadAndTestName$1.evaluate(TestRuleThreadAndTestName.java:48)
	at org.apache.lucene.util.TestRuleIgnoreAfterMaxFailures$1.evaluate(TestRuleIgnoreAfterMaxFailures.java:64)
	at org.apache.lucene.util.TestRuleMarkFailure$1.evaluate(TestRuleMarkFailure.java:47)
	at com.carrotsearch.randomizedtesting.rules.StatementAdapter.evaluate(StatementAdapter.java:36)
	at com.carrotsearch.randomizedtesting.ThreadLeakControl$StatementRunner.run(ThreadLeakControl.java:368)
	at com.carrotsearch.randomizedtesting.ThreadLeakControl.forkTimeoutingTask(ThreadLeakControl.java:817)
	at com.carrotsearch.randomizedtesting.ThreadLeakControl$3.evaluate(ThreadLeakControl.java:468)
	at com.carrotsearch.randomizedtesting.RandomizedRunner.runSingleTest(RandomizedRunner.java:916)
	at com.carrotsearch.randomizedtesting.RandomizedRunner$5.evaluate(RandomizedRunner.java:802)
	at com.carrotsearch.randomizedtesting.RandomizedRunner$6.evaluate(RandomizedRunner.java:852)
	at com.carrotsearch.randomizedtesting.RandomizedRunner$7.evaluate(RandomizedRunner.java:863)
	at com.carrotsearch.randomizedtesting.rules.StatementAdapter.evaluate(StatementAdapter.java:36)
	at com.carrotsearch.randomizedtesting.rules.SystemPropertiesRestoreRule$1.evaluate(SystemPropertiesRestoreRule.java:57)
	at org.apache.lucene.util.AbstractBeforeAfterRule$1.evaluate(AbstractBeforeAfterRule.java:45)
	at com.carrotsearch.randomizedtesting.rules.StatementAdapter.evaluate(StatementAdapter.java:36)
	at org.apache.lucene.util.TestRuleStoreClassName$1.evaluate(TestRuleStoreClassName.java:41)
	at com.carrotsearch.randomizedtesting.rules.NoShadowingOrOverridesOnMethodsRule$1.evaluate(NoShadowingOrOverridesOnMethodsRule.java:40)
	at com.carrotsearch.randomizedtesting.rules.NoShadowingOrOverridesOnMethodsRule$1.evaluate(NoShadowingOrOverridesOnMethodsRule.java:40)
	at com.carrotsearch.randomizedtesting.rules.StatementAdapter.evaluate(StatementAdapter.java:36)
	at com.carrotsearch.randomizedtesting.rules.StatementAdapter.evaluate(StatementAdapter.java:36)
	at com.carrotsearch.randomizedtesting.rules.StatementAdapter.evaluate(StatementAdapter.java:36)
	at org.apache.lucene.util.TestRuleAssertionsRequired$1.evaluate(TestRuleAssertionsRequired.java:53)
	at org.apache.lucene.util.TestRuleMarkFailure$1.evaluate(TestRuleMarkFailure.java:47)
	at org.apache.lucene.util.TestRuleIgnoreAfterMaxFailures$1.evaluate(TestRuleIgnoreAfterMaxFailures.java:64)
	at org.apache.lucene.util.TestRuleIgnoreTestSuites$1.evaluate(TestRuleIgnoreTestSuites.java:54)
	at com.carrotsearch.randomizedtesting.rules.StatementAdapter.evaluate(StatementAdapter.java:36)
	at com.carrotsearch.randomizedtesting.ThreadLeakControl$StatementRunner.run(ThreadLeakControl.java:368)
	at java.lang.Thread.run(Thread.java:748)
Caused by: org.apache.solr.client.solrj.impl.HttpSolrClient$RemoteSolrException: Error from server at http://127.0.0.1:63512/solr/dv_coll: Error from server at http://127.0.0.1:63513/solr/dv_coll_shard3_replica_n1: Expected mime type application/octet-stream but got text/html. <html>
<head>
<meta http-equiv="Content-Type" content="text/html;charset=ISO-8859-1"/>
<title>Error 500 </title>
</head>
<body>
<h2>HTTP ERROR: 500</h2>
<p>Problem accessing /solr/dv_coll_shard3_replica_n1/select. Reason:
<pre>    java.lang.NoClassDefFoundError: org/apache/solr/search/SolrIndexSearcher$6</pre></p>
<hr /><a href="http://eclipse.org/jetty">Powered by Jetty:// 9.3.14.v20161028</a><hr/>
</body>
</html>

	at org.apache.solr.client.solrj.impl.HttpSolrClient.executeMethod(HttpSolrClient.java:626)
	at org.apache.solr.client.solrj.impl.HttpSolrClient.request(HttpSolrClient.java:252)
	at org.apache.solr.client.solrj.impl.HttpSolrClient.request(HttpSolrClient.java:241)
	at org.apache.solr.client.solrj.impl.LBHttpSolrClient.doRequest(LBHttpSolrClient.java:483)
	at org.apache.solr.client.solrj.impl.LBHttpSolrClient.request(LBHttpSolrClient.java:413)
	... 45 more


FAILED:  org.apache.solr.cloud.TestReplicaProperties.test

Error Message:
timeout waiting for collection in cluster state: collection=testcollection

Stack Trace:
java.lang.RuntimeException: timeout waiting for collection in cluster state: collection=testcollection
	at __randomizedtesting.SeedInfo.seed([19A3076A21894501:91F738B08F7528F9]:0)
	at org.apache.solr.cloud.AbstractFullDistribZkTestBase.waitForCollection(AbstractFullDistribZkTestBase.java:348)
	at org.apache.solr.cloud.TestReplicaProperties.test(TestReplicaProperties.java:63)
	at sun.reflect.NativeMethodAccessorImpl.invoke0(Native Method)
	at sun.reflect.NativeMethodAccessorImpl.invoke(NativeMethodAccessorImpl.java:62)
	at sun.reflect.DelegatingMethodAccessorImpl.invoke(DelegatingMethodAccessorImpl.java:43)
	at java.lang.reflect.Method.invoke(Method.java:498)
	at com.carrotsearch.randomizedtesting.RandomizedRunner.invoke(RandomizedRunner.java:1713)
	at com.carrotsearch.randomizedtesting.RandomizedRunner$8.evaluate(RandomizedRunner.java:907)
	at com.carrotsearch.randomizedtesting.RandomizedRunner$9.evaluate(RandomizedRunner.java:943)
	at com.carrotsearch.randomizedtesting.RandomizedRunner$10.evaluate(RandomizedRunner.java:957)
	at org.apache.solr.BaseDistributedSearchTestCase$ShardsRepeatRule$ShardsFixedStatement.callStatement(BaseDistributedSearchTestCase.java:985)
	at org.apache.solr.BaseDistributedSearchTestCase$ShardsRepeatRule$ShardsStatement.evaluate(BaseDistributedSearchTestCase.java:960)
	at com.carrotsearch.randomizedtesting.rules.SystemPropertiesRestoreRule$1.evaluate(SystemPropertiesRestoreRule.java:57)
	at org.apache.lucene.util.TestRuleSetupTeardownChained$1.evaluate(TestRuleSetupTeardownChained.java:49)
	at org.apache.lucene.util.AbstractBeforeAfterRule$1.evaluate(AbstractBeforeAfterRule.java:45)
	at org.apache.lucene.util.TestRuleThreadAndTestName$1.evaluate(TestRuleThreadAndTestName.java:48)
	at org.apache.lucene.util.TestRuleIgnoreAfterMaxFailures$1.evaluate(TestRuleIgnoreAfterMaxFailures.java:64)
	at org.apache.lucene.util.TestRuleMarkFailure$1.evaluate(TestRuleMarkFailure.java:47)
	at com.carrotsearch.randomizedtesting.rules.StatementAdapter.evaluate(StatementAdapter.java:36)
	at com.carrotsearch.randomizedtesting.ThreadLeakControl$StatementRunner.run(ThreadLeakControl.java:368)
	at com.carrotsearch.randomizedtesting.ThreadLeakControl.forkTimeoutingTask(ThreadLeakControl.java:817)
	at com.carrotsearch.randomizedtesting.ThreadLeakControl$3.evaluate(ThreadLeakControl.java:468)
	at com.carrotsearch.randomizedtesting.RandomizedRunner.runSingleTest(RandomizedRunner.java:916)
	at com.carrotsearch.randomizedtesting.RandomizedRunner$5.evaluate(RandomizedRunner.java:802)
	at com.carrotsearch.randomizedtesting.RandomizedRunner$6.evaluate(RandomizedRunner.java:852)
	at com.carrotsearch.randomizedtesting.RandomizedRunner$7.evaluate(RandomizedRunner.java:863)
	at com.carrotsearch.randomizedtesting.rules.StatementAdapter.evaluate(StatementAdapter.java:36)
	at com.carrotsearch.randomizedtesting.rules.SystemPropertiesRestoreRule$1.evaluate(SystemPropertiesRestoreRule.java:57)
	at org.apache.lucene.util.AbstractBeforeAfterRule$1.evaluate(AbstractBeforeAfterRule.java:45)
	at com.carrotsearch.randomizedtesting.rules.StatementAdapter.evaluate(StatementAdapter.java:36)
	at org.apache.lucene.util.TestRuleStoreClassName$1.evaluate(TestRuleStoreClassName.java:41)
	at com.carrotsearch.randomizedtesting.rules.NoShadowingOrOverridesOnMethodsRule$1.evaluate(NoShadowingOrOverridesOnMethodsRule.java:40)
	at com.carrotsearch.randomizedtesting.rules.NoShadowingOrOverridesOnMethodsRule$1.evaluate(NoShadowingOrOverridesOnMethodsRule.java:40)
	at com.carrotsearch.randomizedtesting.rules.StatementAdapter.evaluate(StatementAdapter.java:36)
	at com.carrotsearch.randomizedtesting.rules.StatementAdapter.evaluate(StatementAdapter.java:36)
	at com.carrotsearch.randomizedtesting.rules.StatementAdapter.evaluate(StatementAdapter.java:36)
	at org.apache.lucene.util.TestRuleAssertionsRequired$1.evaluate(TestRuleAssertionsRequired.java:53)
	at org.apache.lucene.util.TestRuleMarkFailure$1.evaluate(TestRuleMarkFailure.java:47)
	at org.apache.lucene.util.TestRuleIgnoreAfterMaxFailures$1.evaluate(TestRuleIgnoreAfterMaxFailures.java:64)
	at org.apache.lucene.util.TestRuleIgnoreTestSuites$1.evaluate(TestRuleIgnoreTestSuites.java:54)
	at com.carrotsearch.randomizedtesting.rules.StatementAdapter.evaluate(StatementAdapter.java:36)
	at com.carrotsearch.randomizedtesting.ThreadLeakControl$StatementRunner.run(ThreadLeakControl.java:368)
	at java.lang.Thread.run(Thread.java:748)


FAILED:  org.apache.solr.handler.TestSQLHandler.doTest

Error Message:
--> https://127.0.0.1:50242/collection1_shard2_replica_n0:Failed to execute sqlQuery 'select Str_s, sum(Field_i) from collection1 where id='(1 8)' group by Str_s having (sum(Field_i) = 7 OR sum(Field_i) = 60) order by sum(Field_i) desc' against JDBC connection 'jdbc:calcitesolr:'. Error while executing SQL "select Str_s, sum(Field_i) from collection1 where id='(1 8)' group by Str_s having (sum(Field_i) = 7 OR sum(Field_i) = 60) order by sum(Field_i) desc": java.io.IOException: org.apache.solr.client.solrj.SolrServerException: No live SolrServers available to handle this request:[https://127.0.0.1:50242/collection1, https://127.0.0.1:50252/collection1, https://127.0.0.1:50279/collection1, https://127.0.0.1:50265/collection1]

Stack Trace:
java.io.IOException: --> https://127.0.0.1:50242/collection1_shard2_replica_n0:Failed to execute sqlQuery 'select Str_s, sum(Field_i) from collection1 where id='(1 8)' group by Str_s having (sum(Field_i) = 7 OR sum(Field_i) = 60) order by sum(Field_i) desc' against JDBC connection 'jdbc:calcitesolr:'.
Error while executing SQL "select Str_s, sum(Field_i) from collection1 where id='(1 8)' group by Str_s having (sum(Field_i) = 7 OR sum(Field_i) = 60) order by sum(Field_i) desc": java.io.IOException: org.apache.solr.client.solrj.SolrServerException: No live SolrServers available to handle this request:[https://127.0.0.1:50242/collection1, https://127.0.0.1:50252/collection1, https://127.0.0.1:50279/collection1, https://127.0.0.1:50265/collection1]
	at __randomizedtesting.SeedInfo.seed([19A3076A21894501:BEE7BFCE4C3256B8]:0)
	at org.apache.solr.client.solrj.io.stream.SolrStream.read(SolrStream.java:219)
	at org.apache.solr.handler.TestSQLHandler.getTuples(TestSQLHandler.java:2527)
	at org.apache.solr.handler.TestSQLHandler.testMixedCaseFields(TestSQLHandler.java:560)
	at org.apache.solr.handler.TestSQLHandler.doTest(TestSQLHandler.java:89)
	at sun.reflect.NativeMethodAccessorImpl.invoke0(Native Method)
	at sun.reflect.NativeMethodAccessorImpl.invoke(NativeMethodAccessorImpl.java:62)
	at sun.reflect.DelegatingMethodAccessorImpl.invoke(DelegatingMethodAccessorImpl.java:43)
	at java.lang.reflect.Method.invoke(Method.java:498)
	at com.carrotsearch.randomizedtesting.RandomizedRunner.invoke(RandomizedRunner.java:1713)
	at com.carrotsearch.randomizedtesting.RandomizedRunner$8.evaluate(RandomizedRunner.java:907)
	at com.carrotsearch.randomizedtesting.RandomizedRunner$9.evaluate(RandomizedRunner.java:943)
	at com.carrotsearch.randomizedtesting.RandomizedRunner$10.evaluate(RandomizedRunner.java:957)
	at org.apache.solr.BaseDistributedSearchTestCase$ShardsRepeatRule$ShardsFixedStatement.callStatement(BaseDistributedSearchTestCase.java:985)
	at org.apache.solr.BaseDistributedSearchTestCase$ShardsRepeatRule$ShardsStatement.evaluate(BaseDistributedSearchTestCase.java:960)
	at com.carrotsearch.randomizedtesting.rules.SystemPropertiesRestoreRule$1.evaluate(SystemPropertiesRestoreRule.java:57)
	at org.apache.lucene.util.TestRuleSetupTeardownChained$1.evaluate(TestRuleSetupTeardownChained.java:49)
	at org.apache.lucene.util.AbstractBeforeAfterRule$1.evaluate(AbstractBeforeAfterRule.java:45)
	at org.apache.lucene.util.TestRuleThreadAndTestName$1.evaluate(TestRuleThreadAndTestName.java:48)
	at org.apache.lucene.util.TestRuleIgnoreAfterMaxFailures$1.evaluate(TestRuleIgnoreAfterMaxFailures.java:64)
	at org.apache.lucene.util.TestRuleMarkFailure$1.evaluate(TestRuleMarkFailure.java:47)
	at com.carrotsearch.randomizedtesting.rules.StatementAdapter.evaluate(StatementAdapter.java:36)
	at com.carrotsearch.randomizedtesting.ThreadLeakControl$StatementRunner.run(ThreadLeakControl.java:368)
	at com.carrotsearch.randomizedtesting.ThreadLeakControl.forkTimeoutingTask(ThreadLeakControl.java:817)
	at com.carrotsearch.randomizedtesting.ThreadLeakControl$3.evaluate(ThreadLeakControl.java:468)
	at com.carrotsearch.randomizedtesting.RandomizedRunner.runSingleTest(RandomizedRunner.java:916)
	at com.carrotsearch.randomizedtesting.RandomizedRunner$5.evaluate(RandomizedRunner.java:802)
	at com.carrotsearch.randomizedtesting.RandomizedRunner$6.evaluate(RandomizedRunner.java:852)
	at com.carrotsearch.randomizedtesting.RandomizedRunner$7.evaluate(RandomizedRunner.java:863)
	at com.carrotsearch.randomizedtesting.rules.StatementAdapter.evaluate(StatementAdapter.java:36)
	at com.carrotsearch.randomizedtesting.rules.SystemPropertiesRestoreRule$1.evaluate(SystemPropertiesRestoreRule.java:57)
	at org.apache.lucene.util.AbstractBeforeAfterRule$1.evaluate(AbstractBeforeAfterRule.java:45)
	at com.carrotsearch.randomizedtesting.rules.StatementAdapter.evaluate(StatementAdapter.java:36)
	at org.apache.lucene.util.TestRuleStoreClassName$1.evaluate(TestRuleStoreClassName.java:41)
	at com.carrotsearch.randomizedtesting.rules.NoShadowingOrOverridesOnMethodsRule$1.evaluate(NoShadowingOrOverridesOnMethodsRule.java:40)
	at com.carrotsearch.randomizedtesting.rules.NoShadowingOrOverridesOnMethodsRule$1.evaluate(NoShadowingOrOverridesOnMethodsRule.java:40)
	at com.carrotsearch.randomizedtesting.rules.StatementAdapter.evaluate(StatementAdapter.java:36)
	at com.carrotsearch.randomizedtesting.rules.StatementAdapter.evaluate(StatementAdapter.java:36)
	at com.carrotsearch.randomizedtesting.rules.StatementAdapter.evaluate(StatementAdapter.java:36)
	at org.apache.lucene.util.TestRuleAssertionsRequired$1.evaluate(TestRuleAssertionsRequired.java:53)
	at org.apache.lucene.util.TestRuleMarkFailure$1.evaluate(TestRuleMarkFailure.java:47)
	at org.apache.lucene.util.TestRuleIgnoreAfterMaxFailures$1.evaluate(TestRuleIgnoreAfterMaxFailures.java:64)
	at org.apache.lucene.util.TestRuleIgnoreTestSuites$1.evaluate(TestRuleIgnoreTestSuites.java:54)
	at com.carrotsearch.randomizedtesting.rules.StatementAdapter.evaluate(StatementAdapter.java:36)
	at com.carrotsearch.randomizedtesting.ThreadLeakControl$StatementRunner.run(ThreadLeakControl.java:368)
	at java.lang.Thread.run(Thread.java:748)


FAILED:  junit.framework.TestSuite.org.apache.solr.handler.TestSQLHandler

Error Message:
1 thread leaked from SUITE scope at org.apache.solr.handler.TestSQLHandler:     1) Thread[id=29379, name=Connection evictor, state=TIMED_WAITING, group=TGRP-TestSQLHandler]         at java.lang.Thread.sleep(Native Method)         at org.apache.http.impl.client.IdleConnectionEvictor$1.run(IdleConnectionEvictor.java:66)         at java.lang.Thread.run(Thread.java:748)

Stack Trace:
com.carrotsearch.randomizedtesting.ThreadLeakError: 1 thread leaked from SUITE scope at org.apache.solr.handler.TestSQLHandler: 
   1) Thread[id=29379, name=Connection evictor, state=TIMED_WAITING, group=TGRP-TestSQLHandler]
        at java.lang.Thread.sleep(Native Method)
        at org.apache.http.impl.client.IdleConnectionEvictor$1.run(IdleConnectionEvictor.java:66)
        at java.lang.Thread.run(Thread.java:748)
	at __randomizedtesting.SeedInfo.seed([19A3076A21894501]:0)


FAILED:  org.apache.solr.handler.component.SpatialHeatmapFacetsTest.test

Error Message:
Error from server at http://127.0.0.1:50609//collection1: Error from server at http://127.0.0.1:50609//collection1: Expected mime type application/octet-stream but got text/html. <html> <head> <meta http-equiv="Content-Type" content="text/html;charset=ISO-8859-1"/> <title>Error 500 </title> </head> <body> <h2>HTTP ERROR: 500</h2> <p>Problem accessing /collection1/select. Reason: <pre>    java.lang.NoClassDefFoundError: org/apache/solr/search/SolrIndexSearcher$6</pre></p> <hr /><a href="http://eclipse.org/jetty">Powered by Jetty:// 9.3.14.v20161028</a><hr/> </body> </html> 

Stack Trace:
org.apache.solr.client.solrj.impl.HttpSolrClient$RemoteSolrException: Error from server at http://127.0.0.1:50609//collection1: Error from server at http://127.0.0.1:50609//collection1: Expected mime type application/octet-stream but got text/html. <html>
<head>
<meta http-equiv="Content-Type" content="text/html;charset=ISO-8859-1"/>
<title>Error 500 </title>
</head>
<body>
<h2>HTTP ERROR: 500</h2>
<p>Problem accessing /collection1/select. Reason:
<pre>    java.lang.NoClassDefFoundError: org/apache/solr/search/SolrIndexSearcher$6</pre></p>
<hr /><a href="http://eclipse.org/jetty">Powered by Jetty:// 9.3.14.v20161028</a><hr/>
</body>
</html>

	at __randomizedtesting.SeedInfo.seed([19A3076A21894501:91F738B08F7528F9]:0)
	at org.apache.solr.client.solrj.impl.HttpSolrClient.executeMethod(HttpSolrClient.java:626)
	at org.apache.solr.client.solrj.impl.HttpSolrClient.request(HttpSolrClient.java:252)
	at org.apache.solr.client.solrj.impl.HttpSolrClient.request(HttpSolrClient.java:241)
	at org.apache.solr.client.solrj.SolrRequest.process(SolrRequest.java:178)
	at org.apache.solr.client.solrj.SolrClient.query(SolrClient.java:942)
	at org.apache.solr.client.solrj.SolrClient.query(SolrClient.java:957)
	at org.apache.solr.BaseDistributedSearchTestCase.queryServer(BaseDistributedSearchTestCase.java:557)
	at org.apache.solr.BaseDistributedSearchTestCase.query(BaseDistributedSearchTestCase.java:605)
	at org.apache.solr.BaseDistributedSearchTestCase.query(BaseDistributedSearchTestCase.java:574)
	at org.apache.solr.handler.component.SpatialHeatmapFacetsTest.test(SpatialHeatmapFacetsTest.java:72)
	at sun.reflect.NativeMethodAccessorImpl.invoke0(Native Method)
	at sun.reflect.NativeMethodAccessorImpl.invoke(NativeMethodAccessorImpl.java:62)
	at sun.reflect.DelegatingMethodAccessorImpl.invoke(DelegatingMethodAccessorImpl.java:43)
	at java.lang.reflect.Method.invoke(Method.java:498)
	at com.carrotsearch.randomizedtesting.RandomizedRunner.invoke(RandomizedRunner.java:1713)
	at com.carrotsearch.randomizedtesting.RandomizedRunner$8.evaluate(RandomizedRunner.java:907)
	at com.carrotsearch.randomizedtesting.RandomizedRunner$9.evaluate(RandomizedRunner.java:943)
	at com.carrotsearch.randomizedtesting.RandomizedRunner$10.evaluate(RandomizedRunner.java:957)
	at org.apache.solr.BaseDistributedSearchTestCase$ShardsRepeatRule$ShardsRepeatStatement.callStatement(BaseDistributedSearchTestCase.java:1011)
	at org.apache.solr.BaseDistributedSearchTestCase$ShardsRepeatRule$ShardsStatement.evaluate(BaseDistributedSearchTestCase.java:960)
	at com.carrotsearch.randomizedtesting.rules.SystemPropertiesRestoreRule$1.evaluate(SystemPropertiesRestoreRule.java:57)
	at org.apache.lucene.util.TestRuleSetupTeardownChained$1.evaluate(TestRuleSetupTeardownChained.java:49)
	at org.apache.lucene.util.AbstractBeforeAfterRule$1.evaluate(AbstractBeforeAfterRule.java:45)
	at org.apache.lucene.util.TestRuleThreadAndTestName$1.evaluate(TestRuleThreadAndTestName.java:48)
	at org.apache.lucene.util.TestRuleIgnoreAfterMaxFailures$1.evaluate(TestRuleIgnoreAfterMaxFailures.java:64)
	at org.apache.lucene.util.TestRuleMarkFailure$1.evaluate(TestRuleMarkFailure.java:47)
	at com.carrotsearch.randomizedtesting.rules.StatementAdapter.evaluate(StatementAdapter.java:36)
	at com.carrotsearch.randomizedtesting.ThreadLeakControl$StatementRunner.run(ThreadLeakControl.java:368)
	at com.carrotsearch.randomizedtesting.ThreadLeakControl.forkTimeoutingTask(ThreadLeakControl.java:817)
	at com.carrotsearch.randomizedtesting.ThreadLeakControl$3.evaluate(ThreadLeakControl.java:468)
	at com.carrotsearch.randomizedtesting.RandomizedRunner.runSingleTest(RandomizedRunner.java:916)
	at com.carrotsearch.randomizedtesting.RandomizedRunner$5.evaluate(RandomizedRunner.java:802)
	at com.carrotsearch.randomizedtesting.RandomizedRunner$6.evaluate(RandomizedRunner.java:852)
	at com.carrotsearch.randomizedtesting.RandomizedRunner$7.evaluate(RandomizedRunner.java:863)
	at com.carrotsearch.randomizedtesting.rules.StatementAdapter.evaluate(StatementAdapter.java:36)
	at com.carrotsearch.randomizedtesting.rules.SystemPropertiesRestoreRule$1.evaluate(SystemPropertiesRestoreRule.java:57)
	at org.apache.lucene.util.AbstractBeforeAfterRule$1.evaluate(AbstractBeforeAfterRule.java:45)
	at com.carrotsearch.randomizedtesting.rules.StatementAdapter.evaluate(StatementAdapter.java:36)
	at org.apache.lucene.util.TestRuleStoreClassName$1.evaluate(TestRuleStoreClassName.java:41)
	at com.carrotsearch.randomizedtesting.rules.NoShadowingOrOverridesOnMethodsRule$1.evaluate(NoShadowingOrOverridesOnMethodsRule.java:40)
	at com.carrotsearch.randomizedtesting.rules.NoShadowingOrOverridesOnMethodsRule$1.evaluate(NoShadowingOrOverridesOnMethodsRule.java:40)
	at com.carrotsearch.randomizedtesting.rules.StatementAdapter.evaluate(StatementAdapter.java:36)
	at com.carrotsearch.randomizedtesting.rules.StatementAdapter.evaluate(StatementAdapter.java:36)
	at com.carrotsearch.randomizedtesting.rules.StatementAdapter.evaluate(StatementAdapter.java:36)
	at org.apache.lucene.util.TestRuleAssertionsRequired$1.evaluate(TestRuleAssertionsRequired.java:53)
	at org.apache.lucene.util.TestRuleMarkFailure$1.evaluate(TestRuleMarkFailure.java:47)
	at org.apache.lucene.util.TestRuleIgnoreAfterMaxFailures$1.evaluate(TestRuleIgnoreAfterMaxFailures.java:64)
	at org.apache.lucene.util.TestRuleIgnoreTestSuites$1.evaluate(TestRuleIgnoreTestSuites.java:54)
	at com.carrotsearch.randomizedtesting.rules.StatementAdapter.evaluate(StatementAdapter.java:36)
	at com.carrotsearch.randomizedtesting.ThreadLeakControl$StatementRunner.run(ThreadLeakControl.java:368)
	at java.lang.Thread.run(Thread.java:748)




Build Log:
[...truncated 12379 lines...]
   [junit4] Suite: org.apache.solr.cloud.DocValuesNotIndexedTest
   [junit4]   2> Creating dataDir: /Users/jenkins/workspace/Lucene-Solr-master-MacOSX/solr/build/solr-core/test/J0/temp/solr.cloud.DocValuesNotIndexedTest_19A3076A21894501-001/init-core-data-001
   [junit4]   2> 2206601 WARN  (SUITE-DocValuesNotIndexedTest-seed#[19A3076A21894501]-worker) [    ] o.a.s.SolrTestCaseJ4 startTrackingSearchers: numOpens=102 numCloses=102
   [junit4]   2> 2206601 INFO  (SUITE-DocValuesNotIndexedTest-seed#[19A3076A21894501]-worker) [    ] o.a.s.SolrTestCaseJ4 Using PointFields (NUMERIC_POINTS_SYSPROP=true) w/NUMERIC_DOCVALUES_SYSPROP=true
   [junit4]   2> 2206604 INFO  (SUITE-DocValuesNotIndexedTest-seed#[19A3076A21894501]-worker) [    ] o.a.s.SolrTestCaseJ4 Randomized ssl (false) and clientAuth (false) via: @org.apache.solr.util.RandomizeSSL(reason=, value=NaN, ssl=NaN, clientAuth=NaN) w/ MAC_OS_X supressed clientAuth
   [junit4]   2> 2206604 INFO  (SUITE-DocValuesNotIndexedTest-seed#[19A3076A21894501]-worker) [    ] o.a.s.c.MiniSolrCloudCluster Starting cluster of 2 servers in /Users/jenkins/workspace/Lucene-Solr-master-MacOSX/solr/build/solr-core/test/J0/temp/solr.cloud.DocValuesNotIndexedTest_19A3076A21894501-001/tempDir-001
   [junit4]   2> 2206605 INFO  (SUITE-DocValuesNotIndexedTest-seed#[19A3076A21894501]-worker) [    ] o.a.s.c.ZkTestServer STARTING ZK TEST SERVER
   [junit4]   2> 2206605 INFO  (Thread-3520) [    ] o.a.s.c.ZkTestServer client port:0.0.0.0/0.0.0.0:0
   [junit4]   2> 2206605 INFO  (Thread-3520) [    ] o.a.s.c.ZkTestServer Starting server
   [junit4]   2> 2206607 ERROR (Thread-3520) [    ] o.a.z.s.ZooKeeperServer ZKShutdownHandler is not registered, so ZooKeeper server won't take any action on ERROR or SHUTDOWN server state changes
   [junit4]   2> 2206710 INFO  (SUITE-DocValuesNotIndexedTest-seed#[19A3076A21894501]-worker) [    ] o.a.s.c.ZkTestServer start zk server on port:63510
   [junit4]   2> 2206758 INFO  (jetty-launcher-3633-thread-1) [    ] o.e.j.s.Server jetty-9.3.14.v20161028
   [junit4]   2> 2206759 INFO  (jetty-launcher-3633-thread-2) [    ] o.e.j.s.Server jetty-9.3.14.v20161028
   [junit4]   2> 2206778 INFO  (jetty-launcher-3633-thread-1) [    ] o.e.j.s.h.ContextHandler Started o.e.j.s.ServletContextHandler@18ceef92{/solr,null,AVAILABLE}
   [junit4]   2> 2206778 INFO  (jetty-launcher-3633-thread-2) [    ] o.e.j.s.h.ContextHandler Started o.e.j.s.ServletContextHandler@ca28486{/solr,null,AVAILABLE}
   [junit4]   2> 2206783 INFO  (jetty-launcher-3633-thread-1) [    ] o.e.j.s.AbstractConnector Started ServerConnector@61d6a7f6{HTTP/1.1,[http/1.1]}{127.0.0.1:63512}
   [junit4]   2> 2206783 INFO  (jetty-launcher-3633-thread-2) [    ] o.e.j.s.AbstractConnector Started ServerConnector@5bdc25e8{HTTP/1.1,[http/1.1]}{127.0.0.1:63513}
   [junit4]   2> 2206783 INFO  (jetty-launcher-3633-thread-1) [    ] o.e.j.s.Server Started @2211807ms
   [junit4]   2> 2206783 INFO  (jetty-launcher-3633-thread-2) [    ] o.e.j.s.Server Started @2211807ms
   [junit4]   2> 2206783 INFO  (jetty-launcher-3633-thread-1) [    ] o.a.s.c.s.e.JettySolrRunner Jetty properties: {hostContext=/solr, hostPort=63512}
   [junit4]   2> 2206783 INFO  (jetty-launcher-3633-thread-2) [    ] o.a.s.c.s.e.JettySolrRunner Jetty properties: {hostContext=/solr, hostPort=63513}
   [junit4]   2> 2206783 ERROR (jetty-launcher-3633-thread-1) [    ] o.a.s.s.StartupLoggingUtils Missing Java Option solr.log.dir. Logging may be missing or incomplete.
   [junit4]   2> 2206783 ERROR (jetty-launcher-3633-thread-2) [    ] o.a.s.s.StartupLoggingUtils Missing Java Option solr.log.dir. Logging may be missing or incomplete.
   [junit4]   2> 2206783 INFO  (jetty-launcher-3633-thread-1) [    ] o.a.s.s.SolrDispatchFilter  ___      _       Welcome to Apache Solr? version 8.0.0
   [junit4]   2> 2206783 INFO  (jetty-launcher-3633-thread-1) [    ] o.a.s.s.SolrDispatchFilter / __| ___| |_ _   Starting in cloud mode on port null
   [junit4]   2> 2206784 INFO  (jetty-launcher-3633-thread-2) [    ] o.a.s.s.SolrDispatchFilter  ___      _       Welcome to Apache Solr? version 8.0.0
   [junit4]   2> 2206784 INFO  (jetty-launcher-3633-thread-1) [    ] o.a.s.s.SolrDispatchFilter \__ \/ _ \ | '_|  Install dir: null, Default config dir: null
   [junit4]   2> 2206784 INFO  (jetty-launcher-3633-thread-1) [    ] o.a.s.s.SolrDispatchFilter |___/\___/_|_|    Start time: 2017-07-04T08:19:45.761Z
   [junit4]   2> 2206784 INFO  (jetty-launcher-3633-thread-2) [    ] o.a.s.s.SolrDispatchFilter / __| ___| |_ _   Starting in cloud mode on port null
   [junit4]   2> 2206784 INFO  (jetty-launcher-3633-thread-2) [    ] o.a.s.s.SolrDispatchFilter \__ \/ _ \ | '_|  Install dir: null, Default config dir: null
   [junit4]   2> 2206784 INFO  (jetty-launcher-3633-thread-2) [    ] o.a.s.s.SolrDispatchFilter |___/\___/_|_|    Start time: 2017-07-04T08:19:45.761Z
   [junit4]   2> 2206788 INFO  (jetty-launcher-3633-thread-1) [    ] o.a.s.s.SolrDispatchFilter solr.xml found in ZooKeeper. Loading...
   [junit4]   2> 2206788 INFO  (jetty-launcher-3633-thread-2) [    ] o.a.s.s.SolrDispatchFilter solr.xml found in ZooKeeper. Loading...
   [junit4]   2> 2206801 WARN  (NIOServerCxn.Factory:0.0.0.0/0.0.0.0:0) [    ] o.a.z.s.NIOServerCnxn caught end of stream exception
   [junit4]   2> EndOfStreamException: Unable to read additional data from client sessionid 0x15d0caf0f2f0002, likely client has closed socket
   [junit4]   2> 	at org.apache.zookeeper.server.NIOServerCnxn.doIO(NIOServerCnxn.java:239)
   [junit4]   2> 	at org.apache.zookeeper.server.NIOServerCnxnFactory.run(NIOServerCnxnFactory.java:203)
   [junit4]   2> 	at java.lang.Thread.run(Thread.java:748)
   [junit4]   2> 2206802 WARN  (NIOServerCxn.Factory:0.0.0.0/0.0.0.0:0) [    ] o.a.z.s.NIOServerCnxn caught end of stream exception
   [junit4]   2> EndOfStreamException: Unable to read additional data from client sessionid 0x15d0caf0f2f0001, likely client has closed socket
   [junit4]   2> 	at org.apache.zookeeper.server.NIOServerCnxn.doIO(NIOServerCnxn.java:239)
   [junit4]   2> 	at org.apache.zookeeper.server.NIOServerCnxnFactory.run(NIOServerCnxnFactory.java:203)
   [junit4]   2> 	at java.lang.Thread.run(Thread.java:748)
   [junit4]   2> 2206804 INFO  (jetty-launcher-3633-thread-2) [    ] o.a.s.c.ZkContainer Zookeeper client=127.0.0.1:63510/solr
   [junit4]   2> 2206805 INFO  (jetty-launcher-3633-thread-1) [    ] o.a.s.c.ZkContainer Zookeeper client=127.0.0.1:63510/solr
   [junit4]   2> 2206808 WARN  (NIOServerCxn.Factory:0.0.0.0/0.0.0.0:0) [    ] o.a.z.s.NIOServerCnxn caught end of stream exception
   [junit4]   2> EndOfStreamException: Unable to read additional data from client sessionid 0x15d0caf0f2f0003, likely client has closed socket
   [junit4]   2> 	at org.apache.zookeeper.server.NIOServerCnxn.doIO(NIOServerCnxn.java:239)
   [junit4]   2> 	at org.apache.zookeeper.server.NIOServerCnxnFactory.run(NIOServerCnxnFactory.java:203)
   [junit4]   2> 	at java.lang.Thread.run(Thread.java:748)
   [junit4]   2> 2206810 WARN  (NIOServerCxn.Factory:0.0.0.0/0.0.0.0:0) [    ] o.a.z.s.NIOServerCnxn caught end of stream exception
   [junit4]   2> EndOfStreamException: Unable to read additional data from client sessionid 0x15d0caf0f2f0004, likely client has closed socket
   [junit4]   2> 	at org.apache.zookeeper.server.NIOServerCnxn.doIO(NIOServerCnxn.java:239)
   [junit4]   2> 	at org.apache.zookeeper.server.NIOServerCnxnFactory.run(NIOServerCnxnFactory.java:203)
   [junit4]   2> 	at java.lang.Thread.run(Thread.java:748)
   [junit4]   2> 2206978 INFO  (jetty-launcher-3633-thread-2) [n:127.0.0.1:63513_solr    ] o.a.s.c.Overseer Overseer (id=null) closing
   [junit4]   2> 2206978 INFO  (jetty-launcher-3633-thread-1) [n:127.0.0.1:63512_solr    ] o.a.s.c.Overseer Overseer (id=null) closing
   [junit4]   2> 2206979 INFO  (jetty-launcher-3633-thread-2) [n:127.0.0.1:63513_solr    ] o.a.s.c.OverseerElectionContext I am going to be the leader 127.0.0.1:63513_solr
   [junit4]   2> 2206980 INFO  (jetty-launcher-3633-thread-1) [n:127.0.0.1:63512_solr    ] o.a.s.c.ZkController Register node as live in ZooKeeper:/live_nodes/127.0.0.1:63512_solr
   [junit4]   2> 2206980 INFO  (jetty-launcher-3633-thread-2) [n:127.0.0.1:63513_solr    ] o.a.s.c.Overseer Overseer (id=98248712885567493-127.0.0.1:63513_solr-n_0000000000) starting
   [junit4]   2> 2206981 INFO  (zkCallback-3645-thread-1-processing-n:127.0.0.1:63512_solr) [n:127.0.0.1:63512_solr    ] o.a.s.c.c.ZkStateReader Updated live nodes from ZooKeeper... (0) -> (1)
   [junit4]   2> 2206981 INFO  (zkCallback-3644-thread-1-processing-n:127.0.0.1:63513_solr) [n:127.0.0.1:63513_solr    ] o.a.s.c.c.ZkStateReader Updated live nodes from ZooKeeper... (0) -> (1)
   [junit4]   2> 2206995 INFO  (jetty-launcher-3633-thread-2) [n:127.0.0.1:63513_solr    ] o.a.s.c.ZkController Register node as live in ZooKeeper:/live_nodes/127.0.0.1:63513_solr
   [junit4]   2> 2206997 INFO  (zkCallback-3645-thread-1-processing-n:127.0.0.1:63512_solr) [n:127.0.0.1:63512_solr    ] o.a.s.c.c.ZkStateReader Updated live nodes from ZooKeeper... (1) -> (2)
   [junit4]   2> 2206997 INFO  (zkCallback-3644-thread-1-processing-n:127.0.0.1:63513_solr) [n:127.0.0.1:63513_solr    ] o.a.s.c.c.ZkStateReader Updated live nodes from ZooKeeper... (1) -> (2)
   [junit4]   2> 2207094 INFO  (jetty-launcher-3633-thread-1) [n:127.0.0.1:63512_solr    ] o.a.s.m.r.SolrJmxReporter JMX monitoring for 'solr_63512.solr.node' (registry 'solr.node') enabled at server: com.sun.jmx.mbeanserver.JmxMBeanServer@1337c0ff
   [junit4]   2> 2207094 INFO  (jetty-launcher-3633-thread-2) [n:127.0.0.1:63513_solr    ] o.a.s.m.r.SolrJmxReporter JMX monitoring for 'solr_63513.solr.node' (registry 'solr.node') enabled at server: com.sun.jmx.mbeanserver.JmxMBeanServer@1337c0ff
   [junit4]   2> 2207096 INFO  (jetty-launcher-3633-thread-1) [n:127.0.0.1:63512_solr    ] o.a.s.m.r.SolrJmxReporter JMX monitoring for 'solr_63512.solr.jvm' (registry 'solr.jvm') enabled at server: com.sun.jmx.mbeanserver.JmxMBeanServer@1337c0ff
   [junit4]   2> 2207096 INFO  (jetty-launcher-3633-thread-1) [n:127.0.0.1:63512_solr    ] o.a.s.m.r.SolrJmxReporter JMX monitoring for 'solr_63512.solr.jetty' (registry 'solr.jetty') enabled at server: com.sun.jmx.mbeanserver.JmxMBeanServer@1337c0ff
   [junit4]   2> 2207096 INFO  (jetty-launcher-3633-thread-2) [n:127.0.0.1:63513_solr    ] o.a.s.m.r.SolrJmxReporter JMX monitoring for 'solr_63513.solr.jvm' (registry 'solr.jvm') enabled at server: com.sun.jmx.mbeanserver.JmxMBeanServer@1337c0ff
   [junit4]   2> 2207096 INFO  (jetty-launcher-3633-thread-2) [n:127.0.0.1:63513_solr    ] o.a.s.m.r.SolrJmxReporter JMX monitoring for 'solr_63513.solr.jetty' (registry 'solr.jetty') enabled at server: com.sun.jmx.mbeanserver.JmxMBeanServer@1337c0ff
   [junit4]   2> 2207097 INFO  (jetty-launcher-3633-thread-1) [n:127.0.0.1:63512_solr    ] o.a.s.c.CorePropertiesLocator Found 0 core definitions underneath /Users/jenkins/workspace/Lucene-Solr-master-MacOSX/solr/build/solr-core/test/J0/temp/solr.cloud.DocValuesNotIndexedTest_19A3076A21894501-001/tempDir-001/node1/.
   [junit4]   2> 2207097 INFO  (jetty-launcher-3633-thread-2) [n:127.0.0.1:63513_solr    ] o.a.s.c.CorePropertiesLocator Found 0 core definitions underneath /Users/jenkins/workspace/Lucene-Solr-master-MacOSX/solr/build/solr-core/test/J0/temp/solr.cloud.DocValuesNotIndexedTest_19A3076A21894501-001/tempDir-001/node2/.
   [junit4]   2> 2207129 INFO  (SUITE-DocValuesNotIndexedTest-seed#[19A3076A21894501]-worker) [    ] o.a.s.c.c.ZkStateReader Updated live nodes from ZooKeeper... (0) -> (2)
   [junit4]   2> 2207131 INFO  (SUITE-DocValuesNotIndexedTest-seed#[19A3076A21894501]-worker) [    ] o.a.s.c.s.i.ZkClientClusterStateProvider Cluster at 127.0.0.1:63510/solr ready
   [junit4]   2> 2207138 INFO  (qtp426833501-20491) [n:127.0.0.1:63513_solr    ] o.a.s.h.a.CollectionsHandler Invoked Collection Action :create with params replicationFactor=1&collection.configName=conf1&maxShardsPerNode=2&name=dv_coll&nrtReplicas=1&action=CREATE&numShards=4&wt=javabin&version=2 and sendToOCPQueue=true
   [junit4]   2> 2207141 INFO  (OverseerThreadFactory-7309-thread-1-processing-n:127.0.0.1:63513_solr) [n:127.0.0.1:63513_solr    ] o.a.s.c.CreateCollectionCmd Create collection dv_coll
   [junit4]   2> 2207254 INFO  (OverseerStateUpdate-98248712885567493-127.0.0.1:63513_solr-n_0000000000) [n:127.0.0.1:63513_solr    ] o.a.s.c.o.SliceMutator createReplica() {
   [junit4]   2>   "operation":"ADDREPLICA",
   [junit4]   2>   "collection":"dv_coll",
   [junit4]   2>   "shard":"shard1",
   [junit4]   2>   "core":"dv_coll_shard1_replica_n1",
   [junit4]   2>   "state":"down",
   [junit4]   2>   "base_url":"http://127.0.0.1:63513/solr",
   [junit4]   2>   "type":"NRT"} 
   [junit4]   2> 2207257 INFO  (OverseerStateUpdate-98248712885567493-127.0.0.1:63513_solr-n_0000000000) [n:127.0.0.1:63513_solr    ] o.a.s.c.o.SliceMutator createReplica() {
   [junit4]   2>   "operation":"ADDREPLICA",
   [junit4]   2>   "collection":"dv_coll",
   [junit4]   2>   "shard":"shard2",
   [junit4]   2>   "core":"dv_coll_shard2_replica_n1",
   [junit4]   2>   "state":"down",
   [junit4]   2>   "base_url":"http://127.0.0.1:63512/solr",
   [junit4]   2>   "type":"NRT"} 
   [junit4]   2> 2207262 INFO  (OverseerStateUpdate-98248712885567493-127.0.0.1:63513_solr-n_0000000000) [n:127.0.0.1:63513_solr    ] o.a.s.c.o.SliceMutator createReplica() {
   [junit4]   2>   "operation":"ADDREPLICA",
   [junit4]   2>   "collection":"dv_coll",
   [junit4]   2>   "shard":"shard3",
   [junit4]   2>   "core":"dv_coll_shard3_replica_n1",
   [junit4]   2>   "state":"down",
   [junit4]   2>   "base_url":"http://127.0.0.1:63513/solr",
   [junit4]   2>   "type":"NRT"} 
   [junit4]   2> 2207265 INFO  (OverseerStateUpdate-98248712885567493-127.0.0.1:63513_solr-n_0000000000) [n:127.0.0.1:63513_solr    ] o.a.s.c.o.SliceMutator createReplica() {
   [junit4]   2>   "operation":"ADDREPLICA",
   [junit4]   2>   "collection":"dv_coll",
   [junit4]   2>   "shard":"shard4",
   [junit4]   2>   "core":"dv_coll_shard4_replica_n1",
   [junit4]   2>   "state":"down",
   [junit4]   2>   "base_url":"http://127.0.0.1:63512/solr",
   [junit4]   2>   "type":"NRT"} 
   [junit4]   2> 2207475 INFO  (qtp426833501-20492) [n:127.0.0.1:63513_solr    ] o.a.s.h.a.CoreAdminOperation core create command qt=/admin/cores&coreNodeName=core_node1&collection.configName=conf1&newCollection=true&name=dv_coll_shard1_replica_n1&action=CREATE&numShards=4&collection=dv_coll&shard=shard1&wt=javabin&version=2&replicaType=NRT
   [junit4]   2> 2207476 INFO  (qtp426833501-20493) [n:127.0.0.1:63513_solr    ] o.a.s.h.a.CoreAdminOperation core create command qt=/admin/cores&coreNodeName=core_node3&collection.configName=conf1&newCollection=true&name=dv_coll_shard3_replica_n1&action=CREATE&numShards=4&collection=dv_coll&shard=shard3&wt=javabin&version=2&replicaType=NRT
   [junit4]   2> 2207476 INFO  (qtp1314606546-20495) [n:127.0.0.1:63512_solr    ] o.a.s.h.a.CoreAdminOperation core create command qt=/admin/cores&coreNodeName=core_node4&collection.configName=conf1&newCollection=true&name=dv_coll_shard4_replica_n1&action=CREATE&numShards=4&collection=dv_coll&shard=shard4&wt=javabin&version=2&replicaType=NRT
   [junit4]   2> 2207476 INFO  (qtp426833501-20492) [n:127.0.0.1:63513_solr    ] o.a.s.c.TransientSolrCoreCacheDefault Allocating transient cache for 2147483647 transient cores
   [junit4]   2> 2207477 INFO  (qtp1314606546-20496) [n:127.0.0.1:63512_solr    ] o.a.s.h.a.CoreAdminOperation core create command qt=/admin/cores&coreNodeName=core_node2&collection.configName=conf1&newCollection=true&name=dv_coll_shard2_replica_n1&action=CREATE&numShards=4&collection=dv_coll&shard=shard2&wt=javabin&version=2&replicaType=NRT
   [junit4]   2> 2207477 INFO  (qtp1314606546-20495) [n:127.0.0.1:63512_solr    ] o.a.s.c.TransientSolrCoreCacheDefault Allocating transient cache for 2147483647 transient cores
   [junit4]   2> 2207617 INFO  (zkCallback-3644-thread-2-processing-n:127.0.0.1:63513_solr) [n:127.0.0.1:63513_solr    ] o.a.s.c.c.ZkStateReader A cluster state change: [WatchedEvent state:SyncConnected type:NodeDataChanged path:/collections/dv_coll/state.json] for collection [dv_coll] has occurred - updating... (live nodes size: [2])
   [junit4]   2> 2207617 INFO  (zkCallback-3644-thread-1-processing-n:127.0.0.1:63513_solr) [n:127.0.0.1:63513_solr    ] o.a.s.c.c.ZkStateReader A cluster state change: [WatchedEvent state:SyncConnected type:NodeDataChanged path:/collections/dv_coll/state.json] for collection [dv_coll] has occurred - updating... (live nodes size: [2])
   [junit4]   2> 2207617 INFO  (zkCallback-3645-thread-1-processing-n:127.0.0.1:63512_solr) [n:127.0.0.1:63512_solr    ] o.a.s.c.c.ZkStateReader A cluster state change: [WatchedEvent state:SyncConnected type:NodeDataChanged path:/collections/dv_coll/state.json] for collection [dv_coll] has occurred - updating... (live nodes size: [2])
   [junit4]   2> 2207617 INFO  (zkCallback-3645-thread-2-processing-n:127.0.0.1:63512_solr) [n:127.0.0.1:63512_solr    ] o.a.s.c.c.ZkStateReader A cluster state change: [WatchedEvent state:SyncConnected type:NodeDataChanged path:/collections/dv_coll/state.json] for collection [dv_coll] has occurred - updating... (live nodes size: [2])
   [junit4]   2> 2208532 INFO  (qtp1314606546-20496) [n:127.0.0.1:63512_solr c:dv_coll s:shard2 r:core_node2 x:dv_coll_shard2_replica_n1] o.a.s.c.SolrConfig Using Lucene MatchVersion: 8.0.0
   [junit4]   2> 2208532 INFO  (qtp1314606546-20495) [n:127.0.0.1:63512_solr c:dv_coll s:shard4 r:core_node4 x:dv_coll_shard4_replica_n1] o.a.s.c.SolrConfig Using Lucene MatchVersion: 8.0.0
   [junit4]   2> 2208532 INFO  (qtp426833501-20492) [n:127.0.0.1:63513_solr c:dv_coll s:shard1 r:core_node1 x:dv_coll_shard1_replica_n1] o.a.s.c.SolrConfig Using Lucene MatchVersion: 8.0.0
   [junit4]   2> 2208541 INFO  (qtp426833501-20493) [n:127.0.0.1:63513_solr c:dv_coll s:shard3 r:core_node3 x:dv_coll_shard3_replica_n1] o.a.s.c.SolrConfig Using Lucene MatchVersion: 8.0.0
   [junit4]   2> 2208542 INFO  (qtp1314606546-20496) [n:127.0.0.1:63512_solr c:dv_coll s:shard2 r:core_node2 x:dv_coll_shard2_replica_n1] o.a.s.s.IndexSchema [dv_coll_shard2_replica_n1] Schema name=minimal
   [junit4]   2> 2208542 INFO  (qtp426833501-20492) [n:127.0.0.1:63513_solr c:dv_coll s:shard1 r:core_node1 x:dv_coll_shard1_replica_n1] o.a.s.s.IndexSchema [dv_coll_shard1_replica_n1] Schema name=minimal
   [junit4]   2> 2208543 INFO  (qtp1314606546-20495) [n:127.0.0.1:63512_solr c:dv_coll s:shard4 r:core_node4 x:dv_coll_shard4_replica_n1] o.a.s.s.IndexSchema [dv_coll_shard4_replica_n1] Schema name=minimal
   [junit4]   2> 2208563 INFO  (qtp426833501-20492) [n:127.0.0.1:63513_solr c:dv_coll s:shard1 r:core_node1 x:dv_coll_shard1_replica_n1] o.a.s.s.IndexSchema Loaded schema minimal/1.1 with uniqueid field id
   [junit4]   2> 2208563 INFO  (qtp426833501-20492) [n:127.0.0.1:63513_solr c:dv_coll s:shard1 r:core_node1 x:dv_coll_shard1_replica_n1] o.a.s.c.CoreContainer Creating SolrCore 'dv_coll_shard1_replica_n1' using configuration from collection dv_coll, trusted=true
   [junit4]   2> 2208563 INFO  (qtp1314606546-20496) [n:127.0.0.1:63512_solr c:dv_coll s:shard2 r:core_node2 x:dv_coll_shard2_replica_n1] o.a.s.s.IndexSchema Loaded schema minimal/1.1 with uniqueid field id
   [junit4]   2> 2208563 INFO  (qtp1314606546-20496) [n:127.0.0.1:63512_solr c:dv_coll s:shard2 r:core_node2 x:dv_coll_shard2_replica_n1] o.a.s.c.CoreContainer Creating SolrCore 'dv_coll_shard2_replica_n1' using configuration from collection dv_coll, trusted=true
   [junit4]   2> 2208563 INFO  (qtp1314606546-20495) [n:127.0.0.1:63512_solr c:dv_coll s:shard4 r:core_node4 x:dv_coll_shard4_replica_n1] o.a.s.s.IndexSchema Loaded schema minimal/1.1 with uniqueid field id
   [junit4]   2> 2208564 INFO  (qtp1314606546-20495) [n:127.0.0.1:63512_solr c:dv_coll s:shard4 r:core_node4 x:dv_coll_shard4_replica_n1] o.a.s.c.CoreContainer Creating SolrCore 'dv_coll_shard4_replica_n1' using configuration from collection dv_coll, trusted=true
   [junit4]   2> 2208564 INFO  (qtp426833501-20492) [n:127.0.0.1:63513_solr c:dv_coll s:shard1 r:core_node1 x:dv_coll_shard1_replica_n1] o.a.s.m.r.SolrJmxReporter JMX monitoring for 'solr_63513.solr.core.dv_coll.shard1.replica_n1' (registry 'solr.core.dv_coll.shard1.replica_n1') enabled at server: com.sun.jmx.mbeanserver.JmxMBeanServer@1337c0ff
   [junit4]   2> 2208564 INFO  (qtp1314606546-20496) [n:127.0.0.1:63512_solr c:dv_coll s:shard2 r:core_node2 x:dv_coll_shard2_replica_n1] o.a.s.m.r.SolrJmxReporter JMX monitoring for 'solr_63512.solr.core.dv_coll.shard2.replica_n1' (registry 'solr.core.dv_coll.shard2.replica_n1') enabled at server: com.sun.jmx.mbeanserver.JmxMBeanServer@1337c0ff
   [junit4]   2> 2208564 INFO  (qtp426833501-20492) [n:127.0.0.1:63513_solr c:dv_coll s:shard1 r:core_node1 x:dv_coll_shard1_replica_n1] o.a.s.c.SolrCore solr.RecoveryStrategy.Builder
   [junit4]   2> 2208564 INFO  (qtp1314606546-20496) [n:127.0.0.1:63512_solr c:dv_coll s:shard2 r:core_node2 x:dv_coll_shard2_replica_n1] o.a.s.c.SolrCore solr.RecoveryStrategy.Builder
   [junit4]   2> 2208564 INFO  (qtp426833501-20492) [n:127.0.0.1:63513_solr c:dv_coll s:shard1 r:core_node1 x:dv_coll_shard1_replica_n1] o.a.s.c.SolrCore [[dv_coll_shard1_replica_n1] ] Opening new SolrCore at [/Users/jenkins/workspace/Lucene-Solr-master-MacOSX/solr/build/solr-core/test/J0/temp/solr.cloud.DocValuesNotIndexedTest_19A3076A21894501-001/tempDir-001/node2/dv_coll_shard1_replica_n1], dataDir=[/Users/jenkins/workspace/Lucene-Solr-master-MacOSX/solr/build/solr-core/test/J0/temp/solr.cloud.DocValuesNotIndexedTest_19A3076A21894501-001/tempDir-001/node2/./dv_coll_shard1_replica_n1/data/]
   [junit4]   2> 2208564 INFO  (qtp1314606546-20496) [n:127.0.0.1:63512_solr c:dv_coll s:shard2 r:core_node2 x:dv_coll_shard2_replica_n1] o.a.s.c.SolrCore [[dv_coll_shard2_replica_n1] ] Opening new SolrCore at [/Users/jenkins/workspace/Lucene-Solr-master-MacOSX/solr/build/solr-core/test/J0/temp/solr.cloud.DocValuesNotIndexedTest_19A3076A21894501-001/tempDir-001/node1/dv_coll_shard2_replica_n1], dataDir=[/Users/jenkins/workspace/Lucene-Solr-master-MacOSX/solr/build/solr-core/test/J0/temp/solr.cloud.DocValuesNotIndexedTest_19A3076A21894501-001/tempDir-001/node1/./dv_coll_shard2_replica_n1/data/]
   [junit4]   2> 2208564 INFO  (qtp1314606546-20495) [n:127.0.0.1:63512_solr c:dv_coll s:shard4 r:core_node4 x:dv_coll_shard4_replica_n1] o.a.s.m.r.SolrJmxReporter JMX monitoring for 'solr_63512.solr.core.dv_coll.shard4.replica_n1' (registry 'solr.core.dv_coll.shard4.replica_n1') enabled at server: com.sun.jmx.mbeanserver.JmxMBeanServer@1337c0ff
   [junit4]   2> 2208564 INFO  (qtp1314606546-20495) [n:127.0.0.1:63512_solr c:dv_coll s:shard4 r:core_node4 x:dv_coll_shard4_replica_n1] o.a.s.c.SolrCore solr.RecoveryStrategy.Builder
   [junit4]   2> 2208564 INFO  (qtp1314606546-20495) [n:127.0.0.1:63512_solr c:dv_coll s:shard4 r:core_node4 x:dv_coll_shard4_replica_n1] o.a.s.c.SolrCore [[dv_coll_shard4_replica_n1] ] Opening new SolrCore at [/Users/jenkins/workspace/Lucene-Solr-master-MacOSX/solr/build/solr-core/test/J0/temp/solr.cloud.DocValuesNotIndexedTest_19A3076A21894501-001/tempDir-001/node1/dv_coll_shard4_replica_n1], dataDir=[/Users/jenkins/workspace/Lucene-Solr-master-MacOSX/solr/build/solr-core/test/J0/temp/solr.cloud.DocValuesNotIndexedTest_19A3076A21894501-001/tempDir-001/node1/./dv_coll_shard4_replica_n1/data/]
   [junit4]   2> 2208567 INFO  (qtp426833501-20493) [n:127.0.0.1:63513_solr c:dv_coll s:shard3 r:core_node3 x:dv_coll_shard3_replica_n1] o.a.s.s.IndexSchema [dv_coll_shard3_replica_n1] Schema name=minimal
   [junit4]   2> 2208568 INFO  (qtp426833501-20493) [n:127.0.0.1:63513_solr c:dv_coll s:shard3 r:core_node3 x:dv_coll_shard3_replica_n1] o.a.s.s.IndexSchema Loaded schema minimal/1.1 with uniqueid field id
   [junit4]   2> 2208568 INFO  (qtp426833501-20493) [n:127.0.0.1:63513_solr c:dv_coll s:shard3 r:core_node3 x:dv_coll_shard3_replica_n1] o.a.s.c.CoreContainer Creating SolrCore 'dv_coll_shard3_replica_n1' using configuration from collection dv_coll, trusted=true
   [junit4]   2> 2208569 INFO  (qtp426833501-20493) [n:127.0.0.1:63513_solr c:dv_coll s:shard3 r:core_node3 x:dv_coll_shard3_replica_n1] o.a.s.m.r.SolrJmxReporter JMX monitoring for 'solr_63513.solr.core.dv_coll.shard3.replica_n1' (registry 'solr.core.dv_coll.shard3.replica_n1') enabled at server: com.sun.jmx.mbeanserver.JmxMBeanServer@1337c0ff
   [junit4]   2> 2208569 INFO  (qtp426833501-20493) [n:127.0.0.1:63513_solr c:dv_coll s:shard3 r:core_node3 x:dv_coll_shard3_replica_n1] o.a.s.c.SolrCore solr.RecoveryStrategy.Builder
   [junit4]   2> 2208569 INFO  (qtp426833501-20493) [n:127.0.0.1:63513_solr c:dv_coll s:shard3 r:core_node3 x:dv_coll_shard3_replica_n1] o.a.s.c.SolrCore [[dv_coll_shard3_replica_n1] ] Opening new SolrCore at [/Users/jenkins/workspace/Lucene-Solr-master-MacOSX/solr/build/solr-core/test/J0/temp/solr.cloud.DocValuesNotIndexedTest_19A3076A21894501-001/tempDir-001/node2/dv_coll_shard3_replica_n1], dataDir=[/Users/jenkins/workspace/Lucene-Solr-master-MacOSX/solr/build/solr-core/test/J0/temp/solr.cloud.DocValuesNotIndexedTest_19A3076A21894501-001/tempDir-001/node2/./dv_coll_shard3_replica_n1/data/]
   [junit4]   2> 2208630 INFO  (qtp426833501-20492) [n:127.0.0.1:63513_solr c:dv_coll s:shard1 r:core_node1 x:dv_coll_shard1_replica_n1] o.a.s.u.UpdateHandler Using UpdateLog implementation: org.apache.solr.update.UpdateLog
   [junit4]   2> 2208630 INFO  (qtp426833501-20492) [n:127.0.0.1:63513_solr c:dv_coll s:shard1 r:core_node1 x:dv_coll_shard1_replica_n1] o.a.s.u.UpdateLog Initializing UpdateLog: dataDir=null defaultSyncLevel=FLUSH numRecordsToKeep=100 maxNumLogsToKeep=10 numVersionBuckets=65536
   [junit4]   2> 2208632 INFO  (qtp426833501-20492) [n:127.0.0.1:63513_solr c:dv_coll s:shard1 r:core_node1 x:dv_coll_shard1_replica_n1] o.a.s.u.CommitTracker Hard AutoCommit: disabled
   [junit4]   2> 2208632 INFO  (qtp426833501-20492) [n:127.0.0.1:63513_solr c:dv_coll s:shard1 r:core_node1 x:dv_coll_shard1_replica_n1] o.a.s.u.CommitTracker Soft AutoCommit: disabled
   [junit4]   2> 2208633 INFO  (qtp1314606546-20496) [n:127.0.0.1:63512_solr c:dv_coll s:shard2 r:core_node2 x:dv_coll_shard2_replica_n1] o.a.s.u.UpdateHandler Using UpdateLog implementation: org.apache.solr.update.UpdateLog
   [junit4]   2> 2208633 INFO  (qtp1314606546-20496) [n:127.0.0.1:63512_solr c:dv_coll s:shard2 r:core_node2 x:dv_coll_shard2_replica_n1] o.a.s.u.UpdateLog Initializing UpdateLog: dataDir=null defaultSyncLevel=FLUSH numRecordsToKeep=100 maxNumLogsToKeep=10 numVersionBuckets=65536
   [junit4]   2> 2208633 INFO  (qtp426833501-20493) [n:127.0.0.1:63513_solr c:dv_coll s:shard3 r:core_node3 x:dv_coll_shard3_replica_n1] o.a.s.u.UpdateHandler Using UpdateLog implementation: org.apache.solr.update.UpdateLog
   [junit4]   2> 2208633 INFO  (qtp426833501-20493) [n:127.0.0.1:63513_solr c:dv_coll s:shard3 r:core_node3 x:dv_coll_shard3_replica_n1] o.a.s.u.UpdateLog Initializing UpdateLog: dataDir=null defaultSyncLevel=FLUSH numRecordsToKeep=100 maxNumLogsToKeep=10 numVersionBuckets=65536
   [junit4]   2> 2208635 INFO  (qtp1314606546-20496) [n:127.0.0.1:63512_solr c:dv_coll s:shard2 r:core_node2 x:dv_coll_shard2_replica_n1] o.a.s.u.CommitTracker Hard AutoCommit: disabled
   [junit4]   2> 2208635 INFO  (qtp1314606546-20496) [n:127.0.0.1:63512_solr c:dv_coll s:shard2 r:core_node2 x:dv_coll_shard2_replica_n1] o.a.s.u.CommitTracker Soft AutoCommit: disabled
   [junit4]   2> 2208635 INFO  (qtp1314606546-20495) [n:127.0.0.1:63512_solr c:dv_coll s:shard4 r:core_node4 x:dv_coll_shard4_replica_n1] o.a.s.u.UpdateHandler Using UpdateLog implementation: org.apache.solr.update.UpdateLog
   [junit4]   2> 2208635 INFO  (qtp426833501-20493) [n:127.0.0.1:63513_solr c:dv_coll s:shard3 r:core_node3 x:dv_coll_shard3_replica_n1] o.a.s.u.CommitTracker Hard AutoCommit: disabled
   [junit4]   2> 2208635 INFO  (qtp426833501-20493) [n:127.0.0.1:63513_solr c:dv_coll s:shard3 r:core_node3 x:dv_coll_shard3_replica_n1] o.a.s.u.CommitTracker Soft AutoCommit: disabled
   [junit4]   2> 2208635 INFO  (qtp1314606546-20495) [n:127.0.0.1:63512_solr c:dv_coll s:shard4 r:core_node4 x:dv_coll_shard4_replica_n1] o.a.s.u.UpdateLog Initializing UpdateLog: dataDir=null defaultSyncLevel=FLUSH numRecordsToKeep=100 maxNumLogsToKeep=10 numVersionBuckets=65536
   [junit4]   2> 2208636 INFO  (qtp426833501-20492) [n:127.0.0.1:63513_solr c:dv_coll s:shard1 r:core_node1 x:dv_coll_shard1_replica_n1] o.a.s.s.SolrIndexSearcher Opening [Searcher@71131da3[dv_coll_shard1_replica_n1] main]
   [junit4]   2> 2208636 INFO  (qtp1314606546-20496) [n:127.0.0.1:63512_solr c:dv_coll s:shard2 r:core_node2 x:dv_coll_shard2_replica_n1] o.a.s.s.SolrIndexSearcher Opening [Searcher@129f544d[dv_coll_shard2_replica_n1] main]
   [junit4]   2> 2208636 INFO  (qtp426833501-20493) [n:127.0.0.1:63513_solr c:dv_coll s:shard3 r:core_node3 x:dv_coll_shard3_replica_n1] o.a.s.s.SolrIndexSearcher Opening [Searcher@7bd00905[dv_coll_shard3_replica_n1] main]
   [junit4]   2> 2208636 INFO  (qtp1314606546-20495) [n:127.0.0.1:63512_solr c:dv_coll s:shard4 r:core_node4 x:dv_coll_shard4_replica_n1] o.a.s.u.CommitTracker Hard AutoCommit: disabled
   [junit4]   2> 2208636 INFO  (qtp1314606546-20495) [n:127.0.0.1:63512_solr c:dv_coll s:shard4 r:core_node4 x:dv_coll_shard4_replica_n1] o.a.s.u.CommitTracker Soft AutoCommit: disabled
   [junit4]   2> 2208637 INFO  (qtp426833501-20492) [n:127.0.0.1:63513_solr c:dv_coll s:shard1 r:core_node1 x:dv_coll_shard1_replica_n1] o.a.s.r.ManagedResourceStorage Configured ZooKeeperStorageIO with znodeBase: /configs/conf1
   [junit4]   2> 2208637 INFO  (qtp1314606546-20496) [n:127.0.0.1:63512_solr c:dv_coll s:shard2 r:core_node2 x:dv_coll_shard2_replica_n1] o.a.s.r.ManagedResourceStorage Configured ZooKeeperStorageIO with znodeBase: /configs/conf1
   [junit4]   2> 2208638 INFO  (qtp426833501-20493) [n:127.0.0.1:63513_solr c:dv_coll s:shard3 r:core_node3 x:dv_coll_shard3_replica_n1] o.a.s.r.ManagedResourceStorage Configured ZooKeeperStorageIO with znodeBase: /configs/conf1
   [junit4]   2> 2208638 INFO  (qtp426833501-20492) [n:127.0.0.1:63513_solr c:dv_coll s:shard1 r:core_node1 x:dv_coll_shard1_replica_n1] o.a.s.r.ManagedResourceStorage Loaded null at path _rest_managed.json using ZooKeeperStorageIO:path=/configs/conf1
   [junit4]   2> 2208638 INFO  (qtp1314606546-20496) [n:127.0.0.1:63512_solr c:dv_coll s:shard2 r:core_node2 x:dv_coll_shard2_replica_n1] o.a.s.r.ManagedResourceStorage Loaded null at path _rest_managed.json using ZooKeeperStorageIO:path=/configs/conf1
   [junit4]   2> 2208638 INFO  (qtp426833501-20492) [n:127.0.0.1:63513_solr c:dv_coll s:shard1 r:core_node1 x:dv_coll_shard1_replica_n1] o.a.s.s.ZkIndexSchemaReader Creating ZooKeeper watch for the managed schema at /configs/conf1/managed-schema
   [junit4]   2> 2208638 INFO  (qtp1314606546-20496) [n:127.0.0.1:63512_solr c:dv_coll s:shard2 r:core_node2 x:dv_coll_shard2_replica_n1] o.a.s.s.ZkIndexSchemaReader Creating ZooKeeper watch for the managed schema at /configs/conf1/managed-schema
   [junit4]   2> 2208638 INFO  (qtp426833501-20493) [n:127.0.0.1:63513_solr c:dv_coll s:shard3 r:core_node3 x:dv_coll_shard3_replica_n1] o.a.s.r.ManagedResourceStorage Loaded null at path _rest_managed.json using ZooKeeperStorageIO:path=/configs/conf1
   [junit4]   2> 2208638 INFO  (qtp426833501-20493) [n:127.0.0.1:63513_solr c:dv_coll s:shard3 r:core_node3 x:dv_coll_shard3_replica_n1] o.a.s.s.ZkIndexSchemaReader Creating ZooKeeper watch for the managed schema at /configs/conf1/managed-schema
   [junit4]   2> 2208638 INFO  (qtp1314606546-20495) [n:127.0.0.1:63512_solr c:dv_coll s:shard4 r:core_node4 x:dv_coll_shard4_replica_n1] o.a.s.s.SolrIndexSearcher Opening [Searcher@228ca149[dv_coll_shard4_replica_n1] main]
   [junit4]   2> 2208639 INFO  (qtp426833501-20492) [n:127.0.0.1:63513_solr c:dv_coll s:shard1 r:core_node1 x:dv_coll_shard1_replica_n1] o.a.s.s.ZkIndexSchemaReader Current schema version 0 is already the latest
   [junit4]   2> 2208639 INFO  (qtp1314606546-20496) [n:127.0.0.1:63512_solr c:dv_coll s:shard2 r:core_node2 x:dv_coll_shard2_replica_n1] o.a.s.s.ZkIndexSchemaReader Current schema version 0 is already the latest
   [junit4]   2> 2208639 INFO  (qtp426833501-20493) [n:127.0.0.1:63513_solr c:dv_coll s:shard3 r:core_node3 x:dv_coll_shard3_replica_n1] o.a.s.s.ZkIndexSchemaReader Current schema version 0 is already the latest
   [junit4]   2> 2208639 INFO  (qtp426833501-20492) [n:127.0.0.1:63513_solr c:dv_coll s:shard1 r:core_node1 x:dv_coll_shard1_replica_n1] o.a.s.h.ReplicationHandler Commits will be reserved for  10000
   [junit4]   2> 2208639 INFO  (qtp426833501-20492) [n:127.0.0.1:63513_solr c:dv_coll s:shard1 r:core_node1 x:dv_coll_shard1_replica_n1] o.a.s.u.UpdateLog Could not find max version in index or recent updates, using new clock 1571979408300834816
   [junit4]   2> 2208639 INFO  (qtp1314606546-20496) [n:127.0.0.1:63512_solr c:dv_coll s:shard2 r:core_node2 x:dv_coll_shard2_replica_n1] o.a.s.h.ReplicationHandler Commits will be reserved for  10000
   [junit4]   2> 2208639 INFO  (qtp1314606546-20496) [n:127.0.0.1:63512_solr c:dv_coll s:shard2 r:core_node2 x:dv_coll_shard2_replica_n1] o.a.s.u.UpdateLog Could not find max version in index or recent updates, using new clock 1571979408300834816
   [junit4]   2> 2208639 INFO  (qtp426833501-20493) [n:127.0.0.1:63513_solr c:dv_coll s:shard3 r:core_node3 x:dv_coll_shard3_replica_n1] o.a.s.h.ReplicationHandler Commits will be reserved for  10000
   [junit4]   2> 2208640 INFO  (qtp426833501-20493) [n:127.0.0.1:63513_solr c:dv_coll s:shard3 r:core_node3 x:dv_coll_shard3_replica_n1] o.a.s.u.UpdateLog Could not find max version in index or recent updates, using new clock 1571979408301883392
   [junit4]   2> 2208641 INFO  (searcherExecutor-7314-thread-1-processing-n:127.0.0.1:63513_solr x:dv_coll_shard1_replica_n1 s:shard1 c:dv_coll r:core_node1) [n:127.0.0.1:63513_solr c:dv_coll s:shard1 r:core_node1 x:dv_coll_shard1_replica_n1] o.a.s.c.SolrCore [dv_coll_shard1_replica_n1] Registered new searcher Searcher@71131da3[dv_coll_shard1_replica_n1] main{ExitableDirectoryReader(UninvertingDirectoryReader())}
   [junit4]   2> 2208641 INFO  (searcherExecutor-7315-thread-1-processing-n:127.0.0.1:63512_solr x:dv_coll_shard2_replica_n1 s:shard2 c:dv_coll r:core_node2) [n:127.0.0.1:63512_solr c:dv_coll s:shard2 r:core_node2 x:dv_coll_shard2_replica_n1] o.a.s.c.SolrCore [dv_coll_shard2_replica_n1] Registered new searcher Searcher@129f544d[dv_coll_shard2_replica_n1] main{ExitableDirectoryReader(UninvertingDirectoryReader())}
   [junit4]   2> 2208641 INFO  (searcherExecutor-7317-thread-1-processing-n:127.0.0.1:63513_solr x:dv_coll_shard3_replica_n1 s:shard3 c:dv_coll r:core_node3) [n:127.0.0.1:63513_solr c:dv_coll s:shard3 r:core_node3 x:dv_coll_shard3_replica_n1] o.a.s.c.SolrCore [dv_coll_shard3_replica_n1] Registered new searcher Searcher@7bd00905[dv_coll_shard3_replica_n1] main{ExitableDirectoryReader(UninvertingDirectoryReader())}
   [junit4]   2> 2208642 INFO  (qtp1314606546-20495) [n:127.0.0.1:63512_solr c:dv_coll s:shard4 r:core_node4 x:dv_coll_shard4_replica_n1] o.a.s.r.ManagedResourceStorage Configured ZooKeeperStorageIO with znodeBase: /configs/conf1
   [junit4]   2> 2208642 INFO  (qtp1314606546-20495) [n:127.0.0.1:63512_solr c:dv_coll s:shard4 r:core_node4 x:dv_coll_shard4_replica_n1] o.a.s.r.ManagedResourceStorage Loaded null at path _rest_managed.json using ZooKeeperStorageIO:path=/configs/conf1
   [junit4]   2> 2208642 INFO  (qtp1314606546-20495) [n:127.0.0.1:63512_solr c:dv_coll s:shard4 r:core_node4 x:dv_coll_shard4_replica_n1] o.a.s.s.ZkIndexSchemaReader Creating ZooKeeper watch for the managed schema at /configs/conf1/managed-schema
   [junit4]   2> 2208643 INFO  (qtp1314606546-20495) [n:127.0.0.1:63512_solr c:dv_coll s:shard4 r:core_node4 x:dv_coll_shard4_replica_n1] o.a.s.s.ZkIndexSchemaReader Current schema version 0 is already the latest
   [junit4]   2> 2208643 INFO  (qtp1314606546-20495) [n:127.0.0.1:63512_solr c:dv_coll s:shard4 r:core_node4 x:dv_coll_shard4_replica_n1] o.a.s.h.ReplicationHandler Commits will be reserved for  10000
   [junit4]   2> 2208644 INFO  (qtp1314606546-20495) [n:127.0.0.1:63512_solr c:dv_coll s:shard4 r:core_node4 x:dv_coll_shard4_replica_n1] o.a.s.u.UpdateLog Could not find max version in index or recent updates, using new clock 1571979408306077696
   [junit4]   2> 2208644 INFO  (searcherExecutor-7316-thread-1-processing-n:127.0.0.1:63512_solr x:dv_coll_shard4_replica_n1 s:shard4 c:dv_coll r:core_node4) [n:127.0.0.1:63512_solr c:dv_coll s:shard4 r:core_node4 x:dv_coll_shard4_replica_n1] o.a.s.c.SolrCore [dv_coll_shard4_replica_n1] Registered new searcher Searcher@228ca149[dv_coll_shard4_replica_n1] main{ExitableDirectoryReader(UninvertingDirectoryReader())}
   [junit4]   2> 2208648 INFO  (qtp426833501-20493) [n:127.0.0.1:63513_solr c:dv_coll s:shard3 r:core_node3 x:dv_coll_shard3_replica_n1] o.a.s.c.ShardLeaderElectionContext Enough replicas found to continue.
   [junit4]   2> 2208648 INFO  (qtp426833501-20493) [n:127.0.0.1:63513_solr c:dv_coll s:shard3 r:core_node3 x:dv_coll_shard3_replica_n1] o.a.s.c.ShardLeaderElectionContext I may be the new leader - try and sync
   [junit4]   2> 2208648 INFO  (qtp426833501-20493) [n:127.0.0.1:63513_solr c:dv_coll s:shard3 r:core_node3 x:dv_coll_shard3_replica_n1] o.a.s.c.SyncStrategy Sync replicas to http://127.0.0.1:63513/solr/dv_coll_shard3_replica_n1/
   [junit4]   2> 2208648 INFO  (qtp426833501-20493) [n:127.0.0.1:63513_solr c:dv_coll s:shard3 r:core_node3 x:dv_coll_shard3_replica_n1] o.a.s.c.SyncStrategy Sync Success - now sync replicas to me
   [junit4]   2> 2208648 INFO  (qtp426833501-20493) [n:127.0.0.1:63513_solr c:dv_coll s:shard3 r:core_node3 x:dv_coll_shard3_replica_n1] o.a.s.c.SyncStrategy http://127.0.0.1:63513/solr/dv_coll_shard3_replica_n1/ has no replicas
   [junit4]   2> 2208648 INFO  (qtp426833501-20493) [n:127.0.0.1:63513_solr c:dv_coll s:shard3 r:core_node3 x:dv_coll_shard3_replica_n1] o.a.s.c.ShardLeaderElectionContext Found all replicas participating in election, clear LIR
   [junit4]   2> 2208648 INFO  (qtp1314606546-20496) [n:127.0.0.1:63512_solr c:dv_coll s:shard2 r:core_node2 x:dv_coll_shard2_replica_n1] o.a.s.c.ShardLeaderElectionContext Enough replicas found to continue.
   [junit4]   2> 2208648 INFO  (qtp1314606546-20496) [n:127.0.0.1:63512_solr c:dv_coll s:shard2 r:core_node2 x:dv_coll_shard2_replica_n1] o.a.s.c.ShardLeaderElectionContext I may be the new leader - try and sync
   [junit4]   2> 2208648 INFO  (qtp1314606546-20496) [n:127.0.0.1:63512_solr c:dv_coll s:shard2 r:core_node2 x:dv_coll_shard2_replica_n1] o.a.s.c.SyncStrategy Sync replicas to http://127.0.0.1:63512/solr/dv_coll_shard2_replica_n1/
   [junit4]   2> 2208648 INFO  (qtp426833501-20492) [n:127.0.0.1:63513_solr c:dv_coll s:shard1 r:core_node1 x:dv_coll_shard1_replica_n1] o.a.s.c.ShardLeaderElectionContext Enough replicas found to continue.
   [junit4]   2> 2208648 INFO  (qtp1314606546-20496) [n:127.0.0.1:63512_solr c:dv_coll s:shard2 r:core_node2 x:dv_coll_shard2_replica_n1] o.a.s.c.SyncStrategy Sync Success - now sync replicas to me
   [junit4]   2> 2208648 INFO  (qtp426833501-20492) [n:127.0.0.1:63513_solr c:dv_coll s:shard1 r:core_node1 x:dv_coll_shard1_replica_n1] o.a.s.c.ShardLeaderElectionContext I may be the new leader - try and sync
   [junit4]   2> 2208648 INFO  (qtp1314606546-20496) [n:127.0.0.1:63512_solr c:dv_coll s:shard2 r:core_node2 x:dv_coll_shard2_replica_n1] o.a.s.c.SyncStrategy http://127.0.0.1:63512/solr/dv_coll_shard2_replica_n1/ has no replicas
   [junit4]   2> 2208649 INFO  (qtp426833501-20492) [n:127.0.0.1:63513_solr c:dv_coll s:shard1 r:core_node1 x:dv_coll_shard1_replica_n1] o.a.s.c.SyncStrategy Sync replicas to http://127.0.0.1:63513/solr/dv_coll_shard1_replica_n1/
   [junit4]   2> 2208649 INFO  (qtp426833501-20492) [n:127.0.0.1:63513_solr c:dv_coll s:shard1 r:core_node1 x:dv_coll_shard1_replica_n1] o.a.s.c.SyncStrategy Sync Success - now sync replicas to me
   [junit4]   2> 2208649 INFO  (qtp426833501-20492) [n:127.0.0.1:63513_solr c:dv_coll s:shard1 r:core_node1 x:dv_coll_shard1_replica_n1] o.a.s.c.SyncStrategy http://127.0.0.1:63513/solr/dv_coll_shard1_replica_n1/ has no replicas
   [junit4]   2> 2208649 INFO  (qtp1314606546-20496) [n:127.0.0.1:63512_solr c:dv_coll s:shard2 r:core_node2 x:dv_coll_shard2_replica_n1] o.a.s.c.ShardLeaderElectionContext Found all replicas participating in election, clear LIR
   [junit4]   2> 2208649 INFO  (qtp426833501-20492) [n:127.0.0.1:63513_solr c:dv_coll s:shard1 r:core_node1 x:dv_coll_shard1_replica_n1] o.a.s.c.ShardLeaderElectionContext Found all replicas participating in election, clear LIR
   [junit4]   2> 2208651 INFO  (qtp1314606546-20495) [n:127.0.0.1:63512_solr c:dv_coll s:shard4 r:core_node4 x:dv_coll_shard4_replica_n1] o.a.s.c.ShardLeaderElectionContext Enough replicas found to continue.
   [junit4]   2> 2208651 INFO  (qtp1314606546-20495) [n:127.0.0.1:63512_solr c:dv_coll s:shard4 r:core_node4 x:dv_coll_shard4_replica_n1] o.a.s.c.ShardLeaderElectionContext I may be the new leader - try and sync
   [junit4]   2> 2208651 INFO  (qtp1314606546-20495) [n:127.0.0.1:63512_solr c:dv_coll s:shard4 r:core_node4 x:dv_coll_shard4_replica_n1] o.a.s.c.SyncStrategy Sync replicas to http://127.0.0.1:63512/solr/dv_coll_shard4_replica_n1/
   [junit4]   2> 2208651 INFO  (qtp1314606546-20495) [n:127.0.0.1:63512_solr c:dv_coll s:shard4 r:core_node4 x:dv_coll_shard4_replica_n1] o.a.s.c.SyncStrategy Sync Success - now sync replicas to me
   [junit4]   2> 2208651 INFO  (qtp1314606546-20495) [n:127.0.0.1:63512_solr c:dv_coll s:shard4 r:core_node4 x:dv_coll_shard4_replica_n1] o.a.s.c.SyncStrategy http://127.0.0.1:63512/solr/dv_coll_shard4_replica_n1/ has no replicas
   [junit4]   2> 2208651 INFO  (qtp1314606546-20495) [n:127.0.0.1:63512_solr c:dv_coll s:shard4 r:core_node4 x:dv_coll_shard4_replica_n1] o.a.s.c.ShardLeaderElectionContext Found all replicas participating in election, clear LIR
   [junit4]   2> 2208655 INFO  (qtp1314606546-20496) [n:127.0.0.1:63512_solr c:dv_coll s:shard2 r:core_node2 x:dv_coll_shard2_replica_n1] o.a.s.c.ShardLeaderElectionContext I am the new leader: http://127.0.0.1:63512/solr/dv_coll_shard2_replica_n1/ shard2
   [junit4]   2> 2208655 INFO  (qtp426833501-20493) [n:127.0.0.1:63513_solr c:dv_coll s:shard3 r:core_node3 x:dv_coll_shard3_replica_n1] o.a.s.c.ShardLeaderElectionContext I am the new leader: http://127.0.0.1:63513/solr/dv_coll_shard3_replica_n1/ shard3
   [junit4]   2> 2208656 INFO  (qtp426833501-20492) [n:127.0.0.1:63513_solr c:dv_coll s:shard1 r:core_node1 x:dv_coll_shard1_replica_n1] o.a.s.c.ShardLeaderElectionContext I am the new leader: http://127.0.0.1:63513/solr/dv_coll_shard1_replica_n1/ shard1
   [junit4]   2> 2208658 INFO  (qtp1314606546-20495) [n:127.0.0.1:63512_solr c:dv_coll s:shard4 r:core_node4 x:dv_coll_shard4_replica_n1] o.a.s.c.ShardLeaderElectionContext I am the new leader: http://127.0.0.1:63512/solr/dv_coll_shard4_replica_n1/ shard4
   [junit4]   2> 2208768 INFO  (zkCallback-3645-thread-2-processing-n:127.0.0.1:63512_solr) [n:127.0.0.1:63512_solr    ] o.a.s.c.c.ZkStateReader A cluster state change: [WatchedEvent state:SyncConnected type:NodeDataChanged path:/collections/dv_coll/state.json] for collection [dv_coll] has occurred - updating... (live nodes size: [2])
   [junit4]   2> 2208768 INFO  (zkCallback-3645-thread-1-processing-n:127.0.0.1:63512_solr) [n:127.0.0.1:63512_solr    ] o.a.s.c.c.ZkStateReader A cluster state change: [WatchedEvent state:SyncConnected type:NodeDataChanged path:/collections/dv_coll/state.json] for collection [dv_coll] has occurred - updating... (live nodes size: [2])
   [junit4]   2> 2208768 INFO  (zkCallback-3644-thread-2-processing-n:127.0.0.1:63513_solr) [n:127.0.0.1:63513_solr    ] o.a.s.c.c.ZkStateReader A cluster state change: [WatchedEvent state:SyncConnected type:NodeDataChanged path:/collections/dv_coll/state.json] for collection [dv_coll] has occurred - updating... (live nodes size: [2])
   [junit4]   2> 2208768 INFO  (zkCallback-3644-thread-1-processing-n:127.0.0.1:63513_solr) [n:127.0.0.1:63513_solr    ] o.a.s.c.c.ZkStateReader A cluster state change: [WatchedEvent state:SyncConnected type:NodeDataChanged path:/collections/dv_coll/state.json] for collection [dv_coll] has occurred - updating... (live nodes size: [2])
   [junit4]   2> 2208815 INFO  (qtp1314606546-20495) [n:127.0.0.1:63512_solr c:dv_coll s:shard4 r:core_node4 x:dv_coll_shard4_replica_n1] o.a.s.c.ZkController I am the leader, no recovery necessary
   [junit4]   2> 2208815 INFO  (qtp426833501-20493) [n:127.0.0.1:63513_solr c:dv_coll s:shard3 r:core_node3 x:dv_coll_shard3_replica_n1] o.a.s.c.ZkController I am the leader, no recovery necessary
   [junit4]   2> 2208815 INFO  (qtp1314606546-20496) [n:127.0.0.1:63512_solr c:dv_coll s:shard2 r:core_node2 x:dv_coll_shard2_replica_n1] o.a.s.c.ZkController I am the leader, no recovery necessary
   [junit4]   2> 2208815 INFO  (qtp426833501-20492) [n:127.0.0.1:63513_solr c:dv_coll s:shard1 r:core_node1 x:dv_coll_shard1_replica_n1] o.a.s.c.ZkController I am the leader, no recovery necessary
   [junit4]   2> 2208820 INFO  (qtp1314606546-20495) [n:127.0.0.1:63512_solr c:dv_coll s:shard4 r:core_node4 x:dv_coll_shard4_replica_n1] o.a.s.s.HttpSolrCall [admin] webapp=null path=/admin/cores params={qt=/admin/cores&coreNodeName=core_node4&collection.configName=conf1&newCollection=true&name=dv_coll_shard4_replica_n1&action=CREATE&numShards=4&collection=dv_coll&shard=shard4&wt=javabin&version=2&replicaType=NRT} status=0 QTime=1344
   [junit4]   2> 2208822 INFO  (qtp426833501-20493) [n:127.0.0.1:63513_solr c:dv_coll s:shard3 r:core_node3 x:dv_coll_shard3_replica_n1] o.a.s.s.HttpSolrCall [admin] webapp=null path=/admin/cores params={qt=/admin/cores&coreNodeName=core_node3&collection.configName=conf1&newCollection=true&name=dv_coll_shard3_replica_n1&action=CREATE&numShards=4&collection=dv_coll&shard=shard3&wt=javabin&version=2&replicaType=NRT} status=0 QTime=1346
   [junit4]   2> 2208823 INFO  (qtp1314606546-20496) [n:127.0.0.1:63512_solr c:dv_coll s:shard2 r:core_node2 x:dv_coll_shard2_replica_n1] o.a.s.s.HttpSolrCall [admin] webapp=null path=/admin/cores params={qt=/admin/cores&coreNodeName=core_node2&collection.configName=conf1&newCollection=true&name=dv_coll_shard2_replica_n1&action=CREATE&numShards=4&collection=dv_coll&shard=shard2&wt=javabin&version=2&replicaType=NRT} status=0 QTime=1346
   [junit4]   2> 2208824 INFO  (qtp426833501-20492) [n:127.0.0.1:63513_solr c:dv_coll s:shard1 r:core_node1 x:dv_coll_shard1_replica_n1] o.a.s.s.HttpSolrCall [admin] webapp=null path=/admin/cores params={qt=/admin/cores&coreNodeName=core_node1&collection.configName=conf1&newCollection=true&name=dv_coll_shard1_replica_n1&action=CREATE&numShards=4&collection=dv_coll&shard=shard1&wt=javabin&version=2&replicaType=NRT} status=0 QTime=1350
   [junit4]   2> 2208834 INFO  (qtp426833501-20491) [n:127.0.0.1:63513_solr    ] o.a.s.h.a.CollectionsHandler Wait for new collection to be active for at most 30 seconds. Check all shard replicas
   [junit4]   2> 2208944 INFO  (zkCallback-3645-thread-1-processing-n:127.0.0.1:63512_solr) [n:127.0.0.1:63512_solr    ] o.a.s.c.c.ZkStateReader A cluster state change: [WatchedEvent state:SyncConnected type:NodeDataChanged path:/collections/dv_coll/state.json] for collection [dv_coll] has occurred - updating... (live nodes size: [2])
   [junit4]   2> 2208945 INFO  (zkCallback-3645-thread-2-processing-n:127.0.0.1:63512_solr) [n:127.0.0.1:63512_solr    ] o.a.s.c.c.ZkStateReader A cluster state change: [WatchedEvent state:SyncConnected type:NodeDataChanged path:/collections/dv_coll/state.json] for collection [dv_coll] has occurred - updating... (live nodes size: [2])
   [junit4]   2> 2208945 INFO  (zkCallback-3644-thread-1-processing-n:127.0.0.1:63513_solr) [n:127.0.0.1:63513_solr    ] o.a.s.c.c.ZkStateReader A cluster state change: [WatchedEvent state:SyncConnected type:NodeDataChanged path:/collections/dv_coll/state.json] for collection [dv_coll] has occurred - updating... (live nodes size: [2])
   [junit4]   2> 2208945 INFO  (zkCallback-3644-thread-2-processing-n:127.0.0.1:63513_solr) [n:127.0.0.1:63513_solr    ] o.a.s.c.c.ZkStateReader A cluster state change: [WatchedEvent state:SyncConnected type:NodeDataChanged path:/collections/dv_coll/state.json] for collection [dv_coll] has occurred - updating... (live nodes size: [2])
   [junit4]   2> 2209154 INFO  (OverseerCollectionConfigSetProcessor-98248712885567493-127.0.0.1:63513_solr-n_0000000000) [n:127.0.0.1:63513_solr    ] o.a.s.c.OverseerTaskQueue Response ZK path: /overseer/collection-queue-work/qnr-0000000000 doesn't exist.  Requestor may have disconnected from ZooKeeper
   [junit4]   2> 2209838 INFO  (qtp426833501-20491) [n:127.0.0.1:63513_solr    ] o.a.s.s.HttpSolrCall [admin] webapp=null path=/admin/collections params={replicationFactor=1&collection.configName=conf1&maxShardsPerNode=2&name=dv_coll&nrtReplicas=1&action=CREATE&numShards=4&wt=javabin&version=2} status=0 QTime=2700
   [junit4]   2> 2209851 INFO  (qtp426833501-20494) [n:127.0.0.1:63513_solr c:dv_coll s:shard3 r:core_node3 x:dv_coll_shard3_replica_n1] o.a.s.s.SchemaManager managed schema loaded . version : 0 
   [junit4]   2> 2209858 INFO  (qtp426833501-20494) [n:127.0.0.1:63513_solr c:dv_coll s:shard3 r:core_node3 x:dv_coll_shard3_replica_n1] o.a.s.s.IndexSchema [dv_coll_shard3_replica_n1] Schema name=minimal
   [junit4]   2> 2209906 INFO  (qtp426833501-20494) [n:127.0.0.1:63513_solr c:dv_coll s:shard3 r:core_node3 x:dv_coll_shard3_replica_n1] o.a.s.s.IndexSchema Loaded schema minimal/1.1 with uniqueid field id
   [junit4]   2> 2209911 INFO  (zkCallback-3645-thread-2-processing-n:127.0.0.1:63512_solr) [n:127.0.0.1:63512_solr    ] o.a.s.s.ZkIndexSchemaReader A schema change: WatchedEvent state:SyncConnected type:NodeDataChanged path:/configs/conf1/managed-schema, has occurred - updating schema from ZooKeeper ...
   [junit4]   2> 2209911 INFO  (zkCallback-3645-thread-1-processing-n:127.0.0.1:63512_solr) [n:127.0.0.1:63512_solr    ] o.a.s.s.ZkIndexSchemaReader A schema change: WatchedEvent state:SyncConnected type:NodeDataChanged path:/configs/conf1/managed-schema, has occurred - updating schema from ZooKeeper ...
   [junit4]   2> 2209911 INFO  (zkCallback-3644-thread-2-processing-n:127.0.0.1:63513_solr) [n:127.0.0.1:63513_solr    ] o.a.s.s.ZkIndexSchemaReader A schema change: WatchedEvent state:SyncConnected type:NodeDataChanged path:/configs/conf1/managed-schema, has occurred - updating schema from ZooKeeper ...
   [junit4]   2> 2209911 INFO  (zkCallback-3644-thread-1-processing-n:127.0.0.1:63513_solr) [n:127.0.0.1:63513_solr    ] o.a.s.s.ZkIndexSchemaReader A schema change: WatchedEvent state:SyncConnected type:NodeDataChanged path:/configs/conf1/managed-schema, has occurred - updating schema from ZooKeeper ...
   [junit4]   2> 2209912 INFO  (zkCallback-3645-thread-2-processing-n:127.0.0.1:63512_solr) [n:127.0.0.1:63512_solr    ] o.a.s.s.ZkIndexSchemaReader Retrieved schema version 1 from ZooKeeper
   [junit4]   2> 2209912 INFO  (zkCallback-3645-thread-1-processing-n:127.0.0.1:63512_solr) [n:127.0.0.1:63512_solr    ] o.a.s.s.ZkIndexSchemaReader Retrieved schema version 1 from ZooKeeper
   [junit4]   2> 2209912 INFO  (zkCallback-3644-thread-2-processing-n:127.0.0.1:63513_solr) [n:127.0.0.1:63513_solr    ] o.a.s.s.ZkIndexSchemaReader Retrieved schema version 1 from ZooKeeper
   [junit4]   2> 2209913 INFO  (zkCallback-3645-thread-2-processing-n:127.0.0.1:63512_solr) [n:127.0.0.1:63512_solr    ] o.a.s.s.IndexSchema [dv_coll_shard4_replica_n1] Schema name=minimal
   [junit4]   2> 2209913 INFO  (zkCallback-3644-thread-2-processing-n:127.0.0.1:63513_solr) [n:127.0.0.1:63513_solr    ] o.a.s.s.IndexSchema [dv_coll_shard1_replica_n1] Schema name=minimal
   [junit4]   2> 2209913 INFO  (zkCallback-3645-thread-1-processing-n:127.0.0.1:63512_solr) [n:127.0.0.1:63512_solr    ] o.a.s.s.IndexSchema [dv_coll_shard2_replica_n1] Schema name=minimal
   [junit4]   2> 2209917 INFO  (zkCallback-3645-thread-2-processing-n:127.0.0.1:63512_solr) [n:127.0.0.1:63512_solr    ] o.a.s.s.IndexSchema Loaded schema minimal/1.1 with uniqueid field id
   [junit4]   2> 2209917 INFO  (zkCallback-3645-thread-1-processing-n:127.0.0.1:63512_solr) [n:127.0.0.1:63512_solr    ] o.a.s.s.IndexSchema Loaded schema minimal/1.1 with uniqueid field id
   [junit4]   2> 2209917 INFO  (zkCallback-3645-thread-2-processing-n:127.0.0.1:63512_solr) [n:127.0.0.1:63512_solr    ] o.a.s.s.ZkIndexSchemaReader Finished refreshing schema in 5 ms
   [junit4]   2> 2209917 INFO  (zkCallback-3645-thread-1-processing-n:127.0.0.1:63512_solr) [n:127.0.0.1:63512_solr    ] o.a.s.s.ZkIndexSchemaReader Finished refreshing schema in 5 ms
   [junit4]   2> 2209917 INFO  (zkCallback-3644-thread-2-processing-n:127.0.0.1:63513_solr) [n:127.0.0.1:63513_solr    ] o.a.s.s.IndexSchema Loaded schema minimal/1.1 with uniqueid field id
   [junit4]   2> 2209917 INFO  (zkCallback-3644-thread-2-processing-n:127.0.0.1:63513_solr) [n:127.0.0.1:63513_solr    ] o.a.s.s.ZkIndexSchemaReader Finished refreshing schema in 5 ms
   [junit4]   2> 2209917 INFO  (qtp426833501-20494) [n:127.0.0.1:63513_solr c:dv_coll s:shard3 r:core_node3 x:dv_coll_shard3_replica_n1] o.a.s.c.ZkController Persisted config data to node /configs/conf1/managed-schema 
   [junit4]   2> 2209918 INFO  (Thread-3539) [n:127.0.0.1:63512_solr    ] o.a.s.c.SolrCore config update listener called for core dv_coll_shard4_replica_n1
   [junit4]   2> 2209918 INFO  (Thread-3540) [n:127.0.0.1:63513_solr    ] o.a.s.c.SolrCore config update listener called for core dv_coll_shard1_replica_n1
   [junit4]   2> 2209920 INFO  (Thread-3539) [n:127.0.0.1:63512_solr    ] o.a.s.c.SolrCore config update listener called for core dv_coll_shard2_replica_n1
   [junit4]   2> 2209920 INFO  (Thread-3540) [n:127.0.0.1:63513_solr    ] o.a.s.c.SolrCore config update listener called for core dv_coll_shard3_replica_n1
   [junit4]   2> 2209921 INFO  (Thread-3540) [n:127.0.0.1:63513_solr    ] o.a.s.c.SolrCore core reload dv_coll_shard3_replica_n1
   [junit4]   2> 2209929 INFO  (qtp426833501-20494) [n:127.0.0.1:63513_solr c:dv_coll s:shard3 r:core_node3 x:dv_coll_shard3_replica_n1] o.a.s.c.SolrConfig Using Lucene MatchVersion: 8.0.0
   [junit4]   2> 2209936 INFO  (qtp426833501-20494) [n:127.0.0.1:63513_solr c:dv_coll s:shard3 r:core_node3 x:dv_coll_shard3_replica_n1] o.a.s.s.IndexSchema [dv_coll_shard3_replica_n1] Schema name=minimal
   [junit4]   2> 2209939 INFO  (qtp426833501-20494) [n:127.0.0.1:63513_solr c:dv_coll s:shard3 r:core_node3 x:dv_coll_shard3_replica_n1] o.a.s.s.IndexSchema Loaded schema minimal/1.1 with uniqueid field id
   [junit4]   2> 2209939 INFO  (qtp426833501-20494) [n:127.0.0.1:63513_solr c:dv_coll s:shard3 r:core_node3 x:dv_coll_shard3_replica_n1] o.a.s.c.CoreContainer Reloading SolrCore 'dv_coll_shard3_replica_n1' using configuration from collection dv_coll
   [junit4]   2> 2209945 INFO  (qtp426833501-20494) [n:127.0.0.1:63513_solr c:dv_coll s:shard3 r:core_node3 x:dv_coll_shard3_replica_n1] o.a.s.m.r.SolrJmxReporter JMX monitoring for 'solr_63513.solr.core.dv_coll.shard3.replica_n1' (registry 'solr.core.dv_coll.shard3.replica_n1') enabled at server: com.sun.jmx.mbeanserver.JmxMBeanServer@1337c0ff
   [junit4]   2> 2209945 INFO  (qtp426833501-20494) [n:127.0.0.1:63513_solr c:dv_coll s:shard3 r:core_node3 x:dv_coll_shard3_replica_n1] o.a.s.c.SolrCore [[dv_coll_shard3_replica_n1] ] Opening new SolrCore at [/Users/jenkins/workspace/Lucene-Solr-master-MacOSX/solr/build/solr-core/test/J0/temp/solr.cloud.DocValuesNotIndexedTest_19A3076A21894501-001/tempDir-001/node2/dv_coll_shard3_replica_n1], dataDir=[/Users/jenkins/workspace/Lucene-Solr-master-MacOSX/solr/build/solr-core/test/J0/temp/solr.cloud.DocValuesNotIndexedTest_19A3076A21894501-001/tempDir-001/node2/./dv_coll_shard3_replica_n1/data/]
   [junit4]   2> 2210043 INFO  (qtp426833501-20494) [n:127.0.0.1:63513_solr c:dv_coll s:shard3 r:core_node3 x:dv_coll_shard3_replica_n1] o.a.s.u.CommitTracker Hard AutoCommit: disabled
   [junit4]   2> 2210043 INFO  (qtp426833501-20494) [n:127.0.0.1:63513_solr c:dv_coll s:shard3 r:core_node3 x:dv_coll_shard3_replica_n1] o.a.s.u.CommitTracker Soft AutoCommit: disabled
   [junit4]   2> 2210044 INFO  (qtp426833501-20494) [n:127.0.0.1:63513_solr c:dv_coll s:shard3 r:core_node3 x:dv_coll_shard3_replica_n1] o.a.s.s.SolrIndexSearcher Opening [Searcher@142adec8[dv_coll_shard3_replica_n1] main]
   [junit4]   2> 2210045 INFO  (qtp426833501-20494) [n:127.0.0.1:63513_solr c:dv_coll s:shard3 r:core_node3 x:dv_coll_shard3_replica_n1] o.a.s.r.ManagedResourceStorage Configured ZooKeeperStorageIO with znodeBase: /configs/conf1
   [junit4]   2> 2210046 INFO  (qtp426833501-20494) [n:127.0.0.1:63513_solr c:dv_coll s:shard3 r:core_node3 x:dv_coll_shard3_replica_n1] o.a.s.r.ManagedResourceStorage Loaded null at path _rest_managed.json using ZooKeeperStorageIO:path=/configs/conf1
   [junit4]   2> 2210046 INFO  (qtp426833501-20494) [n:127.0.0.1:63513_solr c:dv_coll s:shard3 r:core_node3 x:dv_coll_shard3_replica_n1] o.a.s.s.ZkIndexSchemaReader Creating ZooKeeper watch for the managed schema at /configs/conf1/managed-schema
   [junit4]   2> 2210047 INFO  (qtp426833501-20494) [n:127.0.0.1:63513_solr c:dv_coll s:shard3 r:core_node3 x:dv_coll_shard3_replica_n1] o.a.s.s.ZkIndexSchemaReader Current schema version 1 is already the latest
   [junit4]   2> 2210047 INFO  (qtp426833501-20494) [n:127.0.0.1:63513_solr c:dv_coll s:shard3 r:core_node3 x:dv_coll_shard3_replica_n1] o.a.s.h.ReplicationHandler Commits will be reserved for  10000
   [junit4]   2> 2210047 INFO  (qtp426833501-20494) [n:127.0.0.1:63513_solr c:dv_coll s:shard3 r:core_node3 x:dv_coll_shard3_replica_n1] o.a.s.u.UpdateLog Could not find max version in index or recent updates, using new clock 1571979409777229824
   [junit4]   2> 2210048 INFO  (searcherExecutor-7334-thread-1-processing-n:127.0.0.1:63513_solr x:dv_coll_shard3_replica_n1 s:shard3 c:dv_coll r:core_node3) [n:127.0.0.1:63513_solr c:dv_coll s:shard3 r:core_node3 x:dv_coll_shard3_replica_n1] o.a.s.c.SolrCore [dv_coll_shard3_replica_n1] Registered new searcher Searcher@142adec8[dv_coll_shard3_replica_n1] main{ExitableDirectoryReader(UninvertingDirectoryReader())}
   [junit4]   2> 2210049 INFO  (qtp426833501-20494) [n:127.0.0.1:63513_solr c:dv_coll s:shard3 r:core_node3 x:dv_coll_shard3_replica_n1] o.a.s.u.DefaultSolrCoreState New IndexWriter is ready to be used.
   [junit4]   2> 2210049 INFO  (qtp426833501-20494) [n:127.0.0.1:63513_solr c:dv_coll s:shard3 r:core_node3 x:dv_coll_shard3_replica_n1] o.a.s.s.SolrIndexSearcher Opening [Searcher@391f02f1[dv_coll_shard3_replica_n1] main]
   [junit4]   2> 2210050 INFO  (zkCallback-3644-thread-1-processing-n:127.0.0.1:63513_solr) [n:127.0.0.1:63513_solr    ] o.a.s.s.ZkIndexSchemaReader Retrieved schema version 1 from ZooKeeper
   [junit4]   2> 2210050 INFO  (searcherExecutor-7334-thread-1-processing-n:127.0.0.1:63513_solr x:dv_coll_shard3_replica_n1 s:shard3 c:dv_coll r:core_node3) [n:127.0.0.1:63513_solr c:dv_coll s:shard3 r:core_node3 x:dv_coll_shard3_replica_n1] o.a.s.c.SolrCore [dv_coll_shard3_replica_n1] Registered new searcher Searcher@391f02f1[dv_coll_shard3_replica_n1] main{ExitableDirectoryReader(UninvertingDirectoryReader())}
   [junit4]   2> 2210050 INFO  (qtp426833501-20494) [n:127.0.0.1:63513_solr c:dv_coll s:shard3 r:core_node3 x:dv_coll_shard3_replica_n1] o.a.s.s.ManagedIndexSchema Waiting up to 599 secs for 3 replicas to apply schema update version 1 for collection dv_coll
   [junit4]   2> 2210054 INFO  (zkCallback-3644-thread-1-processing-n:127.0.0.1:63513_solr) [n:127.0.0.1:63513_solr    ] o.a.s.s.IndexSchema [dv_coll_shard3_replica_n1] Schema name=minimal
   [junit4]   2> 2210054 INFO  (qtp1314606546-20497) [n:127.0.0.1:63512_solr c:dv_coll s:shard2 r:core_node2 x:dv_coll_shard2_replica_n1] o.a.s.c.S.Request [dv_coll_shard2_replica_n1]  webapp=/solr path=/schema/zkversion params={refreshIfBelowVersion=1&wt=javabin&version=2} status=0 QTime=0
   [junit4]   2> 2210057 INFO  (Thread-3540) [n:127.0.0.1:63513_solr    ] o.a.s.c.SolrConfig Using Lucene MatchVersion: 8.0.0
   [junit4]   2> 2210057 INFO  (qtp1314606546-20498) [n:127.0.0.1:63512_solr c:dv_coll s:shard4 r:core_node4 x:dv_coll_shard4_replica_n1] o.a.s.c.S.Request [dv_coll_shard4_replica_n1]  webapp=/solr path=/schema/zkversion params={refreshIfBelowVersion=1&wt=javabin&version=2} status=0 QTime=0
   [junit4]   2> 2210059 INFO  (zkCallback-3644-thread-1-processing-n:127.0.0.1:63513_solr) [n:127.0.0.1:63513_solr    ] o.a.s.s.IndexSchema Loaded schema minimal/1.1 with uniqueid field id
   [junit4]   2> 2210059 INFO  (zkCallback-3644-thread-1-processing-n:127.0.0.1:63513_solr) [n:127.0.0.1:63513_solr    ] o.a.s.s.ZkIndexSchemaReader Finished refreshing schema in 9 ms
   [junit4]   2> 2210060 INFO  (qtp426833501-20501) [n:127.0.0.1:63513_solr c:dv_coll s:shard1 r:core_node1 x:dv_coll_shard1_replica_n1] o.a.s.c.S.Request [dv_coll_shard1_replica_n1]  webapp=/solr path=/schema/zkversion params={refreshIfBelowVersion=1&wt=javabin&version=2} status=0 QTime=0
   [junit4]   2> 2210062 INFO  (qtp426833501-20494) [n:127.0.0.1:63513_solr c:dv_coll s:shard3 r:core_node3 x:dv_coll_shard3_replica_n1] o.a.s.s.ManagedIndexSchema Took 12.0ms for 3 replicas to apply schema update version 1 for collection dv_coll
   [junit4]   2> 2210062 INFO  (qtp426833501-20494) [n:127.0.0.1:63513_solr c:dv_coll s:shard3 r:core_node3 x:dv_coll_shard3_replica_n1] o.a.s.c.S.Request [dv_coll_shard3_replica_n1]  webapp=/solr path=/schema params={wt=javabin&version=2} status=0 QTime=214
   [junit4]   2> 2210062 INFO  (qtp426833501-20494) [n:127.0.0.1:63513_solr c:dv_coll s:shard3 r:core_node3 x:dv_coll_shard3_replica_n1] o.a.s.c.SolrCore [dv_coll_shard3_replica_n1]  CLOSING SolrCore org.apache.solr.core.SolrCore@1b76d9ef
   [junit4]   2> 2210062 INFO  (qtp426833501-20494) [n:127.0.0.1:63513_solr c:dv_coll s:shard3 r:core_node3 x:dv_coll_shard3_replica_n1] o.a.s.m.SolrMetricManager Closing metric reporters for registry=solr.core.dv_coll.shard3.replica_n1, tag=460773871
   [junit4]   2> 2210064 INFO  (Thread-3540) [n:127.0.0.1:63513_solr    ] o.a.s.s.IndexSchema [dv_coll_shard3_replica_n1] Schema name=minimal
   [junit4]   2> 2210065 INFO  (qtp426833501-20494) [n:127.0.0.1:63513_solr c:dv_coll s:shard3 r:core_node3 x:dv_coll_shard3_replica_n1] o.a.s.m.SolrMetricManager Closing metric reporters for registry=solr.collection.dv_coll.shard3.leader, tag=460773871
   [junit4]   2> 2210067 INFO  (Thread-3540) [n:127.0.0.1:63513_solr    ] o.a.s.s.IndexSchema Loaded schema minimal/1.1 with uniqueid field id
   [junit4]   2> 2210068 INFO  (Thread-3540) [n:127.0.0.1:63513_solr    ] o.a.s.c.CoreContainer Reloading SolrCore 'dv_coll_shard3_replica_n1' using configuration from collection dv_coll
   [junit4]   2> 2210082 INFO  (TEST-DocValuesNotIndexedTest.testDistribFaceting-seed#[19A3076A21894501]) [    ] o.a.s.SolrTestCaseJ4 ###Starting testDistribFaceting
   [junit4]   2> 2210086 INFO  (qtp426833501-20493) [n:127.0.0.1:63513_solr c:dv_coll s:shard1 r:core_node1 x:dv_coll_shard1_replica_n1] o.a.s.u.p.LogUpdateProcessorFactory [dv_coll_shard1_replica_n1]  webapp=/solr path=/update params={update.distrib=TOLEADER&distrib.from=http://127.0.0.1:63512/solr/dv_coll_shard2_replica_n1/&wt=javabin&version=2}{deleteByQuery=*:* (-1571979409817075712)} 0 1
   [junit4]   2> 2210086 INFO  (Thread-3540) [n:127.0.0.1:63513_solr c:dv_coll s:shard3 r:core_node3 x:dv_coll_shard3_replica_n1] o.a.s.m.r.SolrJmxReporter JMX monitoring for 'solr_63513.solr.core.dv_coll.shard3.replica_n1' (registry 'solr.core.dv_coll.shard3.replica_n1') enabled at server: com.sun.jmx.mbeanserver.JmxMBeanServer@1337c0ff
   [junit4]   2> 2210086 INFO  (Thread-3540) [n:127.0.0.1:63513_solr c:dv_coll s:shard3 r:core_node3 x:dv_coll_shard3_replica_n1] o.a.s.c.SolrCore [[dv_coll_shard3_replica_n1] ] Opening new SolrCore at [/Users/jenkins/workspace/Lucene-Solr-master-MacOSX/solr/build/solr-core/test/J0/temp/solr.cloud.DocValuesNotIndexedTest_19A3076A21894501-001/tempDir-001/node2/dv_coll_shard3_replica_n1], dataDir=[/Users/jenkins/workspace/Lucene-Solr-master-MacOSX/solr/build/solr-core/test/J0/temp/solr.cloud.DocValuesNotIndexedTest_19A3076A21894501-001/tempDir-001/node2/./dv_coll_shard3_replica_n1/data/]
   [junit4]   2> 2210089 INFO  (qtp1314606546-20496) [n:127.0.0.1:63512_solr c:dv_coll s:shard4 r:core_node4 x:dv_coll_shard4_replica_n1] o.a.s.u.p.LogUpdateProcessorFactory [dv_coll_shard4_replica_n1]  webapp=/solr path=/update params={update.distrib=TOLEADER&distrib.from=http://127.0.0.1:63512/solr/dv_coll_shard2_replica_n1/&wt=javabin&version=2}{deleteByQuery=*:* (-1571979409819172864)} 0 1
   [junit4]   2> 2210090 INFO  (qtp426833501-20492) [n:127.0.0.1:63513_solr c:dv_coll s:shard3 r:core_node3 x:dv_coll_shard3_replica_n1] o.a.s.u.p.LogUpdateProcessorFactory [dv_coll_shard3_replica_n1]  webapp=/solr path=/update params={update.distrib=TOLEADER&distrib.from=http://127.0.0.1:63512/solr/dv_coll_shard2_replica_n1/&wt=javabin&version=2}{deleteByQuery=*:* (-1571979409821270016)} 0 1
   [junit4]   2> 2210091 INFO  (qtp1314606546-20495) [n:127.0.0.1:63512_solr c:dv_coll s:shard2 r:core_node2 x:dv_coll_shard2_replica_n1] o.a.s.u.p.LogUpdateProcessorFactory [dv_coll_shard2_replica_n1]  webapp=/solr path=/update params={wt=javabin&version=2}{deleteByQuery=*:* (-1571979409814978560)} 0 7
   [junit4]   2> 2210092 INFO  (qtp426833501-20491) [n:127.0.0.1:63513_solr c:dv_coll s:shard1 r:core_node1 x:dv_coll_shard1_replica_n1] o.a.s.u.DirectUpdateHandler2 start commit{_version_=1571979409824415744,optimize=false,openSearcher=true,waitSearcher=true,e

[...truncated too long message...]

x:collection1] o.a.s.m.SolrMetricManager Closing metric reporters for registry=solr.core.collection1, tag=177443713
   [junit4]   2> 2879150 INFO  (TEST-SpatialHeatmapFacetsTest.testPng-seed#[19A3076A21894501]) [    ] o.e.j.s.h.ContextHandler Stopped o.e.j.s.ServletContextHandler@4b2178cc{/,null,UNAVAILABLE}
   [junit4]   2> 2879151 INFO  (TEST-SpatialHeatmapFacetsTest.testPng-seed#[19A3076A21894501]) [    ] o.e.j.s.AbstractConnector Stopped ServerConnector@33ad1264{HTTP/1.1,[http/1.1]}{127.0.0.1:0}
   [junit4]   2> 2879152 INFO  (TEST-SpatialHeatmapFacetsTest.testPng-seed#[19A3076A21894501]) [    ] o.a.s.c.CoreContainer Shutting down CoreContainer instance=630541794
   [junit4]   2> 2879171 INFO  (TEST-SpatialHeatmapFacetsTest.testPng-seed#[19A3076A21894501]) [    ] o.a.s.m.SolrMetricManager Closing metric reporters for registry=solr.node, tag=null
   [junit4]   2> 2879171 INFO  (TEST-SpatialHeatmapFacetsTest.testPng-seed#[19A3076A21894501]) [    ] o.a.s.m.SolrMetricManager Closing metric reporters for registry=solr.jvm, tag=null
   [junit4]   2> 2879172 INFO  (TEST-SpatialHeatmapFacetsTest.testPng-seed#[19A3076A21894501]) [    ] o.a.s.m.SolrMetricManager Closing metric reporters for registry=solr.jetty, tag=null
   [junit4]   2> 2879172 INFO  (TEST-SpatialHeatmapFacetsTest.testPng-seed#[19A3076A21894501]) [    ] o.a.s.c.TransientSolrCoreCacheDefault Allocating transient cache for 4 transient cores
   [junit4]   2> 2879172 INFO  (coreCloseExecutor-9841-thread-1) [    x:collection1] o.a.s.c.SolrCore [collection1]  CLOSING SolrCore org.apache.solr.core.SolrCore@35dfedca
   [junit4]   2> 2879173 INFO  (coreCloseExecutor-9841-thread-1) [    x:collection1] o.a.s.m.SolrMetricManager Closing metric reporters for registry=solr.core.collection1, tag=903867850
   [junit4]   2> 2879173 INFO  (TEST-SpatialHeatmapFacetsTest.testPng-seed#[19A3076A21894501]) [    ] o.e.j.s.h.ContextHandler Stopped o.e.j.s.ServletContextHandler@6a8d7a90{/,null,UNAVAILABLE}
   [junit4]   2> 2879174 INFO  (TEST-SpatialHeatmapFacetsTest.testPng-seed#[19A3076A21894501]) [    ] o.e.j.s.AbstractConnector Stopped ServerConnector@2fd66237{HTTP/1.1,[http/1.1]}{127.0.0.1:0}
   [junit4]   2> 2879174 INFO  (TEST-SpatialHeatmapFacetsTest.testPng-seed#[19A3076A21894501]) [    ] o.a.s.c.CoreContainer Shutting down CoreContainer instance=1389204222
   [junit4]   2> 2879175 INFO  (TEST-SpatialHeatmapFacetsTest.testPng-seed#[19A3076A21894501]) [    ] o.a.s.m.SolrMetricManager Closing metric reporters for registry=solr.node, tag=null
   [junit4]   2> 2879175 INFO  (TEST-SpatialHeatmapFacetsTest.testPng-seed#[19A3076A21894501]) [    ] o.a.s.m.SolrMetricManager Closing metric reporters for registry=solr.jvm, tag=null
   [junit4]   2> 2879175 INFO  (TEST-SpatialHeatmapFacetsTest.testPng-seed#[19A3076A21894501]) [    ] o.a.s.m.SolrMetricManager Closing metric reporters for registry=solr.jetty, tag=null
   [junit4]   2> 2879175 INFO  (TEST-SpatialHeatmapFacetsTest.testPng-seed#[19A3076A21894501]) [    ] o.a.s.c.TransientSolrCoreCacheDefault Allocating transient cache for 4 transient cores
   [junit4]   2> 2879176 INFO  (coreCloseExecutor-9843-thread-1) [    x:collection1] o.a.s.c.SolrCore [collection1]  CLOSING SolrCore org.apache.solr.core.SolrCore@361dec4c
   [junit4]   2> 2879176 INFO  (coreCloseExecutor-9843-thread-1) [    x:collection1] o.a.s.m.SolrMetricManager Closing metric reporters for registry=solr.core.collection1, tag=907930700
   [junit4]   2> 2879177 INFO  (TEST-SpatialHeatmapFacetsTest.testPng-seed#[19A3076A21894501]) [    ] o.e.j.s.h.ContextHandler Stopped o.e.j.s.ServletContextHandler@349f9749{/,null,UNAVAILABLE}
   [junit4]   2> NOTE: leaving temporary files on disk at: /Users/jenkins/workspace/Lucene-Solr-master-MacOSX/solr/build/solr-core/test/J0/temp/solr.handler.component.SpatialHeatmapFacetsTest_19A3076A21894501-001
   [junit4]   2> NOTE: test params are: codec=Asserting(Lucene70): {}, docValues:{}, maxPointsInLeafNode=1717, maxMBSortInHeap=5.3817202877115085, sim=RandomSimilarity(queryNorm=false): {}, locale=lt, timezone=Europe/Riga
   [junit4]   2> NOTE: Mac OS X 10.11.6 x86_64/Oracle Corporation 1.8.0_131 (64-bit)/cpus=3,threads=1,free=176652080,total=518979584
   [junit4]   2> NOTE: All tests run in this JVM: [CircularListTest, TestLRUStatsCache, SolrSlf4jReporterTest, DisMaxRequestHandlerTest, InfoHandlerTest, RuleEngineTest, SortSpecParsingTest, CdcrBootstrapTest, ForceLeaderTest, TestSubQueryTransformerCrossCore, AnalysisAfterCoreReloadTest, TestPerFieldSimilarityWithDefaultOverride, TestRandomRequestDistribution, CursorPagingTest, TestSlowCompositeReaderWrapper, SolrShardReporterTest, TestSolrCloudSnapshots, ExplicitHLLTest, BlockCacheTest, TestClusterProperties, HardAutoCommitTest, TestDistributedStatsComponentCardinality, TestClassNameShortening, TestSolrConfigHandler, HdfsSyncSliceTest, TestInfoStreamLogging, TestLMDirichletSimilarityFactory, TestNumericRangeQuery64, TestMiniSolrCloudClusterSSL, SuggesterTest, BufferStoreTest, TestConfigsApi, DistributedQueryComponentCustomSortTest, HighlighterConfigTest, CreateCollectionCleanupTest, IndexSchemaTest, TestFieldCacheSort, SyncSliceTest, DistribCursorPagingTest, TestDefaultStatsCache, TestClusterStateMutator, HighlighterMaxOffsetTest, TestConfigSetsAPI, DateMathParserTest, DirectSolrConnectionTest, TestBinaryField, TestCloudPseudoReturnFields, DeleteNodeTest, TestCloudNestedDocsSort, TestFieldSortValues, RequestLoggingTest, TestFieldCollectionResource, RecoveryAfterSoftCommitTest, TestJmxIntegration, WordBreakSolrSpellCheckerTest, SolrIndexSplitterTest, TestRequestStatusCollectionAPI, TestDelegationWithHadoopAuth, TestMaxScoreQueryParser, TestSchemaManager, HdfsRecoveryZkTest, TestSolrConfigHandlerCloud, HLLSerializationTest, TestNRTOpen, CdcrReplicationHandlerTest, BlobRepositoryCloudTest, RecoveryZkTest, HdfsNNFailoverTest, TestSchemaSimilarityResource, TestPullReplicaErrorHandling, SuggesterWFSTTest, URLClassifyProcessorTest, RequiredFieldsTest, TestGroupingSearch, TestFunctionQuery, TestDeleteCollectionOnDownNodes, BlockJoinFacetDistribTest, XsltUpdateRequestHandlerTest, TestQuerySenderListener, TestFuzzyAnalyzedSuggestions, TestSortByMinMaxFunction, TestNamedUpdateProcessors, TestExtendedDismaxParser, SolrCoreTest, InfixSuggestersTest, HdfsBasicDistributedZkTest, ResourceLoaderTest, CollectionReloadTest, WrapperMergePolicyFactoryTest, TestMacroExpander, AtomicUpdateProcessorFactoryTest, TestHttpShardHandlerFactory, ZkCLITest, TestCorePropertiesReload, TestLegacyNumericUtils, TestRTimerTree, TestPolicyCloud, TestComplexPhraseQParserPlugin, AddBlockUpdateTest, UUIDFieldTest, ZkStateWriterTest, PeerSyncTest, TestSolrCloudWithHadoopAuthPlugin, SolrTestCaseJ4Test, TestRestManager, TestLocalFSCloudBackupRestore, BooleanFieldTest, TestHighlightDedupGrouping, DistributedFacetPivotLongTailTest, TestBinaryResponseWriter, SolrMetricManagerTest, TestFieldCacheVsDocValues, PrimUtilsTest, ResponseHeaderTest, SharedFSAutoReplicaFailoverUtilsTest, FieldAnalysisRequestHandlerTest, MinimalSchemaTest, ShufflingReplicaListTransformerTest, LeaderInitiatedRecoveryOnShardRestartTest, DistribJoinFromCollectionTest, TestHdfsUpdateLog, OverseerCollectionConfigSetProcessorTest, RestartWhileUpdatingTest, BasicDistributedZkTest, JSONWriterTest, TestRawTransformer, TestDynamicLoading, DistanceFunctionTest, TestMaxTokenLenTokenizer, OverseerTest, TestBulkSchemaConcurrent, DistributedFacetExistsSmallTest, DocValuesTest, NotRequiredUniqueKeyTest, TestStressUserVersions, VMParamsZkACLAndCredentialsProvidersTest, TestNumericTerms64, TestMinMaxOnMultiValuedField, MergeStrategyTest, TestSolr4Spatial2, HdfsChaosMonkeySafeLeaderTest, CdcrVersionReplicationTest, CoreAdminRequestStatusTest, TestPushWriter, TestInitQParser, SolrGraphiteReporterTest, ManagedSchemaRoundRobinCloudTest, TestTolerantUpdateProcessorCloud, ClassificationUpdateProcessorTest, QueryElevationComponentTest, DistributedSpellCheckComponentTest, ChaosMonkeySafeLeaderWithPullReplicasTest, CoreAdminHandlerTest, SimpleFacetsTest, SimpleMLTQParserTest, TestAtomicUpdateErrorCases, DeleteInactiveReplicaTest, ResponseLogComponentTest, ReturnFieldsTest, AliasIntegrationTest, TestReqParamsAPI, ConfigSetsAPITest, TestMiniSolrCloudCluster, TestExportWriter, TestStressRecovery, RAMDirectoryFactoryTest, TestIBSimilarityFactory, ClassificationUpdateProcessorFactoryTest, TestSystemCollAutoCreate, DirectUpdateHandlerOptimizeTest, TestManagedSynonymGraphFilterFactory, CollectionTooManyReplicasTest, ChaosMonkeyNothingIsSafeTest, TestScoreJoinQPNoScore, TestManagedStopFilterFactory, RegexBoostProcessorTest, CustomCollectionTest, DeleteReplicaTest, DistributedVersionInfoTest, DocValuesNotIndexedTest, LeaderFailureAfterFreshStartTest, MissingSegmentRecoveryTest, MultiThreadedOCPTest, RollingRestartTest, SharedFSAutoReplicaFailoverTest, SolrCLIZkUtilsTest, SolrCloudExampleTest, SolrXmlInZkTest, TestAuthenticationFramework, TestCloudDeleteByQuery, TestCloudJSONFacetJoinDomain, TestCloudPivotFacet, TestCloudRecovery, TestCollectionAPI, TestConfigSetsAPIExclusivity, TestConfigSetsAPIZkFailure, TestCryptoKeys, TestDownShardTolerantSearch, TestLeaderInitiatedRecoveryThread, TestPrepRecovery, TestRebalanceLeaders, TestRequestForwarding, TestSSLRandomization, TestSegmentSorting, TestSolrCloudWithKerberosAlt, TestStressCloudBlindAtomicUpdates, TestStressLiveNodes, TlogReplayBufferedWhileIndexingTest, TriLevelCompositeIdRoutingTest, ConfigureRecoveryStrategyTest, CoreSorterTest, ExitableDirectoryReaderTest, HdfsDirectoryFactoryTest, QueryResultKeyTest, TestConfigOverlay, TestConfigSetProperties, TestImplicitCoreProperties, TestReloadAndDeleteDocs, TestShardHandlerFactory, TestSolrXml, TestSolrCoreSnapshots, TestHdfsBackupRestoreCore, TestReplicationHandlerBackup, TestSQLHandler, DistributedQueryComponentOptimizationTest, FacetPivotSmallTest, SpatialHeatmapFacetsTest]
   [junit4] Completed [619/725 (4!)] on J0 in 34.88s, 4 tests, 1 error <<< FAILURES!

[...truncated 43674 lines...]

[JENKINS] Lucene-Solr-master-MacOSX (64bit/jdk1.8.0) - Build # 4130 - Still Unstable!

Posted by Policeman Jenkins Server <je...@thetaphi.de>.
Build: https://jenkins.thetaphi.de/job/Lucene-Solr-master-MacOSX/4130/
Java: 64bit/jdk1.8.0 -XX:-UseCompressedOops -XX:+UseParallelGC

1 tests failed.
FAILED:  org.apache.solr.cloud.ForceLeaderTest.testReplicasInLIRNoLeader

Error Message:
Doc with id=1 not found in http://127.0.0.1:52640/forceleader_test_collection due to: Path not found: /id; rsp={doc=null}

Stack Trace:
java.lang.AssertionError: Doc with id=1 not found in http://127.0.0.1:52640/forceleader_test_collection due to: Path not found: /id; rsp={doc=null}
	at __randomizedtesting.SeedInfo.seed([AE3D80C267E8D998:48AAB4025E6A20F9]:0)
	at org.junit.Assert.fail(Assert.java:93)
	at org.junit.Assert.assertTrue(Assert.java:43)
	at org.apache.solr.cloud.HttpPartitionTest.assertDocExists(HttpPartitionTest.java:603)
	at org.apache.solr.cloud.HttpPartitionTest.assertDocsExistInAllReplicas(HttpPartitionTest.java:556)
	at org.apache.solr.cloud.ForceLeaderTest.testReplicasInLIRNoLeader(ForceLeaderTest.java:142)
	at sun.reflect.NativeMethodAccessorImpl.invoke0(Native Method)
	at sun.reflect.NativeMethodAccessorImpl.invoke(NativeMethodAccessorImpl.java:62)
	at sun.reflect.DelegatingMethodAccessorImpl.invoke(DelegatingMethodAccessorImpl.java:43)
	at java.lang.reflect.Method.invoke(Method.java:498)
	at com.carrotsearch.randomizedtesting.RandomizedRunner.invoke(RandomizedRunner.java:1713)
	at com.carrotsearch.randomizedtesting.RandomizedRunner$8.evaluate(RandomizedRunner.java:907)
	at com.carrotsearch.randomizedtesting.RandomizedRunner$9.evaluate(RandomizedRunner.java:943)
	at com.carrotsearch.randomizedtesting.RandomizedRunner$10.evaluate(RandomizedRunner.java:957)
	at org.apache.solr.BaseDistributedSearchTestCase$ShardsRepeatRule$ShardsFixedStatement.callStatement(BaseDistributedSearchTestCase.java:993)
	at org.apache.solr.BaseDistributedSearchTestCase$ShardsRepeatRule$ShardsStatement.evaluate(BaseDistributedSearchTestCase.java:968)
	at com.carrotsearch.randomizedtesting.rules.SystemPropertiesRestoreRule$1.evaluate(SystemPropertiesRestoreRule.java:57)
	at org.apache.lucene.util.TestRuleSetupTeardownChained$1.evaluate(TestRuleSetupTeardownChained.java:49)
	at org.apache.lucene.util.AbstractBeforeAfterRule$1.evaluate(AbstractBeforeAfterRule.java:45)
	at org.apache.lucene.util.TestRuleThreadAndTestName$1.evaluate(TestRuleThreadAndTestName.java:48)
	at org.apache.lucene.util.TestRuleIgnoreAfterMaxFailures$1.evaluate(TestRuleIgnoreAfterMaxFailures.java:64)
	at org.apache.lucene.util.TestRuleMarkFailure$1.evaluate(TestRuleMarkFailure.java:47)
	at com.carrotsearch.randomizedtesting.rules.StatementAdapter.evaluate(StatementAdapter.java:36)
	at com.carrotsearch.randomizedtesting.ThreadLeakControl$StatementRunner.run(ThreadLeakControl.java:368)
	at com.carrotsearch.randomizedtesting.ThreadLeakControl.forkTimeoutingTask(ThreadLeakControl.java:817)
	at com.carrotsearch.randomizedtesting.ThreadLeakControl$3.evaluate(ThreadLeakControl.java:468)
	at com.carrotsearch.randomizedtesting.RandomizedRunner.runSingleTest(RandomizedRunner.java:916)
	at com.carrotsearch.randomizedtesting.RandomizedRunner$5.evaluate(RandomizedRunner.java:802)
	at com.carrotsearch.randomizedtesting.RandomizedRunner$6.evaluate(RandomizedRunner.java:852)
	at com.carrotsearch.randomizedtesting.RandomizedRunner$7.evaluate(RandomizedRunner.java:863)
	at com.carrotsearch.randomizedtesting.rules.StatementAdapter.evaluate(StatementAdapter.java:36)
	at com.carrotsearch.randomizedtesting.rules.SystemPropertiesRestoreRule$1.evaluate(SystemPropertiesRestoreRule.java:57)
	at org.apache.lucene.util.AbstractBeforeAfterRule$1.evaluate(AbstractBeforeAfterRule.java:45)
	at com.carrotsearch.randomizedtesting.rules.StatementAdapter.evaluate(StatementAdapter.java:36)
	at org.apache.lucene.util.TestRuleStoreClassName$1.evaluate(TestRuleStoreClassName.java:41)
	at com.carrotsearch.randomizedtesting.rules.NoShadowingOrOverridesOnMethodsRule$1.evaluate(NoShadowingOrOverridesOnMethodsRule.java:40)
	at com.carrotsearch.randomizedtesting.rules.NoShadowingOrOverridesOnMethodsRule$1.evaluate(NoShadowingOrOverridesOnMethodsRule.java:40)
	at com.carrotsearch.randomizedtesting.rules.StatementAdapter.evaluate(StatementAdapter.java:36)
	at com.carrotsearch.randomizedtesting.rules.StatementAdapter.evaluate(StatementAdapter.java:36)
	at com.carrotsearch.randomizedtesting.rules.StatementAdapter.evaluate(StatementAdapter.java:36)
	at org.apache.lucene.util.TestRuleAssertionsRequired$1.evaluate(TestRuleAssertionsRequired.java:53)
	at org.apache.lucene.util.TestRuleMarkFailure$1.evaluate(TestRuleMarkFailure.java:47)
	at org.apache.lucene.util.TestRuleIgnoreAfterMaxFailures$1.evaluate(TestRuleIgnoreAfterMaxFailures.java:64)
	at org.apache.lucene.util.TestRuleIgnoreTestSuites$1.evaluate(TestRuleIgnoreTestSuites.java:54)
	at com.carrotsearch.randomizedtesting.rules.StatementAdapter.evaluate(StatementAdapter.java:36)
	at com.carrotsearch.randomizedtesting.ThreadLeakControl$StatementRunner.run(ThreadLeakControl.java:368)
	at java.lang.Thread.run(Thread.java:748)




Build Log:
[...truncated 12335 lines...]
   [junit4] Suite: org.apache.solr.cloud.ForceLeaderTest
   [junit4]   2> 2269727 INFO  (SUITE-ForceLeaderTest-seed#[AE3D80C267E8D998]-worker) [    ] o.a.s.SolrTestCaseJ4 SecureRandom sanity checks: test.solr.allowed.securerandom=null & java.security.egd=file:/dev/./urandom
   [junit4]   2> Creating dataDir: /Users/jenkins/workspace/Lucene-Solr-master-MacOSX/solr/build/solr-core/test/J1/temp/solr.cloud.ForceLeaderTest_AE3D80C267E8D998-001/init-core-data-001
   [junit4]   2> 2269728 WARN  (SUITE-ForceLeaderTest-seed#[AE3D80C267E8D998]-worker) [    ] o.a.s.SolrTestCaseJ4 startTrackingSearchers: numOpens=38 numCloses=38
   [junit4]   2> 2269728 INFO  (SUITE-ForceLeaderTest-seed#[AE3D80C267E8D998]-worker) [    ] o.a.s.SolrTestCaseJ4 Using TrieFields (NUMERIC_POINTS_SYSPROP=false) w/NUMERIC_DOCVALUES_SYSPROP=false
   [junit4]   2> 2269732 INFO  (SUITE-ForceLeaderTest-seed#[AE3D80C267E8D998]-worker) [    ] o.a.s.SolrTestCaseJ4 Randomized ssl (false) and clientAuth (false) via: @org.apache.solr.SolrTestCaseJ4$SuppressSSL(bugUrl=https://issues.apache.org/jira/browse/SOLR-5776) w/ MAC_OS_X supressed clientAuth
   [junit4]   2> 2269732 INFO  (SUITE-ForceLeaderTest-seed#[AE3D80C267E8D998]-worker) [    ] o.a.s.BaseDistributedSearchTestCase Setting hostContext system property: /
   [junit4]   2> 2269732 INFO  (TEST-ForceLeaderTest.testReplicasInLIRNoLeader-seed#[AE3D80C267E8D998]) [    ] o.a.s.c.ZkTestServer STARTING ZK TEST SERVER
   [junit4]   2> 2269732 INFO  (Thread-3607) [    ] o.a.s.c.ZkTestServer client port:0.0.0.0/0.0.0.0:0
   [junit4]   2> 2269732 INFO  (Thread-3607) [    ] o.a.s.c.ZkTestServer Starting server
   [junit4]   2> 2269739 ERROR (Thread-3607) [    ] o.a.z.s.ZooKeeperServer ZKShutdownHandler is not registered, so ZooKeeper server won't take any action on ERROR or SHUTDOWN server state changes
   [junit4]   2> 2269837 INFO  (TEST-ForceLeaderTest.testReplicasInLIRNoLeader-seed#[AE3D80C267E8D998]) [    ] o.a.s.c.ZkTestServer start zk server on port:52615
   [junit4]   2> 2269897 INFO  (TEST-ForceLeaderTest.testReplicasInLIRNoLeader-seed#[AE3D80C267E8D998]) [    ] o.a.s.c.AbstractZkTestCase put /Users/jenkins/workspace/Lucene-Solr-master-MacOSX/solr/core/src/test-files/solr/collection1/conf/solrconfig-tlog.xml to /configs/conf1/solrconfig.xml
   [junit4]   2> 2269901 INFO  (TEST-ForceLeaderTest.testReplicasInLIRNoLeader-seed#[AE3D80C267E8D998]) [    ] o.a.s.c.AbstractZkTestCase put /Users/jenkins/workspace/Lucene-Solr-master-MacOSX/solr/core/src/test-files/solr/collection1/conf/schema.xml to /configs/conf1/schema.xml
   [junit4]   2> 2269906 INFO  (TEST-ForceLeaderTest.testReplicasInLIRNoLeader-seed#[AE3D80C267E8D998]) [    ] o.a.s.c.AbstractZkTestCase put /Users/jenkins/workspace/Lucene-Solr-master-MacOSX/solr/core/src/test-files/solr/collection1/conf/solrconfig.snippet.randomindexconfig.xml to /configs/conf1/solrconfig.snippet.randomindexconfig.xml
   [junit4]   2> 2269910 INFO  (TEST-ForceLeaderTest.testReplicasInLIRNoLeader-seed#[AE3D80C267E8D998]) [    ] o.a.s.c.AbstractZkTestCase put /Users/jenkins/workspace/Lucene-Solr-master-MacOSX/solr/core/src/test-files/solr/collection1/conf/stopwords.txt to /configs/conf1/stopwords.txt
   [junit4]   2> 2269913 INFO  (TEST-ForceLeaderTest.testReplicasInLIRNoLeader-seed#[AE3D80C267E8D998]) [    ] o.a.s.c.AbstractZkTestCase put /Users/jenkins/workspace/Lucene-Solr-master-MacOSX/solr/core/src/test-files/solr/collection1/conf/protwords.txt to /configs/conf1/protwords.txt
   [junit4]   2> 2269916 INFO  (TEST-ForceLeaderTest.testReplicasInLIRNoLeader-seed#[AE3D80C267E8D998]) [    ] o.a.s.c.AbstractZkTestCase put /Users/jenkins/workspace/Lucene-Solr-master-MacOSX/solr/core/src/test-files/solr/collection1/conf/currency.xml to /configs/conf1/currency.xml
   [junit4]   2> 2269919 INFO  (TEST-ForceLeaderTest.testReplicasInLIRNoLeader-seed#[AE3D80C267E8D998]) [    ] o.a.s.c.AbstractZkTestCase put /Users/jenkins/workspace/Lucene-Solr-master-MacOSX/solr/core/src/test-files/solr/collection1/conf/enumsConfig.xml to /configs/conf1/enumsConfig.xml
   [junit4]   2> 2269922 INFO  (TEST-ForceLeaderTest.testReplicasInLIRNoLeader-seed#[AE3D80C267E8D998]) [    ] o.a.s.c.AbstractZkTestCase put /Users/jenkins/workspace/Lucene-Solr-master-MacOSX/solr/core/src/test-files/solr/collection1/conf/open-exchange-rates.json to /configs/conf1/open-exchange-rates.json
   [junit4]   2> 2269925 INFO  (TEST-ForceLeaderTest.testReplicasInLIRNoLeader-seed#[AE3D80C267E8D998]) [    ] o.a.s.c.AbstractZkTestCase put /Users/jenkins/workspace/Lucene-Solr-master-MacOSX/solr/core/src/test-files/solr/collection1/conf/mapping-ISOLatin1Accent.txt to /configs/conf1/mapping-ISOLatin1Accent.txt
   [junit4]   2> 2269927 INFO  (TEST-ForceLeaderTest.testReplicasInLIRNoLeader-seed#[AE3D80C267E8D998]) [    ] o.a.s.c.AbstractZkTestCase put /Users/jenkins/workspace/Lucene-Solr-master-MacOSX/solr/core/src/test-files/solr/collection1/conf/old_synonyms.txt to /configs/conf1/old_synonyms.txt
   [junit4]   2> 2269930 INFO  (TEST-ForceLeaderTest.testReplicasInLIRNoLeader-seed#[AE3D80C267E8D998]) [    ] o.a.s.c.AbstractZkTestCase put /Users/jenkins/workspace/Lucene-Solr-master-MacOSX/solr/core/src/test-files/solr/collection1/conf/synonyms.txt to /configs/conf1/synonyms.txt
   [junit4]   2> 2269934 INFO  (TEST-ForceLeaderTest.testReplicasInLIRNoLeader-seed#[AE3D80C267E8D998]) [    ] o.a.s.c.AbstractFullDistribZkTestBase Will use TLOG replicas unless explicitly asked otherwise
   [junit4]   2> 2270567 INFO  (TEST-ForceLeaderTest.testReplicasInLIRNoLeader-seed#[AE3D80C267E8D998]) [    ] o.e.j.s.Server jetty-9.3.20.v20170531
   [junit4]   2> 2270569 INFO  (TEST-ForceLeaderTest.testReplicasInLIRNoLeader-seed#[AE3D80C267E8D998]) [    ] o.e.j.s.h.ContextHandler Started o.e.j.s.ServletContextHandler@380a5028{/,null,AVAILABLE}
   [junit4]   2> 2270570 INFO  (TEST-ForceLeaderTest.testReplicasInLIRNoLeader-seed#[AE3D80C267E8D998]) [    ] o.e.j.s.AbstractConnector Started ServerConnector@254873ef{HTTP/1.1,[http/1.1]}{127.0.0.1:52619}
   [junit4]   2> 2270570 INFO  (TEST-ForceLeaderTest.testReplicasInLIRNoLeader-seed#[AE3D80C267E8D998]) [    ] o.e.j.s.Server Started @2274311ms
   [junit4]   2> 2270570 INFO  (TEST-ForceLeaderTest.testReplicasInLIRNoLeader-seed#[AE3D80C267E8D998]) [    ] o.a.s.c.s.e.JettySolrRunner Jetty properties: {solr.data.dir=/Users/jenkins/workspace/Lucene-Solr-master-MacOSX/solr/build/solr-core/test/J1/temp/solr.cloud.ForceLeaderTest_AE3D80C267E8D998-001/tempDir-001/control/data, replicaType=NRT, hostContext=/, hostPort=52618, coreRootDirectory=/Users/jenkins/workspace/Lucene-Solr-master-MacOSX/solr/build/solr-core/test/J1/temp/solr.cloud.ForceLeaderTest_AE3D80C267E8D998-001/control-001/cores}
   [junit4]   2> 2270571 ERROR (TEST-ForceLeaderTest.testReplicasInLIRNoLeader-seed#[AE3D80C267E8D998]) [    ] o.a.s.s.StartupLoggingUtils Missing Java Option solr.log.dir. Logging may be missing or incomplete.
   [junit4]   2> 2270571 INFO  (TEST-ForceLeaderTest.testReplicasInLIRNoLeader-seed#[AE3D80C267E8D998]) [    ] o.a.s.s.SolrDispatchFilter  ___      _       Welcome to Apache Solr™ version 8.0.0
   [junit4]   2> 2270571 INFO  (TEST-ForceLeaderTest.testReplicasInLIRNoLeader-seed#[AE3D80C267E8D998]) [    ] o.a.s.s.SolrDispatchFilter / __| ___| |_ _   Starting in cloud mode on port null
   [junit4]   2> 2270571 INFO  (TEST-ForceLeaderTest.testReplicasInLIRNoLeader-seed#[AE3D80C267E8D998]) [    ] o.a.s.s.SolrDispatchFilter \__ \/ _ \ | '_|  Install dir: null, Default config dir: null
   [junit4]   2> 2270571 INFO  (TEST-ForceLeaderTest.testReplicasInLIRNoLeader-seed#[AE3D80C267E8D998]) [    ] o.a.s.s.SolrDispatchFilter |___/\___/_|_|    Start time: 2017-08-19T00:58:24.406Z
   [junit4]   2> 2270574 INFO  (TEST-ForceLeaderTest.testReplicasInLIRNoLeader-seed#[AE3D80C267E8D998]) [    ] o.a.s.s.SolrDispatchFilter Loading solr.xml from SolrHome (not found in ZooKeeper)
   [junit4]   2> 2270574 INFO  (TEST-ForceLeaderTest.testReplicasInLIRNoLeader-seed#[AE3D80C267E8D998]) [    ] o.a.s.c.SolrXmlConfig Loading container configuration from /Users/jenkins/workspace/Lucene-Solr-master-MacOSX/solr/build/solr-core/test/J1/temp/solr.cloud.ForceLeaderTest_AE3D80C267E8D998-001/control-001/solr.xml
   [junit4]   2> 2270582 INFO  (TEST-ForceLeaderTest.testReplicasInLIRNoLeader-seed#[AE3D80C267E8D998]) [    ] o.a.s.c.SolrXmlConfig MBean server found: com.sun.jmx.mbeanserver.JmxMBeanServer@33a2bc0, but no JMX reporters were configured - adding default JMX reporter.
   [junit4]   2> 2270588 INFO  (TEST-ForceLeaderTest.testReplicasInLIRNoLeader-seed#[AE3D80C267E8D998]) [    ] o.a.s.c.ZkContainer Zookeeper client=127.0.0.1:52615/solr
   [junit4]   2> 2270740 INFO  (TEST-ForceLeaderTest.testReplicasInLIRNoLeader-seed#[AE3D80C267E8D998]) [n:127.0.0.1:52618_    ] o.a.s.c.Overseer Overseer (id=null) closing
   [junit4]   2> 2270741 INFO  (TEST-ForceLeaderTest.testReplicasInLIRNoLeader-seed#[AE3D80C267E8D998]) [n:127.0.0.1:52618_    ] o.a.s.c.OverseerElectionContext I am going to be the leader 127.0.0.1:52618_
   [junit4]   2> 2270743 INFO  (TEST-ForceLeaderTest.testReplicasInLIRNoLeader-seed#[AE3D80C267E8D998]) [n:127.0.0.1:52618_    ] o.a.s.c.Overseer Overseer (id=98507443638960132-127.0.0.1:52618_-n_0000000000) starting
   [junit4]   2> 2270754 INFO  (TEST-ForceLeaderTest.testReplicasInLIRNoLeader-seed#[AE3D80C267E8D998]) [n:127.0.0.1:52618_    ] o.a.s.c.ZkController Register node as live in ZooKeeper:/live_nodes/127.0.0.1:52618_
   [junit4]   2> 2270755 INFO  (zkCallback-2817-thread-1-processing-n:127.0.0.1:52618_) [n:127.0.0.1:52618_    ] o.a.s.c.c.ZkStateReader Updated live nodes from ZooKeeper... (0) -> (1)
   [junit4]   2> 2270856 INFO  (TEST-ForceLeaderTest.testReplicasInLIRNoLeader-seed#[AE3D80C267E8D998]) [n:127.0.0.1:52618_    ] o.a.s.m.r.SolrJmxReporter JMX monitoring for 'solr.node' (registry 'solr.node') enabled at server: com.sun.jmx.mbeanserver.JmxMBeanServer@33a2bc0
   [junit4]   2> 2270862 INFO  (TEST-ForceLeaderTest.testReplicasInLIRNoLeader-seed#[AE3D80C267E8D998]) [n:127.0.0.1:52618_    ] o.a.s.m.r.SolrJmxReporter JMX monitoring for 'solr.jvm' (registry 'solr.jvm') enabled at server: com.sun.jmx.mbeanserver.JmxMBeanServer@33a2bc0
   [junit4]   2> 2270862 INFO  (TEST-ForceLeaderTest.testReplicasInLIRNoLeader-seed#[AE3D80C267E8D998]) [n:127.0.0.1:52618_    ] o.a.s.m.r.SolrJmxReporter JMX monitoring for 'solr.jetty' (registry 'solr.jetty') enabled at server: com.sun.jmx.mbeanserver.JmxMBeanServer@33a2bc0
   [junit4]   2> 2270865 INFO  (TEST-ForceLeaderTest.testReplicasInLIRNoLeader-seed#[AE3D80C267E8D998]) [n:127.0.0.1:52618_    ] o.a.s.c.CorePropertiesLocator Found 0 core definitions underneath /Users/jenkins/workspace/Lucene-Solr-master-MacOSX/solr/build/solr-core/test/J1/temp/solr.cloud.ForceLeaderTest_AE3D80C267E8D998-001/control-001/cores
   [junit4]   2> 2270888 INFO  (TEST-ForceLeaderTest.testReplicasInLIRNoLeader-seed#[AE3D80C267E8D998]) [    ] o.a.s.c.c.ZkStateReader Updated live nodes from ZooKeeper... (0) -> (1)
   [junit4]   2> 2270889 INFO  (TEST-ForceLeaderTest.testReplicasInLIRNoLeader-seed#[AE3D80C267E8D998]) [    ] o.a.s.c.s.i.ZkClientClusterStateProvider Cluster at 127.0.0.1:52615/solr ready
   [junit4]   2> 2270890 INFO  (SocketProxy-Acceptor-52618) [    ] o.a.s.c.SocketProxy accepted Socket[addr=/127.0.0.1,port=52625,localport=52618], receiveBufferSize:408300
   [junit4]   2> 2270890 INFO  (SocketProxy-Acceptor-52618) [    ] o.a.s.c.SocketProxy proxy connection Socket[addr=/127.0.0.1,port=52619,localport=52626], receiveBufferSize=408300
   [junit4]   2> 2270892 INFO  (qtp1273671973-17181) [n:127.0.0.1:52618_    ] o.a.s.h.a.CollectionsHandler Invoked Collection Action :create with params replicationFactor=1&collection.configName=conf1&name=control_collection&nrtReplicas=1&action=CREATE&numShards=1&createNodeSet=127.0.0.1:52618_&wt=javabin&version=2 and sendToOCPQueue=true
   [junit4]   2> 2270894 INFO  (OverseerThreadFactory-8197-thread-1-processing-n:127.0.0.1:52618_) [n:127.0.0.1:52618_    ] o.a.s.c.CreateCollectionCmd Create collection control_collection
   [junit4]   2> 2271003 INFO  (SocketProxy-Acceptor-52618) [    ] o.a.s.c.SocketProxy accepted Socket[addr=/127.0.0.1,port=52627,localport=52618], receiveBufferSize:408300
   [junit4]   2> 2271003 INFO  (SocketProxy-Acceptor-52618) [    ] o.a.s.c.SocketProxy proxy connection Socket[addr=/127.0.0.1,port=52619,localport=52628], receiveBufferSize=408300
   [junit4]   2> 2271004 INFO  (qtp1273671973-17183) [n:127.0.0.1:52618_    ] o.a.s.h.a.CoreAdminOperation core create command qt=/admin/cores&collection.configName=conf1&newCollection=true&name=control_collection_shard1_replica_n1&action=CREATE&numShards=1&collection=control_collection&shard=shard1&wt=javabin&version=2&replicaType=NRT
   [junit4]   2> 2271004 INFO  (qtp1273671973-17183) [n:127.0.0.1:52618_    ] o.a.s.c.TransientSolrCoreCacheDefault Allocating transient cache for 4 transient cores
   [junit4]   2> 2271110 INFO  (zkCallback-2817-thread-1-processing-n:127.0.0.1:52618_) [n:127.0.0.1:52618_    ] o.a.s.c.c.ZkStateReader A cluster state change: [WatchedEvent state:SyncConnected type:NodeDataChanged path:/collections/control_collection/state.json] for collection [control_collection] has occurred - updating... (live nodes size: [1])
   [junit4]   2> 2272022 INFO  (qtp1273671973-17183) [n:127.0.0.1:52618_ c:control_collection s:shard1  x:control_collection_shard1_replica_n1] o.a.s.c.SolrConfig Using Lucene MatchVersion: 8.0.0
   [junit4]   2> 2272040 INFO  (qtp1273671973-17183) [n:127.0.0.1:52618_ c:control_collection s:shard1  x:control_collection_shard1_replica_n1] o.a.s.s.IndexSchema [control_collection_shard1_replica_n1] Schema name=test
   [junit4]   2> 2272122 INFO  (qtp1273671973-17183) [n:127.0.0.1:52618_ c:control_collection s:shard1  x:control_collection_shard1_replica_n1] o.a.s.s.IndexSchema Loaded schema test/1.0 with uniqueid field id
   [junit4]   2> 2272156 INFO  (qtp1273671973-17183) [n:127.0.0.1:52618_ c:control_collection s:shard1  x:control_collection_shard1_replica_n1] o.a.s.c.CoreContainer Creating SolrCore 'control_collection_shard1_replica_n1' using configuration from collection control_collection, trusted=true
   [junit4]   2> 2272156 INFO  (qtp1273671973-17183) [n:127.0.0.1:52618_ c:control_collection s:shard1  x:control_collection_shard1_replica_n1] o.a.s.m.r.SolrJmxReporter JMX monitoring for 'solr.core.control_collection.shard1.replica_n1' (registry 'solr.core.control_collection.shard1.replica_n1') enabled at server: com.sun.jmx.mbeanserver.JmxMBeanServer@33a2bc0
   [junit4]   2> 2272156 INFO  (qtp1273671973-17183) [n:127.0.0.1:52618_ c:control_collection s:shard1  x:control_collection_shard1_replica_n1] o.a.s.c.SolrCore solr.RecoveryStrategy.Builder
   [junit4]   2> 2272156 INFO  (qtp1273671973-17183) [n:127.0.0.1:52618_ c:control_collection s:shard1  x:control_collection_shard1_replica_n1] o.a.s.c.SolrCore [[control_collection_shard1_replica_n1] ] Opening new SolrCore at [/Users/jenkins/workspace/Lucene-Solr-master-MacOSX/solr/build/solr-core/test/J1/temp/solr.cloud.ForceLeaderTest_AE3D80C267E8D998-001/control-001/cores/control_collection_shard1_replica_n1], dataDir=[/Users/jenkins/workspace/Lucene-Solr-master-MacOSX/solr/build/solr-core/test/J1/temp/solr.cloud.ForceLeaderTest_AE3D80C267E8D998-001/control-001/cores/control_collection_shard1_replica_n1/data/]
   [junit4]   2> 2272163 INFO  (qtp1273671973-17183) [n:127.0.0.1:52618_ c:control_collection s:shard1  x:control_collection_shard1_replica_n1] o.a.s.u.RandomMergePolicy RandomMergePolicy wrapping class org.apache.lucene.index.LogDocMergePolicy: [LogDocMergePolicy: minMergeSize=1000, mergeFactor=16, maxMergeSize=9223372036854775807, maxMergeSizeForForcedMerge=9223372036854775807, calibrateSizeByDeletes=false, maxMergeDocs=2147483647, maxCFSSegmentSizeMB=8.796093022207999E12, noCFSRatio=0.17361457499451188]
   [junit4]   2> 2272181 WARN  (qtp1273671973-17183) [n:127.0.0.1:52618_ c:control_collection s:shard1  x:control_collection_shard1_replica_n1] o.a.s.c.RequestHandlers INVALID paramSet a in requestHandler {type = requestHandler,name = /dump,class = DumpRequestHandler,attributes = {initParams=a, name=/dump, class=DumpRequestHandler},args = {defaults={a=A,b=B}}}
   [junit4]   2> 2272258 INFO  (qtp1273671973-17183) [n:127.0.0.1:52618_ c:control_collection s:shard1  x:control_collection_shard1_replica_n1] o.a.s.u.UpdateHandler Using UpdateLog implementation: org.apache.solr.update.UpdateLog
   [junit4]   2> 2272259 INFO  (qtp1273671973-17183) [n:127.0.0.1:52618_ c:control_collection s:shard1  x:control_collection_shard1_replica_n1] o.a.s.u.UpdateLog Initializing UpdateLog: dataDir= defaultSyncLevel=FLUSH numRecordsToKeep=100 maxNumLogsToKeep=10 numVersionBuckets=65536
   [junit4]   2> 2272260 INFO  (qtp1273671973-17183) [n:127.0.0.1:52618_ c:control_collection s:shard1  x:control_collection_shard1_replica_n1] o.a.s.u.CommitTracker Hard AutoCommit: disabled
   [junit4]   2> 2272260 INFO  (qtp1273671973-17183) [n:127.0.0.1:52618_ c:control_collection s:shard1  x:control_collection_shard1_replica_n1] o.a.s.u.CommitTracker Soft AutoCommit: disabled
   [junit4]   2> 2272262 INFO  (qtp1273671973-17183) [n:127.0.0.1:52618_ c:control_collection s:shard1  x:control_collection_shard1_replica_n1] o.a.s.u.RandomMergePolicy RandomMergePolicy wrapping class org.apache.lucene.index.LogByteSizeMergePolicy: [LogByteSizeMergePolicy: minMergeSize=1677721, mergeFactor=47, maxMergeSize=2147483648, maxMergeSizeForForcedMerge=9223372036854775807, calibrateSizeByDeletes=false, maxMergeDocs=2147483647, maxCFSSegmentSizeMB=8.796093022207999E12, noCFSRatio=0.0]
   [junit4]   2> 2272270 INFO  (qtp1273671973-17183) [n:127.0.0.1:52618_ c:control_collection s:shard1  x:control_collection_shard1_replica_n1] o.a.s.s.SolrIndexSearcher Opening [Searcher@16216baf[control_collection_shard1_replica_n1] main]
   [junit4]   2> 2272272 INFO  (qtp1273671973-17183) [n:127.0.0.1:52618_ c:control_collection s:shard1  x:control_collection_shard1_replica_n1] o.a.s.r.ManagedResourceStorage Configured ZooKeeperStorageIO with znodeBase: /configs/conf1
   [junit4]   2> 2272272 INFO  (qtp1273671973-17183) [n:127.0.0.1:52618_ c:control_collection s:shard1  x:control_collection_shard1_replica_n1] o.a.s.r.ManagedResourceStorage Loaded null at path _rest_managed.json using ZooKeeperStorageIO:path=/configs/conf1
   [junit4]   2> 2272273 INFO  (qtp1273671973-17183) [n:127.0.0.1:52618_ c:control_collection s:shard1  x:control_collection_shard1_replica_n1] o.a.s.h.ReplicationHandler Commits will be reserved for  10000
   [junit4]   2> 2272274 INFO  (searcherExecutor-8200-thread-1-processing-n:127.0.0.1:52618_ x:control_collection_shard1_replica_n1 s:shard1 c:control_collection) [n:127.0.0.1:52618_ c:control_collection s:shard1  x:control_collection_shard1_replica_n1] o.a.s.c.SolrCore [control_collection_shard1_replica_n1] Registered new searcher Searcher@16216baf[control_collection_shard1_replica_n1] main{ExitableDirectoryReader(UninvertingDirectoryReader())}
   [junit4]   2> 2272274 INFO  (qtp1273671973-17183) [n:127.0.0.1:52618_ c:control_collection s:shard1  x:control_collection_shard1_replica_n1] o.a.s.u.UpdateLog Could not find max version in index or recent updates, using new clock 1576119100882550784
   [junit4]   2> 2272283 INFO  (qtp1273671973-17183) [n:127.0.0.1:52618_ c:control_collection s:shard1  x:control_collection_shard1_replica_n1] o.a.s.c.ShardLeaderElectionContext Enough replicas found to continue.
   [junit4]   2> 2272284 INFO  (qtp1273671973-17183) [n:127.0.0.1:52618_ c:control_collection s:shard1  x:control_collection_shard1_replica_n1] o.a.s.c.ShardLeaderElectionContext I may be the new leader - try and sync
   [junit4]   2> 2272284 INFO  (qtp1273671973-17183) [n:127.0.0.1:52618_ c:control_collection s:shard1  x:control_collection_shard1_replica_n1] o.a.s.c.SyncStrategy Sync replicas to http://127.0.0.1:52618/control_collection_shard1_replica_n1/
   [junit4]   2> 2272285 INFO  (qtp1273671973-17183) [n:127.0.0.1:52618_ c:control_collection s:shard1  x:control_collection_shard1_replica_n1] o.a.s.c.SyncStrategy Sync Success - now sync replicas to me
   [junit4]   2> 2272285 INFO  (qtp1273671973-17183) [n:127.0.0.1:52618_ c:control_collection s:shard1  x:control_collection_shard1_replica_n1] o.a.s.c.SyncStrategy http://127.0.0.1:52618/control_collection_shard1_replica_n1/ has no replicas
   [junit4]   2> 2272285 INFO  (qtp1273671973-17183) [n:127.0.0.1:52618_ c:control_collection s:shard1  x:control_collection_shard1_replica_n1] o.a.s.c.ShardLeaderElectionContext Found all replicas participating in election, clear LIR
   [junit4]   2> 2272289 INFO  (qtp1273671973-17183) [n:127.0.0.1:52618_ c:control_collection s:shard1  x:control_collection_shard1_replica_n1] o.a.s.c.ShardLeaderElectionContext I am the new leader: http://127.0.0.1:52618/control_collection_shard1_replica_n1/ shard1
   [junit4]   2> 2272395 INFO  (zkCallback-2817-thread-1-processing-n:127.0.0.1:52618_) [n:127.0.0.1:52618_    ] o.a.s.c.c.ZkStateReader A cluster state change: [WatchedEvent state:SyncConnected type:NodeDataChanged path:/collections/control_collection/state.json] for collection [control_collection] has occurred - updating... (live nodes size: [1])
   [junit4]   2> 2272445 INFO  (qtp1273671973-17183) [n:127.0.0.1:52618_ c:control_collection s:shard1  x:control_collection_shard1_replica_n1] o.a.s.c.ZkController I am the leader, no recovery necessary
   [junit4]   2> 2272448 INFO  (qtp1273671973-17183) [n:127.0.0.1:52618_ c:control_collection s:shard1  x:control_collection_shard1_replica_n1] o.a.s.s.HttpSolrCall [admin] webapp=null path=/admin/cores params={qt=/admin/cores&collection.configName=conf1&newCollection=true&name=control_collection_shard1_replica_n1&action=CREATE&numShards=1&collection=control_collection&shard=shard1&wt=javabin&version=2&replicaType=NRT} status=0 QTime=1444
   [junit4]   2> 2272452 INFO  (qtp1273671973-17181) [n:127.0.0.1:52618_    ] o.a.s.h.a.CollectionsHandler Wait for new collection to be active for at most 30 seconds. Check all shard replicas
   [junit4]   2> 2272551 INFO  (zkCallback-2817-thread-1-processing-n:127.0.0.1:52618_) [n:127.0.0.1:52618_    ] o.a.s.c.c.ZkStateReader A cluster state change: [WatchedEvent state:SyncConnected type:NodeDataChanged path:/collections/control_collection/state.json] for collection [control_collection] has occurred - updating... (live nodes size: [1])
   [junit4]   2> 2272898 INFO  (OverseerCollectionConfigSetProcessor-98507443638960132-127.0.0.1:52618_-n_0000000000) [n:127.0.0.1:52618_    ] o.a.s.c.OverseerTaskQueue Response ZK path: /overseer/collection-queue-work/qnr-0000000000 doesn't exist.  Requestor may have disconnected from ZooKeeper
   [junit4]   2> 2273462 INFO  (qtp1273671973-17181) [n:127.0.0.1:52618_    ] o.a.s.s.HttpSolrCall [admin] webapp=null path=/admin/collections params={replicationFactor=1&collection.configName=conf1&name=control_collection&nrtReplicas=1&action=CREATE&numShards=1&createNodeSet=127.0.0.1:52618_&wt=javabin&version=2} status=0 QTime=2569
   [junit4]   2> 2273469 INFO  (TEST-ForceLeaderTest.testReplicasInLIRNoLeader-seed#[AE3D80C267E8D998]) [    ] o.a.s.c.c.ZkStateReader Updated live nodes from ZooKeeper... (0) -> (1)
   [junit4]   2> 2273470 INFO  (TEST-ForceLeaderTest.testReplicasInLIRNoLeader-seed#[AE3D80C267E8D998]) [    ] o.a.s.c.s.i.ZkClientClusterStateProvider Cluster at 127.0.0.1:52615/solr ready
   [junit4]   2> 2273470 INFO  (TEST-ForceLeaderTest.testReplicasInLIRNoLeader-seed#[AE3D80C267E8D998]) [    ] o.a.s.c.ChaosMonkey monkey: init - expire sessions:false cause connection loss:false
   [junit4]   2> 2273471 INFO  (SocketProxy-Acceptor-52618) [    ] o.a.s.c.SocketProxy accepted Socket[addr=/127.0.0.1,port=52630,localport=52618], receiveBufferSize:408300
   [junit4]   2> 2273471 INFO  (SocketProxy-Acceptor-52618) [    ] o.a.s.c.SocketProxy proxy connection Socket[addr=/127.0.0.1,port=52619,localport=52631], receiveBufferSize=408300
   [junit4]   2> 2273472 INFO  (qtp1273671973-17186) [n:127.0.0.1:52618_    ] o.a.s.h.a.CollectionsHandler Invoked Collection Action :create with params replicationFactor=1&collection.configName=conf1&name=collection1&nrtReplicas=1&action=CREATE&numShards=2&createNodeSet=&stateFormat=1&wt=javabin&version=2 and sendToOCPQueue=true
   [junit4]   2> 2273474 INFO  (OverseerThreadFactory-8197-thread-2-processing-n:127.0.0.1:52618_) [n:127.0.0.1:52618_    ] o.a.s.c.CreateCollectionCmd Create collection collection1
   [junit4]   2> 2273476 WARN  (OverseerThreadFactory-8197-thread-2-processing-n:127.0.0.1:52618_) [n:127.0.0.1:52618_    ] o.a.s.c.CreateCollectionCmd It is unusual to create a collection (collection1) without cores.
   [junit4]   2> 2273686 INFO  (qtp1273671973-17186) [n:127.0.0.1:52618_    ] o.a.s.h.a.CollectionsHandler Wait for new collection to be active for at most 30 seconds. Check all shard replicas
   [junit4]   2> 2273686 INFO  (qtp1273671973-17186) [n:127.0.0.1:52618_    ] o.a.s.s.HttpSolrCall [admin] webapp=null path=/admin/collections params={replicationFactor=1&collection.configName=conf1&name=collection1&nrtReplicas=1&action=CREATE&numShards=2&createNodeSet=&stateFormat=1&wt=javabin&version=2} status=0 QTime=214
   [junit4]   2> 2273969 INFO  (TEST-ForceLeaderTest.testReplicasInLIRNoLeader-seed#[AE3D80C267E8D998]) [    ] o.a.s.c.AbstractFullDistribZkTestBase create jetty 1 in directory /Users/jenkins/workspace/Lucene-Solr-master-MacOSX/solr/build/solr-core/test/J1/temp/solr.cloud.ForceLeaderTest_AE3D80C267E8D998-001/shard-1-001 of type TLOG
   [junit4]   2> 2273969 INFO  (TEST-ForceLeaderTest.testReplicasInLIRNoLeader-seed#[AE3D80C267E8D998]) [    ] o.e.j.s.Server jetty-9.3.20.v20170531
   [junit4]   2> 2273970 INFO  (TEST-ForceLeaderTest.testReplicasInLIRNoLeader-seed#[AE3D80C267E8D998]) [    ] o.e.j.s.h.ContextHandler Started o.e.j.s.ServletContextHandler@517a9645{/,null,AVAILABLE}
   [junit4]   2> 2273971 INFO  (TEST-ForceLeaderTest.testReplicasInLIRNoLeader-seed#[AE3D80C267E8D998]) [    ] o.e.j.s.AbstractConnector Started ServerConnector@66355eb4{HTTP/1.1,[http/1.1]}{127.0.0.1:52633}
   [junit4]   2> 2273971 INFO  (TEST-ForceLeaderTest.testReplicasInLIRNoLeader-seed#[AE3D80C267E8D998]) [    ] o.e.j.s.Server Started @2277711ms
   [junit4]   2> 2273971 INFO  (TEST-ForceLeaderTest.testReplicasInLIRNoLeader-seed#[AE3D80C267E8D998]) [    ] o.a.s.c.s.e.JettySolrRunner Jetty properties: {solr.data.dir=/Users/jenkins/workspace/Lucene-Solr-master-MacOSX/solr/build/solr-core/test/J1/temp/solr.cloud.ForceLeaderTest_AE3D80C267E8D998-001/tempDir-001/jetty1, replicaType=TLOG, solrconfig=solrconfig.xml, hostContext=/, hostPort=52632, coreRootDirectory=/Users/jenkins/workspace/Lucene-Solr-master-MacOSX/solr/build/solr-core/test/J1/temp/solr.cloud.ForceLeaderTest_AE3D80C267E8D998-001/shard-1-001/cores}
   [junit4]   2> 2273971 ERROR (TEST-ForceLeaderTest.testReplicasInLIRNoLeader-seed#[AE3D80C267E8D998]) [    ] o.a.s.s.StartupLoggingUtils Missing Java Option solr.log.dir. Logging may be missing or incomplete.
   [junit4]   2> 2273972 INFO  (TEST-ForceLeaderTest.testReplicasInLIRNoLeader-seed#[AE3D80C267E8D998]) [    ] o.a.s.s.SolrDispatchFilter  ___      _       Welcome to Apache Solr™ version 8.0.0
   [junit4]   2> 2273972 INFO  (TEST-ForceLeaderTest.testReplicasInLIRNoLeader-seed#[AE3D80C267E8D998]) [    ] o.a.s.s.SolrDispatchFilter / __| ___| |_ _   Starting in cloud mode on port null
   [junit4]   2> 2273972 INFO  (TEST-ForceLeaderTest.testReplicasInLIRNoLeader-seed#[AE3D80C267E8D998]) [    ] o.a.s.s.SolrDispatchFilter \__ \/ _ \ | '_|  Install dir: null, Default config dir: null
   [junit4]   2> 2273972 INFO  (TEST-ForceLeaderTest.testReplicasInLIRNoLeader-seed#[AE3D80C267E8D998]) [    ] o.a.s.s.SolrDispatchFilter |___/\___/_|_|    Start time: 2017-08-19T00:58:27.807Z
   [junit4]   2> 2273974 INFO  (TEST-ForceLeaderTest.testReplicasInLIRNoLeader-seed#[AE3D80C267E8D998]) [    ] o.a.s.s.SolrDispatchFilter Loading solr.xml from SolrHome (not found in ZooKeeper)
   [junit4]   2> 2273974 INFO  (TEST-ForceLeaderTest.testReplicasInLIRNoLeader-seed#[AE3D80C267E8D998]) [    ] o.a.s.c.SolrXmlConfig Loading container configuration from /Users/jenkins/workspace/Lucene-Solr-master-MacOSX/solr/build/solr-core/test/J1/temp/solr.cloud.ForceLeaderTest_AE3D80C267E8D998-001/shard-1-001/solr.xml
   [junit4]   2> 2273979 INFO  (TEST-ForceLeaderTest.testReplicasInLIRNoLeader-seed#[AE3D80C267E8D998]) [    ] o.a.s.c.SolrXmlConfig MBean server found: com.sun.jmx.mbeanserver.JmxMBeanServer@33a2bc0, but no JMX reporters were configured - adding default JMX reporter.
   [junit4]   2> 2273983 INFO  (TEST-ForceLeaderTest.testReplicasInLIRNoLeader-seed#[AE3D80C267E8D998]) [    ] o.a.s.c.ZkContainer Zookeeper client=127.0.0.1:52615/solr
   [junit4]   2> 2274003 INFO  (TEST-ForceLeaderTest.testReplicasInLIRNoLeader-seed#[AE3D80C267E8D998]) [n:127.0.0.1:52632_    ] o.a.s.c.c.ZkStateReader Updated live nodes from ZooKeeper... (0) -> (1)
   [junit4]   2> 2274008 INFO  (TEST-ForceLeaderTest.testReplicasInLIRNoLeader-seed#[AE3D80C267E8D998]) [n:127.0.0.1:52632_    ] o.a.s.c.Overseer Overseer (id=null) closing
   [junit4]   2> 2274011 INFO  (TEST-ForceLeaderTest.testReplicasInLIRNoLeader-seed#[AE3D80C267E8D998]) [n:127.0.0.1:52632_    ] o.a.s.c.ZkController Register node as live in ZooKeeper:/live_nodes/127.0.0.1:52632_
   [junit4]   2> 2274018 INFO  (zkCallback-2824-thread-1) [    ] o.a.s.c.c.ZkStateReader Updated live nodes from ZooKeeper... (1) -> (2)
   [junit4]   2> 2274034 INFO  (zkCallback-2829-thread-1-processing-n:127.0.0.1:52632_) [n:127.0.0.1:52632_    ] o.a.s.c.c.ZkStateReader Updated live nodes from ZooKeeper... (1) -> (2)
   [junit4]   2> 2274045 INFO  (zkCallback-2817-thread-1-processing-n:127.0.0.1:52618_) [n:127.0.0.1:52618_    ] o.a.s.c.c.ZkStateReader Updated live nodes from ZooKeeper... (1) -> (2)
   [junit4]   2> 2274132 INFO  (TEST-ForceLeaderTest.testReplicasInLIRNoLeader-seed#[AE3D80C267E8D998]) [n:127.0.0.1:52632_    ] o.a.s.m.r.SolrJmxReporter JMX monitoring for 'solr.node' (registry 'solr.node') enabled at server: com.sun.jmx.mbeanserver.JmxMBeanServer@33a2bc0
   [junit4]   2> 2274147 INFO  (TEST-ForceLeaderTest.testReplicasInLIRNoLeader-seed#[AE3D80C267E8D998]) [n:127.0.0.1:52632_    ] o.a.s.m.r.SolrJmxReporter JMX monitoring for 'solr.jvm' (registry 'solr.jvm') enabled at server: com.sun.jmx.mbeanserver.JmxMBeanServer@33a2bc0
   [junit4]   2> 2274147 INFO  (TEST-ForceLeaderTest.testReplicasInLIRNoLeader-seed#[AE3D80C267E8D998]) [n:127.0.0.1:52632_    ] o.a.s.m.r.SolrJmxReporter JMX monitoring for 'solr.jetty' (registry 'solr.jetty') enabled at server: com.sun.jmx.mbeanserver.JmxMBeanServer@33a2bc0
   [junit4]   2> 2274148 INFO  (TEST-ForceLeaderTest.testReplicasInLIRNoLeader-seed#[AE3D80C267E8D998]) [n:127.0.0.1:52632_    ] o.a.s.c.CorePropertiesLocator Found 0 core definitions underneath /Users/jenkins/workspace/Lucene-Solr-master-MacOSX/solr/build/solr-core/test/J1/temp/solr.cloud.ForceLeaderTest_AE3D80C267E8D998-001/shard-1-001/cores
   [junit4]   2> 2274190 INFO  (qtp1273671973-17179) [n:127.0.0.1:52618_    ] o.a.s.h.a.CollectionsHandler Invoked Collection Action :addreplica with params node=127.0.0.1:52632_&action=ADDREPLICA&collection=collection1&shard=shard2&type=TLOG&wt=javabin&version=2 and sendToOCPQueue=true
   [junit4]   2> 2274194 INFO  (OverseerThreadFactory-8197-thread-3-processing-n:127.0.0.1:52618_) [n:127.0.0.1:52618_    ] o.a.s.c.AddReplicaCmd Node Identified 127.0.0.1:52632_ for creating new replica
   [junit4]   2> 2274194 INFO  (OverseerCollectionConfigSetProcessor-98507443638960132-127.0.0.1:52618_-n_0000000000) [n:127.0.0.1:52618_    ] o.a.s.c.OverseerTaskQueue Response ZK path: /overseer/collection-queue-work/qnr-0000000002 doesn't exist.  Requestor may have disconnected from ZooKeeper
   [junit4]   2> 2274198 INFO  (SocketProxy-Acceptor-52632) [    ] o.a.s.c.SocketProxy accepted Socket[addr=/127.0.0.1,port=52637,localport=52632], receiveBufferSize:408300
   [junit4]   2> 2274198 INFO  (SocketProxy-Acceptor-52632) [    ] o.a.s.c.SocketProxy proxy connection Socket[addr=/127.0.0.1,port=52633,localport=52638], receiveBufferSize=408300
   [junit4]   2> 2274200 INFO  (qtp1957280916-17229) [n:127.0.0.1:52632_    ] o.a.s.h.a.CoreAdminOperation core create command qt=/admin/cores&collection.configName=conf1&name=collection1_shard2_replica_t41&action=CREATE&collection=collection1&shard=shard2&wt=javabin&version=2&replicaType=TLOG
   [junit4]   2> 2274200 INFO  (qtp1957280916-17229) [n:127.0.0.1:52632_    ] o.a.s.c.TransientSolrCoreCacheDefault Allocating transient cache for 4 transient cores
   [junit4]   2> 2275240 INFO  (qtp1957280916-17229) [n:127.0.0.1:52632_ c:collection1 s:shard2  x:collection1_shard2_replica_t41] o.a.s.c.SolrConfig Using Lucene MatchVersion: 8.0.0
   [junit4]   2> 2275258 INFO  (qtp1957280916-17229) [n:127.0.0.1:52632_ c:collection1 s:shard2  x:collection1_shard2_replica_t41] o.a.s.s.IndexSchema [collection1_shard2_replica_t41] Schema name=test
   [junit4]   2> 2275336 INFO  (qtp1957280916-17229) [n:127.0.0.1:52632_ c:collection1 s:shard2  x:collection1_shard2_replica_t41] o.a.s.s.IndexSchema Loaded schema test/1.0 with uniqueid field id
   [junit4]   2> 2275361 INFO  (qtp1957280916-17229) [n:127.0.0.1:52632_ c:collection1 s:shard2  x:collection1_shard2_replica_t41] o.a.s.c.CoreContainer Creating SolrCore 'collection1_shard2_replica_t41' using configuration from collection collection1, trusted=true
   [junit4]   2> 2275361 INFO  (qtp1957280916-17229) [n:127.0.0.1:52632_ c:collection1 s:shard2  x:collection1_shard2_replica_t41] o.a.s.m.r.SolrJmxReporter JMX monitoring for 'solr.core.collection1.shard2.replica_t41' (registry 'solr.core.collection1.shard2.replica_t41') enabled at server: com.sun.jmx.mbeanserver.JmxMBeanServer@33a2bc0
   [junit4]   2> 2275362 INFO  (qtp1957280916-17229) [n:127.0.0.1:52632_ c:collection1 s:shard2  x:collection1_shard2_replica_t41] o.a.s.c.SolrCore solr.RecoveryStrategy.Builder
   [junit4]   2> 2275362 INFO  (qtp1957280916-17229) [n:127.0.0.1:52632_ c:collection1 s:shard2  x:collection1_shard2_replica_t41] o.a.s.c.SolrCore [[collection1_shard2_replica_t41] ] Opening new SolrCore at [/Users/jenkins/workspace/Lucene-Solr-master-MacOSX/solr/build/solr-core/test/J1/temp/solr.cloud.ForceLeaderTest_AE3D80C267E8D998-001/shard-1-001/cores/collection1_shard2_replica_t41], dataDir=[/Users/jenkins/workspace/Lucene-Solr-master-MacOSX/solr/build/solr-core/test/J1/temp/solr.cloud.ForceLeaderTest_AE3D80C267E8D998-001/shard-1-001/cores/collection1_shard2_replica_t41/data/]
   [junit4]   2> 2275364 INFO  (qtp1957280916-17229) [n:127.0.0.1:52632_ c:collection1 s:shard2  x:collection1_shard2_replica_t41] o.a.s.u.RandomMergePolicy RandomMergePolicy wrapping class org.apache.lucene.index.LogDocMergePolicy: [LogDocMergePolicy: minMergeSize=1000, mergeFactor=16, maxMergeSize=9223372036854775807, maxMergeSizeForForcedMerge=9223372036854775807, calibrateSizeByDeletes=false, maxMergeDocs=2147483647, maxCFSSegmentSizeMB=8.796093022207999E12, noCFSRatio=0.17361457499451188]
   [junit4]   2> 2275366 WARN  (qtp1957280916-17229) [n:127.0.0.1:52632_ c:collection1 s:shard2  x:collection1_shard2_replica_t41] o.a.s.c.RequestHandlers INVALID paramSet a in requestHandler {type = requestHandler,name = /dump,class = DumpRequestHandler,attributes = {initParams=a, name=/dump, class=DumpRequestHandler},args = {defaults={a=A,b=B}}}
   [junit4]   2> 2275417 INFO  (qtp1957280916-17229) [n:127.0.0.1:52632_ c:collection1 s:shard2  x:collection1_shard2_replica_t41] o.a.s.u.UpdateHandler Using UpdateLog implementation: org.apache.solr.update.UpdateLog
   [junit4]   2> 2275417 INFO  (qtp1957280916-17229) [n:127.0.0.1:52632_ c:collection1 s:shard2  x:collection1_shard2_replica_t41] o.a.s.u.UpdateLog Initializing UpdateLog: dataDir= defaultSyncLevel=FLUSH numRecordsToKeep=100 maxNumLogsToKeep=10 numVersionBuckets=65536
   [junit4]   2> 2275418 INFO  (qtp1957280916-17229) [n:127.0.0.1:52632_ c:collection1 s:shard2  x:collection1_shard2_replica_t41] o.a.s.u.CommitTracker Hard AutoCommit: disabled
   [junit4]   2> 2275418 INFO  (qtp1957280916-17229) [n:127.0.0.1:52632_ c:collection1 s:shard2  x:collection1_shard2_replica_t41] o.a.s.u.CommitTracker Soft AutoCommit: disabled
   [junit4]   2> 2275419 INFO  (qtp1957280916-17229) [n:127.0.0.1:52632_ c:collection1 s:shard2  x:collection1_shard2_replica_t41] o.a.s.u.RandomMergePolicy RandomMergePolicy wrapping class org.apache.lucene.index.LogByteSizeMergePolicy: [LogByteSizeMergePolicy: minMergeSize=1677721, mergeFactor=47, maxMergeSize=2147483648, maxMergeSizeForForcedMerge=9223372036854775807, calibrateSizeByDeletes=false, maxMergeDocs=2147483647, maxCFSSegmentSizeMB=8.796093022207999E12, noCFSRatio=0.0]
   [junit4]   2> 2275419 INFO  (qtp1957280916-17229) [n:127.0.0.1:52632_ c:collection1 s:shard2  x:collection1_shard2_replica_t41] o.a.s.s.SolrIndexSearcher Opening [Searcher@6d8d8f7d[collection1_shard2_replica_t41] main]
   [junit4]   2> 2275421 INFO  (qtp1957280916-17229) [n:127.0.0.1:52632_ c:collection1 s:shard2  x:collection1_shard2_replica_t41] o.a.s.r.ManagedResourceStorage Configured ZooKeeperStorageIO with znodeBase: /configs/conf1
   [junit4]   2> 2275421 INFO  (qtp1957280916-17229) [n:127.0.0.1:52632_ c:collection1 s:shard2  x:collection1_shard2_replica_t41] o.a.s.r.ManagedResourceStorage Loaded null at path _rest_managed.json using ZooKeeperStorageIO:path=/configs/conf1
   [junit4]   2> 2275422 INFO  (qtp1957280916-17229) [n:127.0.0.1:52632_ c:collection1 s:shard2  x:collection1_shard2_replica_t41] o.a.s.h.ReplicationHandler Commits will be reserved for  10000
   [junit4]   2> 2275422 INFO  (qtp1957280916-17229) [n:127.0.0.1:52632_ c:collection1 s:shard2  x:collection1_shard2_replica_t41] o.a.s.u.UpdateLog Could not find max version in index or recent updates, using new clock 1576119104183468032
   [junit4]   2> 2275423 INFO  (searcherExecutor-8211-thread-1-processing-n:127.0.0.1:52632_ x:collection1_shard2_replica_t41 s:shard2 c:collection1) [n:127.0.0.1:52632_ c:collection1 s:shard2  x:collection1_shard2_replica_t41] o.a.s.c.SolrCore [collection1_shard2_replica_t41] Registered new searcher Searcher@6d8d8f7d[collection1_shard2_replica_t41] main{ExitableDirectoryReader(UninvertingDirectoryReader())}
   [junit4]   2> 2275432 INFO  (qtp1957280916-17229) [n:127.0.0.1:52632_ c:collection1 s:shard2  x:collection1_shard2_replica_t41] o.a.s.c.ShardLeaderElectionContext Enough replicas found to continue.
   [junit4]   2> 2275433 INFO  (qtp1957280916-17229) [n:127.0.0.1:52632_ c:collection1 s:shard2  x:collection1_shard2_replica_t41] o.a.s.c.ShardLeaderElectionContext I may be the new leader - try and sync
   [junit4]   2> 2275433 INFO  (qtp1957280916-17229) [n:127.0.0.1:52632_ c:collection1 s:shard2  x:collection1_shard2_replica_t41] o.a.s.c.SyncStrategy Sync replicas to http://127.0.0.1:52632/collection1_shard2_replica_t41/
   [junit4]   2> 2275433 INFO  (qtp1957280916-17229) [n:127.0.0.1:52632_ c:collection1 s:shard2  x:collection1_shard2_replica_t41] o.a.s.c.SyncStrategy Sync Success - now sync replicas to me
   [junit4]   2> 2275433 INFO  (qtp1957280916-17229) [n:127.0.0.1:52632_ c:collection1 s:shard2  x:collection1_shard2_replica_t41] o.a.s.c.SyncStrategy http://127.0.0.1:52632/collection1_shard2_replica_t41/ has no replicas
   [junit4]   2> 2275433 INFO  (qtp1957280916-17229) [n:127.0.0.1:52632_ c:collection1 s:shard2  x:collection1_shard2_replica_t41] o.a.s.c.ShardLeaderElectionContext Found all replicas participating in election, clear LIR
   [junit4]   2> 2275435 INFO  (qtp1957280916-17229) [n:127.0.0.1:52632_ c:collection1 s:shard2  x:collection1_shard2_replica_t41] o.a.s.c.ZkController collection1_shard2_replica_t41 stopping background replication from leader
   [junit4]   2> 2275442 INFO  (qtp1957280916-17229) [n:127.0.0.1:52632_ c:collection1 s:shard2  x:collection1_shard2_replica_t41] o.a.s.c.ShardLeaderElectionContext I am the new leader: http://127.0.0.1:52632/collection1_shard2_replica_t41/ shard2
   [junit4]   2> 2275552 INFO  (qtp1957280916-17229) [n:127.0.0.1:52632_ c:collection1 s:shard2  x:collection1_shard2_replica_t41] o.a.s.c.ZkController I am the leader, no recovery necessary
   [junit4]   2> 2275552 INFO  (qtp1957280916-17229) [n:127.0.0.1:52632_ c:collection1 s:shard2  x:collection1_shard2_replica_t41] o.a.s.s.HttpSolrCall [admin] webapp=null path=/admin/cores params={qt=/admin/cores&collection.configName=conf1&name=collection1_shard2_replica_t41&action=CREATE&collection=collection1&shard=shard2&wt=javabin&version=2&replicaType=TLOG} status=0 QTime=1352
   [junit4]   2> 2275558 INFO  (qtp1273671973-17179) [n:127.0.0.1:52618_    ] o.a.s.s.HttpSolrCall [admin] webapp=null path=/admin/collections params={node=127.0.0.1:52632_&action=ADDREPLICA&collection=collection1&shard=shard2&type=TLOG&wt=javabin&version=2} status=0 QTime=1368
   [junit4]   2> 2275796 INFO  (TEST-ForceLeaderTest.testReplicasInLIRNoLeader-seed#[AE3D80C267E8D998]) [    ] o.a.s.c.AbstractFullDistribZkTestBase create jetty 2 in directory /Users/jenkins/workspace/Lucene-Solr-master-MacOSX/solr/build/solr-core/test/J1/temp/solr.cloud.ForceLeaderTest_AE3D80C267E8D998-001/shard-2-001 of type TLOG
   [junit4]   2> 2275796 INFO  (TEST-ForceLeaderTest.testReplicasInLIRNoLeader-seed#[AE3D80C267E8D998]) [    ] o.e.j.s.Server jetty-9.3.20.v20170531
   [junit4]   2> 2275797 INFO  (TEST-ForceLeaderTest.testReplicasInLIRNoLeader-seed#[AE3D80C267E8D998]) [    ] o.e.j.s.h.ContextHandler Started o.e.j.s.ServletContextHandler@2613df68{/,null,AVAILABLE}
   [junit4]   2> 2275798 INFO  (TEST-ForceLeaderTest.testReplicasInLIRNoLeader-seed#[AE3D80C267E8D998]) [    ] o.e.j.s.AbstractConnector Started ServerConnector@47f7e8b0{HTTP/1.1,[http/1.1]}{127.0.0.1:52641}
   [junit4]   2> 2275798 INFO  (TEST-ForceLeaderTest.testReplicasInLIRNoLeader-seed#[AE3D80C267E8D998]) [    ] o.e.j.s.Server Started @2279538ms
   [junit4]   2> 2275798 INFO  (TEST-ForceLeaderTest.testReplicasInLIRNoLeader-seed#[AE3D80C267E8D998]) [    ] o.a.s.c.s.e.JettySolrRunner Jetty properties: {solr.data.dir=/Users/jenkins/workspace/Lucene-Solr-master-MacOSX/solr/build/solr-core/test/J1/temp/solr.cloud.ForceLeaderTest_AE3D80C267E8D998-001/tempDir-001/jetty2, replicaType=TLOG, solrconfig=solrconfig.xml, hostContext=/, hostPort=52640, coreRootDirectory=/Users/jenkins/workspace/Lucene-Solr-master-MacOSX/solr/build/solr-core/test/J1/temp/solr.cloud.ForceLeaderTest_AE3D80C267E8D998-001/shard-2-001/cores}
   [junit4]   2> 2275798 ERROR (TEST-ForceLeaderTest.testReplicasInLIRNoLeader-seed#[AE3D80C267E8D998]) [    ] o.a.s.s.StartupLoggingUtils Missing Java Option solr.log.dir. Logging may be missing or incomplete.
   [junit4]   2> 2275798 INFO  (TEST-ForceLeaderTest.testReplicasInLIRNoLeader-seed#[AE3D80C267E8D998]) [    ] o.a.s.s.SolrDispatchFilter  ___      _       Welcome to Apache Solr™ version 8.0.0
   [junit4]   2> 2275799 INFO  (TEST-ForceLeaderTest.testReplicasInLIRNoLeader-seed#[AE3D80C267E8D998]) [    ] o.a.s.s.SolrDispatchFilter / __| ___| |_ _   Starting in cloud mode on port null
   [junit4]   2> 2275799 INFO  (TEST-ForceLeaderTest.testReplicasInLIRNoLeader-seed#[AE3D80C267E8D998]) [    ] o.a.s.s.SolrDispatchFilter \__ \/ _ \ | '_|  Install dir: null, Default config dir: null
   [junit4]   2> 2275799 INFO  (TEST-ForceLeaderTest.testReplicasInLIRNoLeader-seed#[AE3D80C267E8D998]) [    ] o.a.s.s.SolrDispatchFilter |___/\___/_|_|    Start time: 2017-08-19T00:58:29.634Z
   [junit4]   2> 2275801 INFO  (TEST-ForceLeaderTest.testReplicasInLIRNoLeader-seed#[AE3D80C267E8D998]) [    ] o.a.s.s.SolrDispatchFilter Loading solr.xml from SolrHome (not found in ZooKeeper)
   [junit4]   2> 2275801 INFO  (TEST-ForceLeaderTest.testReplicasInLIRNoLeader-seed#[AE3D80C267E8D998]) [    ] o.a.s.c.SolrXmlConfig Loading container configuration from /Users/jenkins/workspace/Lucene-Solr-master-MacOSX/solr/build/solr-core/test/J1/temp/solr.cloud.ForceLeaderTest_AE3D80C267E8D998-001/shard-2-001/solr.xml
   [junit4]   2> 2275806 INFO  (TEST-ForceLeaderTest.testReplicasInLIRNoLeader-seed#[AE3D80C267E8D998]) [    ] o.a.s.c.SolrXmlConfig MBean server found: com.sun.jmx.mbeanserver.JmxMBeanServer@33a2bc0, but no JMX reporters were configured - adding default JMX reporter.
   [junit4]   2> 2275809 INFO  (TEST-ForceLeaderTest.testReplicasInLIRNoLeader-seed#[AE3D80C267E8D998]) [    ] o.a.s.c.ZkContainer Zookeeper client=127.0.0.1:52615/solr
   [junit4]   2> 2275826 INFO  (TEST-ForceLeaderTest.testReplicasInLIRNoLeader-seed#[AE3D80C267E8D998]) [n:127.0.0.1:52640_    ] o.a.s.c.c.ZkStateReader Updated live nodes from ZooKeeper... (0) -> (2)
   [junit4]   2> 2275830 INFO  (TEST-ForceLeaderTest.testReplicasInLIRNoLeader-seed#[AE3D80C267E8D998]) [n:127.0.0.1:52640_    ] o.a.s.c.Overseer Overseer (id=null) closing
   [junit4]   2> 2275832 INFO  (TEST-ForceLeaderTest.testReplicasInLIRNoLeader-seed#[AE3D80C267E8D998]) [n:127.0.0.1:52640_    ] o.a.s.c.ZkController Register node as live in ZooKeeper:/live_nodes/127.0.0.1:52640_
   [junit4]   2> 2275834 INFO  (zkCallback-2824-thread-1) [    ] o.a.s.c.c.ZkStateReader Updated live nodes from ZooKeeper... (2) -> (3)
   [junit4]   2> 2275834 INFO  (zkCallback-2829-thread-1-processing-n:127.0.0.1:52632_) [n:127.0.0.1:52632_    ] o.a.s.c.c.ZkStateReader Updated live nodes from ZooKeeper... (2) -> (3)
   [junit4]   2> 2275835 INFO  (zkCallback-2817-thread-2-processing-n:127.0.0.1:52618_) [n:127.0.0.1:52618_    ] o.a.s.c.c.ZkStateReader Updated live nodes from ZooKeeper... (2) -> (3)
   [junit4]   2> 2275835 INFO  (zkCallback-2835-thread-1-processing-n:127.0.0.1:52640_) [n:127.0.0.1:52640_    ] o.a.s.c.c.ZkStateReader Updated live nodes from ZooKeeper... (2) -> (3)
   [junit4]   2> 2275889 INFO  (TEST-ForceLeaderTest.testReplicasInLIRNoLeader-seed#[AE3D80C267E8D998]) [n:127.0.0.1:52640_    ] o.a.s.m.r.SolrJmxReporter JMX monitoring for 'solr.node' (registry 'solr.node') enabled at server: com.sun.jmx.mbeanserver.JmxMBeanServer@33a2bc0
   [junit4]   2> 2275896 INFO  (TEST-ForceLeaderTest.testReplicasInLIRNoLeader-seed#[AE3D80C267E8D998]) [n:127.0.0.1:52640_    ] o.a.s.m.r.SolrJmxReporter JMX monitoring for 'solr.jvm' (registry 'solr.jvm') enabled at server: com.sun.jmx.mbeanserver.JmxMBeanServer@33a2bc0
   [junit4]   2> 2275896 INFO  (TEST-ForceLeaderTest.testReplicasInLIRNoLeader-seed#[AE3D80C267E8D998]) [n:127.0.0.1:52640_    ] o.a.s.m.r.SolrJmxReporter JMX monitoring for 'solr.jetty' (registry 'solr.jetty') enabled at server: com.sun.jmx.mbeanserver.JmxMBeanServer@33a2bc0
   [junit4]   2> 2275898 INFO  (TEST-ForceLeaderTest.testReplicasInLIRNoLeader-seed#[AE3D80C267E8D998]) [n:127.0.0.1:52640_    ] o.a.s.c.CorePropertiesLocator Found 0 core definitions underneath /Users/jenkins/workspace/Lucene-Solr-master-MacOSX/solr/build/solr-core/test/J1/temp/solr.cloud.ForceLeaderTest_AE3D80C267E8D998-001/shard-2-001/cores
   [junit4]   2> 2275960 INFO  (qtp1273671973-17182) [n:127.0.0.1:52618_    ] o.a.s.h.a.CollectionsHandler Invoked Collection Action :addreplica with params node=127.0.0.1:52640_&action=ADDREPLICA&collection=collection1&shard=shard1&type=TLOG&wt=javabin&version=2 and sendToOCPQueue=true
   [junit4]   2> 2275963 INFO  (OverseerThreadFactory-8197-thread-4-processing-n:127.0.0.1:52618_) [n:127.0.0.1:52618_    ] o.a.s.c.AddReplicaCmd Node Identified 127.0.0.1:52640_ for creating new replica
   [junit4]   2> 2275963 INFO  (OverseerCollectionConfigSetProcessor-98507443638960132-127.0.0.1:52618_-n_0000000000) [n:127.0.0.1:52618_    ] o.a.s.c.OverseerTaskQueue Response ZK path: /overseer/collection-queue-work/qnr-0000000004 doesn't exist.  Requestor may have disconnected from ZooKeeper
   [junit4]   2> 2275966 INFO  (SocketProxy-Acceptor-52640) [    ] o.a.s.c.SocketProxy accepted Socket[addr=/127.0.0.1,port=52645,localport=52640], receiveBufferSize:408300
   [junit4]   2> 2275966 INFO  (SocketProxy-Acceptor-52640) [    ] o.a.s.c.SocketProxy proxy connection Socket[addr=/127.0.0.1,port=52641,localport=52646], receiveBufferSize=408300
   [junit4]   2> 2275969 INFO  (qtp2115316225-17262) [n:127.0.0.1:52640_    ] o.a.s.h.a.CoreAdminOperation core create command qt=/admin/cores&collection.configName=conf1&name=collection1_shard1_replica_t43&action=CREATE&collection=collection1&shard=shard1&wt=javabin&version=2&replicaType=TLOG
   [junit4]   2> 2275969 INFO  (qtp2115316225-17262) [n:127.0.0.1:52640_    ] o.a.s.c.TransientSolrCoreCacheDefault Allocating transient cache for 4 transient cores
   [junit4]   2> 2276987 INFO  (qtp2115316225-17262) [n:127.0.0.1:52640_ c:collection1 s:shard1  x:collection1_shard1_replica_t43] o.a.s.c.SolrConfig Using Lucene MatchVersion: 8.0.0
   [junit4]   2> 2276995 INFO  (qtp2115316225-17262) [n:127.0.0.1:52640_ c:collection1 s:shard1  x:collection1_shard1_replica_t43] o.a.s.s.IndexSchema [collection1_shard1_replica_t43] Schema name=test
   [junit4]   2> 2277058 INFO  (qtp2115316225-17262) [n:127.0.0.1:52640_ c:collection1 s:shard1  x:collection1_shard1_replica_t43] o.a.s.s.IndexSchema Loaded schema test/1.0 with uniqueid field id
   [junit4]   2> 2277076 INFO  (qtp2115316225-17262) [n:127.0.0.1:52640_ c:collection1 s:shard1  x:collection1_shard1_replica_t43] o.a.s.c.CoreContainer Creating SolrCore 'collection1_shard1_replica_t43' using configuration from collection collection1, trusted=true
   [junit4]   2> 2277077 INFO  (qtp2115316225-17262) [n:127.0.0.1:52640_ c:collection1 s:shard1  x:collection1_shard1_replica_t43] o.a.s.m.r.SolrJmxReporter JMX monitoring for 'solr.core.collection1.shard1.replica_t43' (registry 'solr.core.collection1.shard1.replica_t43') enabled at server: com.sun.jmx.mbeanserver.JmxMBeanServer@33a2bc0
   [junit4]   2> 2277077 INFO  (qtp2115316225-17262) [n:127.0.0.1:52640_ c:collection1 s:shard1  x:collection1_shard1_replica_t43] o.a.s.c.SolrCore solr.RecoveryStrategy.Builder
   [junit4]   2> 2277077 INFO  (qtp2115316225-17262) [n:127.0.0.1:52640_ c:collection1 s:shard1  x:collection1_shard1_replica_t43] o.a.s.c.SolrCore [[collection1_shard1_replica_t43] ] Opening new SolrCore at [/Users/jenkins/workspace/Lucene-Solr-master-MacOSX/solr/build/solr-core/test/J1/temp/solr.cloud.ForceLeaderTest_AE3D80C267E8D998-001/shard-2-001/cores/collection1_shard1_replica_t43], dataDir=[/Users/jenkins/workspace/Lucene-Solr-master-MacOSX/solr/build/solr-core/test/J1/temp/solr.cloud.ForceLeaderTest_AE3D80C267E8D998-001/shard-2-001/cores/collection1_shard1_replica_t43/data/]
   [junit4]   2> 2277078 INFO  (qtp2115316225-17262) [n:127.0.0.1:52640_ c:collection1 s:shard1  x:collection1_shard1_replica_t43] o.a.s.u.RandomMergePolicy RandomMergePolicy wrapping class org.apache.lucene.index.LogDocMergePolicy: [LogDocMergePolicy: minMergeSize=1000, mergeFactor=16, maxMergeSize=9223372036854775807, maxMergeSizeForForcedMerge=9223372036854775807, calibrateSizeByDeletes=false, maxMergeDocs=2147483647, maxCFSSegmentSizeMB=8.796093022207999E12, noCFSRatio=0.17361457499451188]
   [junit4]   2> 2277080 WARN  (qtp2115316225-17262) [n:127.0.0.1:52640_ c:collection1 s:shard1  x:collection1_shard1_replica_t43] o.a.s.c.RequestHandlers INVALID paramSet a in requestHandler {type = requestHandler,name = /dump,class = DumpRequestHandler,attributes = {initParams=a, name=/dump, class=DumpRequestHandler},args = {defaults={a=A,b=B}}}
   [junit4]   2> 2277127 INFO  (qtp2115316225-17262) [n:127.0.0.1:52640_ c:collection1 s:shard1  x:collection1_shard1_replica_t43] o.a.s.u.UpdateHandler Using UpdateLog implementation: org.apache.solr.update.UpdateLog
   [junit4]   2> 2277127 INFO  (qtp2115316225-17262) [n:127.0.0.1:52640_ c:collection1 s:shard1  x:collection1_shard1_replica_t43] o.a.s.u.UpdateLog Initializing UpdateLog: dataDir= defaultSyncLevel=FLUSH numRecordsToKeep=100 maxNumLogsToKeep=10 numVersionBuckets=65536
   [junit4]   2> 2277128 INFO  (qtp2115316225-17262) [n:127.0.0.1:52640_ c:collection1 s:shard1  x:collection1_shard1_replica_t43] o.a.s.u.CommitTracker Hard AutoCommit: disabled
   [junit4]   2> 2277128 INFO  (qtp2115316225-17262) [n:127.0.0.1:52640_ c:collection1 s:shard1  x:collection1_shard1_replica_t43] o.a.s.u.CommitTracker Soft AutoCommit: disabled
   [junit4]   2> 2277128 INFO  (qtp2115316225-17262) [n:127.0.0.1:52640_ c:collection1 s:shard1  x:collection1_shard1_replica_t43] o.a.s.u.RandomMergePolicy RandomMergePolicy wrapping class org.apache.lucene.index.LogByteSizeMergePolicy: [LogByteSizeMergePolicy: minMergeSize=1677721, mergeFactor=47, maxMergeSize=2147483648, maxMergeSizeForForcedMerge=9223372036854775807, calibrateSizeByDeletes=false, maxMergeDocs=2147483647, maxCFSSegmentSizeMB=8.796093022207999E12, noCFSRatio=0.0]
   [junit4]   2> 2277129 INFO  (qtp2115316225-17262) [n:127.0.0.1:52640_ c:collection1 s:shard1  x:collection1_shard1_replica_t43] o.a.s.s.SolrIndexSearcher Opening [Searcher@47f10dc7[collection1_shard1_replica_t43] main]
   [junit4]   2> 2277130 INFO  (qtp2115316225-17262) [n:127.0.0.1:52640_ c:collection1 s:shard1  x:collection1_shard1_replica_t43] o.a.s.r.ManagedResourceStorage Configured ZooKeeperStorageIO with znodeBase: /configs/conf1
   [junit4]   2> 2277130 INFO  (qtp2115316225-17262) [n:127.0.0.1:52640_ c:collection1 s:shard1  x:collection1_shard1_replica_t43] o.a.s.r.ManagedResourceStorage Loaded null at path _rest_managed.json using ZooKeeperStorageIO:path=/configs/conf1
   [junit4]   2> 2277131 INFO  (qtp2115316225-17262) [n:127.0.0.1:52640_ c:collection1 s:shard1  x:collection1_shard1_replica_t43] o.a.s.h.ReplicationHandler Commits will be reserved for  10000
   [junit4]   2> 2277131 INFO  (qtp2115316225-17262) [n:127.0.0.1:52640_ c:collection1 s:shard1  x:collection1_shard1_replica_t43] o.a.s.u.UpdateLog Could not find max version in index or recent updates, using new clock 1576119105975484416
   [junit4]   2> 2277132 INFO  (searcherExecutor-8222-thread-1-processing-n:127.0.0.1:52640_ x:collection1_shard1_replica_t43 s:shard1 c:collection1) [n:127.0.0.1:52640_ c:collection1 s:shard1  x:collection1_shard1_replica_t43] o.a.s.c.SolrCore [collection1_shard1_replica_t43] Registered new searcher Searcher@47f10dc7[collection1_shard1_replica_t43] main{ExitableDirectoryReader(UninvertingDirectoryReader())}
   [junit4]   2> 2277137 INFO  (qtp2115316225-17262) [n:127.0.0.1:52640_ c:collection1 s:shard1  x:collection1_shard1_replica_t43] o.a.s.c.ShardLeaderElectionContext Enough replicas found to continue.
   [junit4]   2> 2277137 INFO  (qtp2115316225-17262) [n:127.0.0.1:52640_ c:collection1 s:shard1  x:collection1_shard1_replica_t43] o.a.s.c.ShardLeaderElectionContext I may be the new leader - try and sync
   [junit4]   2> 2277137 INFO  (qtp2115316225-17262) [n:127.0.0.1:52640_ c:collection1 s:shard1  x:collection1_shard1_replica_t43] o.a.s.c.SyncStrategy Sync replicas to http://127.0.0.1:52640/collection1_shard1_replica_t43/
   [junit4]   2> 2277137 INFO  (qtp2115316225-17262) [n:127.0.0.1:52640_ c:collection1 s:shard1  x:collection1_shard1_replica_t43] o.a.s.c.SyncStrategy Sync Success - now sync replicas to me
   [junit4]   2> 2277137 INFO  (qtp2115316225-17262) [n:127.0.0.1:52640_ c:collection1 s:shard1  x:collection1_shard1_replica_t43] o.a.s.c.SyncStrategy http://127.0.0.1:52640/collection1_shard1_replica_t43/ has no replicas
   [junit4]   2> 2277137 INFO  (qtp2115316225-17262) [n:127.0.0.1:52640_ c:collection1 s:shard1  x:collection1_shard1_replica_t43] o.a.s.c.ShardLeaderElectionContext Found all replicas participating in election, clear LIR
   [junit4]   2> 2277138 INFO  (qtp2115316225-17262) [n:127.0.0.1:52640_ c:collection1 s:shard1  x:collection1_shard1_replica_t43] o.a.s.c.ZkController collection1_shard1_replica_t43 stopping background replication from leader
   [junit4]   2> 2277142 INFO  (qtp2115316225-17262) [n:127.0.0.1:52640_ c:collection1 s:shard1  x:collection1_shard1_replica_t43] o.a.s.c.ShardLeaderElectionContext I am the new leader: http://127.0.0.1:52640/collection1_shard1_replica_t43/ shard1
   [junit4]   2> 2277313 INFO  (qtp2115316225-17262) [n:127.0.0.1:52640_ c:collection1 s:shard1  x:collection1_shard1_replica_t43] o.a.s.c.ZkController I am the leader, no recovery necessary
   [junit4]   2> 2277317 INFO  (qtp2115316225-17262) [n:127.0.0.1:52640_ c:collection1 s:shard1  x:collection1_shard1_replica_t43] o.a.s.s.HttpSolrCall [admin] webapp=null path=/admin/cores params={qt=/admin/cores&collection.configName=conf1&name=collection1_shard1_replica_t43&action=CREATE&collection=collection1&shard=shard1&wt=javabin&version=2&replicaType=TLOG} status=0 QTime=1348
   [junit4]   2> 2277322 INFO  (qtp1273671973-17182) [n:127.0.0.1:52618_    ] o.a.s.s.HttpSolrCall [admin] webapp=null path=/admin/collections params={node=127.0.0.1:52640_&action=ADDREPLICA&collection=collection1&shard=shard1&type=TLOG&wt=javabin&version=2} status=0 QTime=1361
   [junit4]   2> 2277613 INFO  (TEST-ForceLeaderTest.testReplicasInLIRNoLeader-seed#[AE3D80C267E8D998]) [    ] o.a.s.c.AbstractFullDistribZkTestBase create jetty 3 in directory /Users/jenkins/workspace/Lucene-Solr-master-MacOSX/solr/build/solr-core/test/J1/temp/solr.cloud.ForceLeaderTest_AE3D80C267E8D998-001/shard-3-001 of type TLOG
   [junit4]   2> 2277613 INFO  (TEST-ForceLeaderTest.testReplicasInLIRNoLeader-seed#[AE3D80C267E8D998]) [    ] o.e.j.s.Server jetty-9.3.20.v20170531
   [junit4]   2> 2277614 INFO  (TEST-ForceLeaderTest.testReplicasInLIRNoLeader-seed#[AE3D80C267E8D998]) [    ] o.e.j.s.h.ContextHandler Started o.e.j.s.ServletContextHandler@68b38e92{/,null,AVAILABLE}
   [junit4]   2> 2277615 INFO  (TEST-ForceLeaderTest.testReplicasInLIRNoLeader-seed#[AE3D80C267E8D998]) [    ] o.e.j.s.AbstractConnector Started ServerConnector@296e896b{HTTP/1.1,[http/1.1]}{127.0.0.1:52648}
   [junit4]   2> 2277615 INFO  (TEST-ForceLeaderTest.testReplicasInLIRNoLeader-seed#[AE3D80C267E8D998]) [    ] o.e.j.s.Server Started @2281355ms
   [junit4]   2> 2277615 INFO  (TEST-ForceLeaderTest.testReplicasInLIRNoLeader-seed#[AE3D80C267E8D998]) [    ] o.a.s.c.s.e.JettySolrRunner Jetty properties: {solr.data.dir=/Users/jenkins/workspace/Lucene-Solr-master-MacOSX/solr/build/solr-core/test/J1/temp/solr.cloud.ForceLeaderTest_AE3D80C267E8D998-001/tempDir-001/jetty3, replicaType=TLOG, solrconfig=solrconfig.xml, hostContext=/, hostPort=52647, coreRootDirectory=/Users/jenkins/workspace/Lucene-Solr-master-MacOSX/solr/build/solr-core/test/J1/temp/solr.cloud.ForceLeaderTest_AE3D80C267E8D998-001/shard-3-001/cores}
   [junit4]   2> 2277615 ERROR (TEST-ForceLeaderTest.testReplicasInLIRNoLeader-seed#[AE3D80C267E8D998]) [    ] o.a.s.s.StartupLoggingUtils Missing Java Option solr.log.dir. Logging may be missing or incomplete.
   [junit4]   2> 2277615 INFO  (TEST-ForceLeaderTest.testReplicasInLIRNoLeader-seed#[AE3D80C267E8D998]) [    ] o.a.s.s.SolrDispatchFilter  ___      _       Welcome to Apache Solr™ version 8.0.0
   [junit4]   2> 2277615 INFO  (TEST-ForceLeaderTest.testReplicasInLIRNoLeader-seed#[AE3D80C267E8D998]) [    ] o.a.s.s.SolrDispatchFilter / __| ___| |_ _   Starting in cloud mode on port null
   [junit4]   2> 2277615 INFO  (TEST-ForceLeaderTest.testReplicasInLIRNoLeader-seed#[AE3D80C267E8D998]) [    ] o.a.s.s.SolrDispatchFilter \__ \/ _ \ | '_|  Install dir: null, Default config dir: null
   [junit4]   2> 2277615 INFO  (TEST-ForceLeaderTest.testReplicasInLIRNoLeader-seed#[AE3D80C267E8D998]) [    ] o.a.s.s.SolrDispatchFilter |___/\___/_|_|    Start time: 2017-08-19T00:58:31.450Z
   [junit4]   2> 2277618 INFO  (TEST-ForceLeaderTest.testReplicasInLIRNoLeader-seed#[AE3D80C267E8D998]) [    ] o.a.s.s.SolrDispatchFilter Loading solr.xml from SolrHome (not found in ZooKeeper)
   [junit4]   2> 2277618 INFO  (TEST-ForceLeaderTest.testReplicasInLIRNoLeader-seed#[AE3D80C267E8D998]) [    ] o.a.s.c.SolrXmlConfig Loading container configuration from /Users/jenkins/workspace/Lucene-Solr-master-MacOSX/solr/build/solr-core/test/J1/temp/solr.cloud.ForceLeaderTest_AE3D80C267E8D998-001/shard-3-001/solr.xml
   [junit4]   2> 2277623 INFO  (TEST-ForceLeaderTest.testReplicasInLIRNoLeader-seed#[AE3D80C267E8D998]) [    ] o.a.s.c.SolrXmlConfig MBean server found: com.sun.jmx.mbeanserver.JmxMBeanServer@33a2bc0, but no JMX reporters were configured - adding default JMX reporter.
   [junit4]   2> 2277625 INFO  (TEST-ForceLeaderTest.testReplicasInLIRNoLeader-seed#[AE3D80C267E8D998]) [    ] o.a.s.c.ZkContainer Zookeeper client=127.0.0.1:52615/solr
   [junit4]   2> 2277637 INFO  (TEST-ForceLeaderTest.testReplicasInLIRNoLeader-seed#[AE3D80C267E8D998]) [n:127.0.0.1:52647_    ] o.a.s.c.c.ZkStateReader Updated live nodes from ZooKeeper... (0) -> (3)
   [junit4]   2> 2277640 INFO  (TEST-ForceLeaderTest.testReplicasInLIRNoLeader-seed#[AE3D80C267E8D998]) [n:127.0.0.1:52647_    ] o.a.s.c.Overseer Overseer (id=null) closing
   [junit4]   2> 2277643 INFO  (TEST-ForceLeaderTest.testReplicasInLIRNoLeader-seed#[AE3D80C267E8D998]) [n:127.0.0.1:52647_    ] o.a.s.c.ZkController Register node as live in ZooKeeper:/live_nodes/127.0.0.1:52647_
   [junit4]   2> 2277645 INFO  (zkCallback-2829-thread-1-processing-n:127.0.0.1:52632_) [n:127.0.0.1:52632_    ] o.a.s.c.c.ZkStateReader Updated live nodes from ZooKeeper... (3) -> (4)
   [junit4]   2> 2277645 INFO  (zkCallback-2817-thread-1-processing-n:127.0.0.1:52618_) [n:127.0.0.1:52618_    ] o.a.s.c.c.ZkStateReader Updated live nodes from ZooKeeper... (3) -> (4)
   [junit4]   2> 2277645 INFO  (zkCallback-2824-thread-1) [    ] o.a.s.c.c.ZkStateReader Updated live nodes from ZooKeeper... (3) -> (4)
   [junit4]   2> 2277645 INFO  (zkCallback-2835-thread-1-processing-n:127.0.0.1:52640_) [n:127.0.0.1:52640_    ] o.a.s.c.c.ZkStateReader Updated live nodes from ZooKeeper... (3) -> (4)
   [junit4]   2> 2277646 INFO  (zkCallback-2841-thread-1-processing-n:127.0.0.1:52647_) [n:127.0.0.1:52647_    ] o.a.s.c.c.ZkStateReader Updated live nodes from ZooKeeper... (3) -> (4)
   [junit4]   2> 2277725 INFO  (TEST-ForceLeaderTest.testReplicasInLIRNoLeader-seed#[AE3D80C267E8D998]) [n:127.0.0.1:52647_    ] o.a.s.m.r.SolrJmxReporter JMX monitoring for 'solr.node' (registry 'solr.node') enabled at server: com.sun.jmx.mbeanserver.JmxMBeanServer@33a2bc0
   [junit4]   2> 2277732 INFO  (TEST-ForceLeaderTest.testReplicasInLIRNoLeader-seed#[AE3D80C267E8D998]) [n:127.0.0.1:52647_    ] o.a.s.m.r.SolrJmxReporter JMX monitoring for 'solr.jvm' (registry 'solr.jvm') enabled at server: com.sun.jmx.mbeanserver.JmxMBeanServer@33a2bc0
   [junit4]   2> 2277732 INFO  (TEST-ForceLeaderTest.testReplicasInLIRNoLeader-seed#[AE3D80C267E8D998]) [n:127.0.0.1:52647_    ] o.a.s.m.r.SolrJmxReporter JMX monitoring for 'solr.jetty' (registry 'solr.jetty') enabled at server: com.sun.jmx.mbeanserver.JmxMBeanServer@33a2bc0
   [junit4]   2> 2277733 INFO  (TEST-ForceLeaderTest.testReplicasInLIRNoLeader-seed#[AE3D80C267E8D998]) [n:127.0.0.1:52647_    ] o.a.s.c.CorePropertiesLocator Found 0 core definitions underneath /Users/jenkins/workspace/Lucene-Solr-master-MacOSX/solr/build/solr-core/test/J1/temp/solr.cloud.ForceLeaderTest_AE3D80C267E8D998-001/shard-3-001/cores
   [junit4]   2> 2277772 INFO  (qtp1273671973-17183) [n:127.0.0.1:52618_    ] o.a.s.h.a.CollectionsHandler Invoked Collection Action :addreplica with params node=127.0.0.1:52647_&action=ADDREPLICA&collection=collection1&shard=shard2&type=TLOG&wt=javabin&version=2 and sendToOCPQueue=true
   [junit4]   2> 2277775 INFO  (OverseerThreadFactory-8197-thread-5-processing-n:127.0.0.1:52618_) [n:127.0.0.1:52618_    ] o.a.s.c.AddReplicaCmd Node Identified 127.0.0.1:52647_ for creating new replica
   [junit4]   2> 2277775 INFO  (OverseerCollectionConfigSetProcessor-98507443638960132-127.0.0.1:52618_-n_0000000000) [n:127.0.0.1:52618_    ] o.a.s.c.OverseerTaskQueue Response ZK path: /overseer/collection-queue-work/qnr-0000000006 doesn't exist.  Requestor may have disconnected from ZooKeeper
   [junit4]   2> 2277778 INFO  (SocketProxy-Acceptor-52647) [    ] o.a.s.c.SocketProxy accepted Socket[addr=/127.0.0.1,port=52652,localport=52647], receiveBufferSize:408300
   [junit4]   2> 2277778 INFO  (SocketProxy-Acceptor-52647) [    ] o.a.s.c.SocketProxy proxy connection Socket[addr=/127.0.0.1,port=52648,localport=52653], receiveBufferSize=408300
   [junit4]   2> 2277780 INFO  (qtp367964346-17294) [n:127.0.0.1:52647_    ] o.a.s.h.a.CoreAdminOperation core create command qt=/admin/cores&collection.configName=conf1&name=collection1_shard2_replica_t45&action=CREATE&collection=collection1&shard=shard2&wt=javabin&version=2&replicaType=TLOG
   [junit4]   2> 2277780 INFO  (qtp367964346-17294) [n:127.0.0.1:52647_    ] o.a.s.c.TransientSolrCoreCacheDefault Allocating transient cache for 4 transient cores
   [junit4]   2> 2278802 INFO  (qtp367964346-17294) [n:127.0.0.1:52647_ c:collection1 s:shard2  x:collection1_shard2_replica_t45] o.a.s.c.SolrConfig Using Lucene MatchVersion: 8.0.0
   [junit4]   2> 2278813 INFO  (qtp367964346-17294) [n:127.0.0.1:52647_ c:collection1 s:shard2  x:collection1_shard2_replica_t45] o.a.s.s.IndexSchema [collection1_shard2_replica_t45] Schema name=test
   [junit4]   2> 2278908 INFO  (qtp367964346-17294) [n:127.0.0.1:52647_ c:collection1 s:shard2  x:collection1_shard2_replica_t45] o.a.s.s.IndexSchema Loaded schema test/1.0 with uniqueid field id
   [junit4]   2> 2278935 INFO  (qtp367964346-17294) [n:127.0.0.1:52647_ c:collection1 s:shard2  x:collection1_shard2_replica_t45] o.a.s.c.CoreContainer Creating SolrCore 'collection1_shard2_replica_t45' using configuration from collection collection1, trusted=true
   [junit4]   2> 2278936 INFO  (qtp367964346-17294) [n:127.0.0.1:52647_ c:collection1 s:shard2  x:collection1_shard2_replica_t45] o.a.s.m.r.SolrJmxReporter JMX monitoring for 'solr.core.collection1.shard2.replica_t45' (registry 'solr.core.collection1.shard2.replica_t45') enabled at server: com.sun.jmx.mbeanserver.JmxMBeanServer@33a2bc0
   [junit4]   2> 2278941 INFO  (qtp367964346-17294) [n:127.0.0.1:52647_ c:collection1 s:shard2  x:collection1_shard2_replica_t45] o.a.s.c.SolrCore solr.RecoveryStrategy.Builder
   [junit4]   2> 2278941 INFO  (qtp367964346-17294) [n:127.0.0.1:52647_ c:collection1 s:shard2  x:collection1_shard2_replica_t45] o.a.s.c.SolrCore [[collection1_shard2_replica_t45] ] Opening new SolrCore at [/Users/jenkins/workspace/Lucene-Solr-master-MacOSX/solr/build/solr-core/test/J1/temp/solr.cloud.ForceLeaderTest_AE3D80C267E8D998-001/shard-3-001/cores/collection1_shard2_replica_t45], dataDir=[/Users/jenkins/workspace/Lucene-Solr-master-MacOSX/solr/build/solr-core/test/J1/temp/solr.cloud.ForceLeaderTest_AE3D80C267E8D998-001/shard-3-001/cores/collection1_shard2_replica_t45/data/]
   [junit4]   2> 2278956 INFO  (qtp367964346-17294) [n:127.0.0.1:52647_ c:collection1 s:shard2  x:collection1_shard2_replica_t45] o.a.s.u.RandomMergePolicy RandomMergePolicy wrapping class org.apache.lucene.index.LogDocMergePolicy: [LogDocMergePolicy: minMergeSize=1000, mergeFactor=16, maxMergeSize=9223372036854775807, maxMergeSizeForForcedMerge=9223372036854775807, calibrateSizeByDeletes=false, maxMergeDocs=2147483647, maxCFSSegmentSizeMB=8.796093022207999E12, noCFSRatio=0.17361457499451188]
   [junit4]   2> 2278964 WARN  (qtp367964346-17294) [n:127.0.0.1:52647_ c:collection1 s:shard2  x:collection1_shard2_replica_t45] o.a.s.c.RequestHandlers INVALID paramSet a in requestHandler {type = requestHandler,name = /dump,class = DumpRequestHandler,attributes = {initParams=a, name=/dump, class=DumpRequestHandler},args = {defaults={a=A,b=B}}}
   [junit4]   2> 2279030 INFO  (qtp367964346-17294) [n:127.0.0.1:52647_ c:collection1 s:shard2  x:collection1_shard2_replica_t45] o.a.s.u.UpdateHandler Using UpdateLog implementation: org.apache.solr.update.UpdateLog
   [junit4]   2> 2279031 INFO  (qtp367964346-17294) [n:127.0.0.1:52647_ c:collection1 s:shard2  x:collection1_shard2_replica_t45] o.a.s.u.UpdateLog Initializing UpdateLog: dataDir= defaultSyncLevel=FLUSH numRecordsToKeep=100 maxNumLogsToKeep=10 numVersionBuckets=65536
   [junit4]   2> 2279032 INFO  (qtp367964346-17294) [n:127.0.0.1:52647_ c:collection1 s:shard2  x:collection1_shard2_replica_t45] o.a.s.u.CommitTracker Hard AutoCommit: disabled
   [junit4]   2> 2279032 INFO  (qtp367964346-17294) [n:127.0.0.1:52647_ c:collection1 s:shard2  x:collection1_shard2_replica_t45] o.a.s.u.CommitTracker Soft AutoCommit: disabled
   [junit4]   2> 2279034 INFO  (qtp367964346-17294) [n:127.0.0.1:52647_ c:collection1 s:shard2  x:collection1_shard2_replica_t45] o.a.s.u.RandomMergePolicy RandomMergePolicy wrapping class org.apache.lucene.index.LogByteSizeMergePolicy: [LogByteSizeMergePolicy: minMergeSize=1677721, mergeFactor=47, maxMergeSize=2147483648, maxMergeSizeForForcedMerge=9223372036854775807, calibrateSizeByDeletes=false, maxMergeDocs=2147483647, maxCFSSegmentSizeMB=8.796093022207999E12, noCFSRatio=0.0]
   [junit4]   2> 2279034 INFO  (qtp367964346-17294) [n:127.0.0.1:52647_ c:collection1 s:shard2  x:collection1_shard2_replica_t45] o.a.s.s.SolrIndexSearcher Opening [Searcher@717f93f0[collection1_shard2_replica_t45] main]
   [junit4]   2> 2279035 INFO  (qtp367964346-17294) [n:127.0.0.1:52647_ c:collection1 s:shard2  x:collection1_shard2_replica_t45] o.a.s.r.ManagedResourceStorage Configured ZooKeeperStorageIO with znodeBase: /configs/conf1
   [junit4]   2> 2279036 INFO  (qtp367964346-17294) [n:127.0.0.1:52647_ c:collection1 s:shard2  x:collection1_shard2_replica_t45] o.a.s.r.ManagedResourceStorage Loaded null at path _rest_managed.json using ZooKeeperStorageIO:path=/configs/conf1
   [junit4]   2> 2279037 INFO  (qtp367964346-17294) [n:127.0.0.1:52647_ c:collection1 s:shard2  x:collection1_shard2_replica_t45] o.a.s.h.ReplicationHandler Commits will be reserved for  10000
   [junit4]   2> 2279037 INFO  (qtp367964346-17294) [n:127.0.0.1:52647_ c:collection1 s:shard2  x:collection1_shard2_replica_t45] o.a.s.u.UpdateLog Could not find max version in index or recent updates, using new clock 1576119107974070272
   [junit4]   2> 2279038 INFO  (searcherExecutor-8233-thread-1-processing-n:127.0.0.1:52647_ x:collection1_shard2_replica_t45 s:shard2 c:collection1) [n:127.0.0.1:52647_ c:collection1 s:shard2  x:collection1_shard2_replica_t45] o.a.s.c.SolrCore [collection1_shard2_replica_t45] Registered new searcher Searcher@717f93f0[collection1_shard2_replica_t45] main{ExitableDirectoryReader(UninvertingDirectoryReader())}
   [junit4]   2> 2279042 INFO  (qtp367964346-17294) [n:127.0.0.1:52647_ c:collection1 s:shard2  x:collection1_shard2_replica_t45] o.a.s.c.ZkController Core needs to recover:collection1_shard2_replica_t45
   [junit4]   2> 2279042 INFO  (updateExecutor-2838-thread-1-processing-n:127.0.0.1:52647_ x:collection1_shard2_replica_t45 s:shard2 c:collection1) [n:127.0.0.1:52647_ c:collection1 s:shard2 r:core_node46 x:collection1_shard2_replica_t45] o.a.s.u.DefaultSolrCoreState Running recovery
   [junit4]   2> 2279042 INFO  (qtp367964346-17294) [n:127.0.0.1:52647_ c:collection1 s:shard2  x:collection1_shard2_replica_t45] o.a.s.s.HttpSolrCall [admin] webapp=null path=/admin/cores params={qt=/admin/cores&collection.configName=conf1&name=collection1_shard2_replica_t45&action=CREATE&collection=collection1&shard=shard2&wt=javabin&version=2&replicaType=TLOG} status=0 QTime=1263
   [junit4]   2> 2279043 INFO  (recoveryExecutor-2839-thread-1-processing-n:127.0.0.1:52647_ x:collection1_shard2_replica_t45 s:shard2 c:collection1 r:core_node46) [n:127.0.0.1:52647_ c:collection1 s:shard2 r:core_node46 x:collection1_shard2_replica_t45] o.a.s.c.RecoveryStrategy Starting recovery process. recoveringAfterStartup=true
   [junit4]   2> 2279043 INFO  (recoveryExecutor-2839-thread-1-processing-n:127.0.0.1:52647_ x:collection1_shard2_replica_t45 s:shard2 c:collection1 r:core_node46) [n:127.0.0.1:52647_ c:collection1 s:shard2 r:core_node46 x:collection1_shard2_replica_t45] o.a.s.c.RecoveryStrategy ###### startupVersions=[[]]
   [junit4]   2> 2279043 INFO  (recoveryExecutor-2839-thread-1-processing-n:127.0.0.1:52647_ x:collection1_shard2_replica_t45 s:shard2 c:collection1 r:core_node46) [n:127.0.0.1:52647_ c:collection1 s:shard2 r:core_node46 x:collection1_shard2_replica_t45] o.a.s.c.ZkController collection1_shard2_replica_t45 stopping background replication from leader
   [junit4]   2> 2279043 INFO  (recoveryExecutor-2839-thread-1-processing-n:127.0.0.1:52647_ x:collection1_shard2_replica_t45 s:shard2 c:collection1 r:core_node46) [n:127.0.0.1:52647_ c:collection1 s:shard2 r:core_node46 x:collection1_shard2_replica_t45] o.a.s.c.RecoveryStrategy Begin buffering updates. core=[collection1_shard2_replica_t45]
   [junit4]   2> 2279043 INFO  (recoveryExecutor-2839-thread-1-processing-n:127.0.0.1:52647_ x:collection1_shard2_replica_t45 s:shard2 c:collection1 r:core_node46) [n:127.0.0.1:52647_ c:collection1 s:shard2 r:core_node46 x:collection1_shard2_replica_t45] o.a.s.u.UpdateLog Starting to buffer updates. FSUpdateLog{state=ACTIVE, tlog=null}
   [junit4]   2> 2279043 INFO  (recoveryExecutor-2839-thread-1-processing-n:127.0.0.1:52647_ x:collection1_shard2_replica_t45 s:shard2 c:collection1 r:core_node46) [n:127.0.0.1:52647_ c:collection1 s:shard2 r:core_node46 x:collection1_shard2_replica_t45] o.a.s.c.RecoveryStrategy Publishing state of core [collection1_shard2_replica_t45] as recovering, leader is [http://127.0.0.1:52632/collection1_shard2_replica_t41/] and I am [http://127.0.0.1:52647/collection1_shard2_replica_t45/]
   [junit4]   2> 2279047 INFO  (recoveryExecutor-2839-thread-1-processing-n:127.0.0.1:52647_ x:collection1_shard2_replica_t45 s:shard2 c:collection1 r:core_node46) [n:127.0.0.1:52647_ c:collection1 s:shard2 r:core_node46 x:collection1_shard2_replica_t45] o.a.s.c.RecoveryStrategy Sending prep recovery command to [http://127.0.0.1:52632]; [WaitForState: action=PREPRECOVERY&core=collection1_shard2_replica_t41&nodeName=127.0.0.1:52647_&coreNodeName=core_node46&state=recovering&checkLive=true&onlyIfLeader=true&onlyIfLeaderActive=true]
   [junit4]   2> 2279049 INFO  (SocketProxy-Acceptor-52632) [    ] o.a.s.c.SocketProxy accepted Socket[addr=/127.0.0.1,port=52657,localport=52632], receiveBufferSize:408300
   [junit4]   2> 2279050 INFO  (SocketProxy-Acceptor-52632) [    ] o.a.s.c.SocketProxy proxy connection Socket[addr=/127.0.0.1,port=52633,localport=52658], receiveBufferSize=408300
   [junit4]   2> 2279050 INFO  (qtp1273671973-17183) [n:127.0.0.1:52618_    ] o.a.s.s.HttpSolrCall [admin] webapp=null path=/admin/collections params={node=127.0.0.1:52647_&action=ADDREPLICA&collection=collection1&shard=shard2&type=TLOG&wt=javabin&version=2} status=0 QTime=1277
   [junit4]   2> 2279051 INFO  (qtp1957280916-17230) [n:127.0.0.1:52632_    ] o.a.s.h.a.PrepRecoveryOp Going to wait for coreNodeName: core_node46, state: recovering, checkLive: true, onlyIfLeader: true, onlyIfLeaderActive: true, maxTime: 183 s
   [junit4]   2> 2279051 INFO  (qtp1957280916-17230) [n:127.0.0.1:52632_    ] o.a.s.h.a.PrepRecoveryOp In WaitForState(recovering): collection=collection1, shard=shard2, thisCore=collection1_shard2_replica_t41, leaderDoesNotNeedRecovery=false, isLeader? true, live=true, checkLive=true, currentState=down, localState=active, nodeName=127.0.0.1:52647_, coreNodeName=core_node46, onlyIfActiveCheckResult=false, nodeProps: core_node46:{"core":"collection1_shard2_replica_t45","base_url":"http://127.0.0.1:52647","node_name":"127.0.0.1:52647_","state":"down","type":"TLOG"}
   [junit4]   2> 2279053 INFO  (TEST-ForceLeaderTest.testReplicasInLIRNoLeader-seed#[AE3D80C267E8D998]) [    ] o.a.s.SolrTestCaseJ4 ###Starting testReplicasInLIRNoLeader
   [junit4]   2> 2279054 INFO  (TEST-ForceLeaderTest.testReplicasInLIRNoLeader-seed#[AE3D80C267E8D998]) [    ] o.a.s.c.AbstractFullDistribZkTestBase Creating collection with stateFormat=1: forceleader_test_collection
   [junit4]   2> 2279055 INFO  (SocketProxy-Acceptor-52632) [    ] o.a.s.c.SocketProxy accepted Socket[addr=/127.0.0.1,port=52659,localport=52632], receiveBufferSize:408300
   [junit4]   2> 2279056 INFO  (SocketProxy-Acceptor-52632) [    ] o.a.s.c.SocketProxy proxy connection Socket[addr=/127.0.0.1,port=52633,localport=52660], receiveBufferSize=408300
   [junit4]   2> 2279056 INFO  (qtp1957280916-17231) [n:127.0.0.1:52632_    ] o.a.s.h.a.CollectionsHandler Invoked Collection Action :create with params pullReplicas=0&maxShardsPerNode=1&collection.configName=conf1&nrtReplicas=0&name=forceleader_test_collection&action=CREATE&numShards=1&tlogReplicas=3&stateFormat=1&wt=javabin&version=2 and sendToOCPQueue=true
   [junit4]   2> 2279059 INFO  (OverseerThreadFactory-8197-thread-5-processing-n:127.0.0.1:52618_) [n:127.0.0.1:52618_    ] o.a.s.c.CreateCollectionCmd Create collection forceleader_test_collection
   [junit4]   2> 2279059 INFO  (OverseerCollectionConfigSetProcessor-98507443638960132-127.0.0.1:52618_-n_0000000000) [n:127.0.0.1:52618_    ] o.a.s.c.OverseerTaskQueue Response ZK path: /overseer/collection-queue-work/qnr-0000000008 doesn't exist.  Requestor may have disconnected from ZooKeeper
   [junit4]   2> 2279271 INFO  (qtp2115316225-17263) [n:127.0.0.1:52640_    ] o.a.s.h.a.CoreAdminOperation core create command qt=/admin/cores&collection.configName=conf1&newCollection=true&name=forceleader_test_collection_shard1_replica_t1&action=CREATE&numShards=1&collection=forceleader_test_collection&shard=shard1&wt=javabin&version=2&replicaType=TLOG
   [junit4]   2> 2279276 INFO  (qtp1957280916-17233) [n:127.0.0.1:52632_    ] o.a.s.h.a.CoreAdminOperation core create command qt=/admin/cores&collection.configName=conf1&newCollection=true&name=forceleader_test_collection_shard1_replica_t2&action=CREATE&numShards=1&collection=forceleader_test_collection&shard=shard1&wt=javabin&version=2&replicaType=TLOG
   [junit4]   2> 2279278 INFO  (qtp367964346-17295) [n:127.0.0.1:52647_    ] o.a.s.h.a.CoreAdminOperation core create command qt=/admin/cores&collection.configName=conf1&newCollection=true&name=forceleader_test_collection_shard1_replica_t3&action=CREATE&numShards=1&collection=forceleader_test_collection&shard=shard1&wt=javabin&version=2&replicaType=TLOG
   [junit4]   2> 2280052 INFO  (qtp1957280916-17230) [n:127.0.0.1:52632_    ] o.a.s.h.a.PrepRecoveryOp In WaitForState(recovering): collection=collection1, shard=shard2, thisCore=collection1_shard2_replica_t41, leaderDoesNotNeedRecovery=false, isLeader? true, live=true, checkLive=true, currentState=recovering, localState=active, nodeName=127.0.0.1:52647_, coreNodeName=core_node46, onlyIfActiveCheckResult=false, nodeProps: core_node46:{"core":"collection1_shard2_replica_t45","base_url":"http://127.0.0.1:52647","node_name":"127.0.0.1:52647_","state":"recovering","type":"TLOG"}
   [junit4]   2> 2280052 INFO  (qtp1957280916-17230) [n:127.0.0.1:52632_    ] o.a.s.h.a.PrepRecoveryOp Waited coreNodeName: core_node46, state: recovering, checkLive: true, onlyIfLeader: true for: 1 seconds.
   [junit4]   2> 2280052 INFO  (qtp1957280916-17230) [n:127.0.0.1:52632_    ] o.a.s.s.HttpSolrCall [admin] webapp=null path=/admin/cores params={nodeName=127.0.0.1:52647_&onlyIfLeaderActive=true&core=collection1_shard2_replica_t41&coreNodeName=core_node46&action=PREPRECOVERY&checkLive=true&state=recovering&onlyIfLeader=true&wt=javabin&version=2} status=0 QTime=1001
   [junit4]   2> 2280298 INFO  (qtp367964346-17295) [n:127.0.0.1:52647_ c:forceleader_test_collection s:shard1  x:forceleader_test_collection_shard1_replica_t3] o.a.s.c.SolrConfig Using Lucene MatchVersion: 8.0.0
   [junit4]   2> 2280299 INFO  (qtp1957280916-17233) [n:127.0.0.1:52632_ c:forceleader_test_collection s:shard1  x:forceleader_test_collection_shard1_replica_t2] o.a.s.c.SolrConfig Using Lucene MatchVersion: 8.0.0
   [junit4]   2> 2280299 INFO  (qtp2115316225-17263) [n:127.0.0.1:52640_ c:forceleader_test_collection s:shard1  x:forceleader_test_collection_shard1_replica_t1] o.a.s.c.SolrConfig Using Lucene MatchVersion: 8.0.0
   [junit4]   2> 2280336 INFO  (qtp367964346-17295) [n:127.0.0.1:52647_ c:forceleader_test_collection s:shard1  x:forceleader_test_collection_shard1_replica_t3] o.a.s.s.IndexSchema [forceleader_test_collection_shard1_replica_t3] Schema name=test
   [junit4]   2> 2280338 INFO  (qtp1957280916-17233) [n:127.0.0.1:52632_ c:forceleader_test_collection s:shard1  x:forceleader_test_collection_shard1_replica_t2] o.a.s.s.IndexSchema [forceleader_test_collection_shard1_replica_t2] Schema name=test
   [junit4]   2> 2280339 INFO  (qtp2115316225-17263) [n:127.0.0.1:52640_ c:forceleader_test_collection s:shard1  x:forceleader_test_collection_shard1_replica_t1] o.a.s.s.IndexSchema [forceleader_test_collection_shard1_replica_t1] Schema name=test
   [junit4]   2> 2280514 INFO  (qtp367964346-17295) [n:127.0.0.1:52647_ c:forceleader_test_collection s:shard1  x:forceleader_test_collection_shard1_replica_t3] o.a.s.s.IndexSchema Loaded schema test/1.0 with uniqueid field id
   [junit4]   2> 2280515 INFO  (qtp2115316225-17263) [n:127.0.0.1:52640_ c:forceleader_test_collection s:shard1  x:forceleader_test_collection_shard1_replica_t1] o.a.s.s.IndexSchema Loaded schema test/1.0 with uniqueid field id
   [junit4]   2> 2280518 INFO  (qtp1957280916-17233) [n:127.0.0.1:52632_ c:forceleader_test_collection s:shard1  x:forceleader_test_collection_shard1_replica_t2] o.a.s.s.IndexSchema Loaded schema test/1.0 with uniqueid field id
   [junit4]   2> 2280554 INFO  (recoveryExecutor-2839-thread-1-processing-n:127.0.0.1:52647_ x:collection1_shard2_replica_t45 s:shard2 c:collection1 r:core_node46) [n:127.0.0.1:52647_ c:collection1 s:shard2 r:core_node46 x:collection1_shard2_replica_t45] o.a.s.c.RecoveryStrategy Starting Replication Recovery.
   [junit4]   2> 2280554 INFO  (recoveryExecutor-2839-thread-1-processing-n:127.0.0.1:52647_ x:collection1_shard2_replica_t45 s:shard2 c:collection1 r:core_node46) [n:127.0.0.1:52647_ c:collection1 s:shard2 r:core_node46 x:collection1_shard2_replica_t45] o.a.s.c.RecoveryStrategy Attempting to replicate from [http://127.0.0.1:52632/collection1_shard2_replica_t41/].
   [junit4]   2> 2280556 INFO  (SocketProxy-Acceptor-52632) [    ] o.a.s.c.SocketProxy accepted Socket[addr=/127.0.0.1,port=52661,localport=52632], receiveBufferSize:408300
   [junit4]   2> 2280556 INFO  (SocketProxy-Acceptor-52632) [    ] o.a.s.c.SocketProxy proxy connection Socket[addr=/127.0.0.1,port=52633,localport=52662], receiveBufferSize=408300
   [junit4]   2> 2280557 INFO  (qtp1957280916-17232) [n:127.0.0.1:52632_ c:collection1 s:shard2 r:core_node42 x:collection1_shard2_replica_t41] o.a.s.u.DirectUpdateHandler2 start commit{_version_=1576119109567905792,optimize=false,openSearcher=false,waitSearcher=true,expungeDeletes=false,softCommit=false,prepareCommit=false}
   [junit4]   2> 2280557 INFO  (qtp1957280916-17232) [n:127.0.0.1:52632_ c:collection1 s:shard2 r:core_node42 x:collection1_shard2_replica_t41] o.a.s.u.DirectUpdateHandler2 No uncommitted changes. Skipping IW.commit.
   [junit4]   2> 2280560 INFO  (qtp1957280916-17233) [n:127.0.0.1:52632_ c:forceleader_test_collection s:shard1  x:forceleader_test_collection_shard1_replica_t2] o.a.s.c.CoreContainer Creating SolrCore 'forceleader_test_collection_shard1_replica_t2' using configuration from collection forceleader_test_collection, trusted=true
   [junit4]   2> 2280560 INFO  (qtp1957280916-17233) [n:127.0.0.1:52632_ c:forceleader_test_collection s:shard1  x:forceleader_test_collection_shard1_replica_t2] o.a.s.m.r.SolrJmxReporter JMX monitoring for 'solr.core.forceleader_test_collection.shard1.replica_t2' (registry 'solr.core.forceleader_test_collection.shard1.replica_t2') enabled at server: com.sun.jmx.mbeanserver.JmxMBeanServer@33a2bc0
   [junit4]   2> 2280561 INFO  (qtp1957280916-17233) [n:127.0.0.1:52632_ c:forceleader_test_collection s:shard1  x:forceleader_test_collection_shard1_replica_t2] o.a.s.c.SolrCore solr.RecoveryStrategy.Builder
   [junit4]   2> 2280561 INFO  (qtp2115316225-17263) [n:127.0.0.1:52640_ c:forceleader_test_collection s:shard1  x:forceleader_test_collection_shard1_replica_t1] o.a.s.c.CoreContainer Creating SolrCore 'forceleader_test_collection_shard1_replica_t1' using configuration from collection forceleader_test_collection, trusted=true
   [junit4]   2> 2280561 INFO  (qtp1957280916-17233) [n:127.0.0.1:52632_ c:forceleader_test_collection s:shard1  x:forceleader_test_collection_shard1_replica_t2] o.a.s.c.SolrCore [[forceleader_test_collection_shard1_replica_t2] ] Opening new SolrCore at [/Users/jenkins/workspace/Lucene-Solr-master-MacOSX/solr/build/solr-core/test/J1/temp/solr.cloud.ForceLeaderTest_AE3D80C267E8D998-001/shard-1-001/cores/forceleader_test_collection_shard1_replica_t2], dataDir=[/Users/jenkins/workspace/Lucene-Solr-master-MacOSX/solr/build/solr-core/test/J1/temp/solr.cloud.ForceLeaderTest_AE3D80C267E8D998-001/shard-1-001/cores/forceleader_test_collection_shard1_replica_t2/data/]
   [junit4]   2> 2280561 INFO  (qtp2115316225-17263) [n:127.0.0.1:52640_ c:forceleader_test_collection s:shard1  x:forceleader_test_collection_shard1_replica_t1] o.a.s.m.r.SolrJmxReporter JMX monitoring for 'solr.core.

[...truncated too long message...]

collection1 s:shard2 r:core_node46 x:collection1_shard2_replica_t45] o.a.s.m.SolrMetricManager Closing metric reporters for registry=solr.core.collection1.shard2.replica_t45, tag=1788990889
   [junit4]   2> 2370114 INFO  (zkCallback-2875-thread-2-processing-n:127.0.0.1:52819_) [n:127.0.0.1:52819_ c:collection1 s:shard2 r:core_node46 x:collection1_shard2_replica_t45] o.a.s.m.r.SolrJmxReporter Closing reporter [org.apache.solr.metrics.reporters.SolrJmxReporter@62385d91: rootName = null, domain = solr.core.collection1.shard2.replica_t45, service url = null, agent id = null] for registry solr.core.collection1.shard2.replica_t45 / com.codahale.metrics.MetricRegistry@3d8121de
   [junit4]   2> 2370123 INFO  (zkCallback-2875-thread-2-processing-n:127.0.0.1:52819_) [n:127.0.0.1:52819_ c:collection1 s:shard2 r:core_node46 x:collection1_shard2_replica_t45] o.a.s.m.SolrMetricManager Closing metric reporters for registry=solr.collection.collection1.shard2.leader, tag=1788990889
   [junit4]   2> 2370124 INFO  (TEST-ForceLeaderTest.testLastPublishedStateIsActive-seed#[AE3D80C267E8D998]) [    ] o.e.j.s.AbstractConnector Stopped ServerConnector@f864c96{HTTP/1.1,[http/1.1]}{127.0.0.1:0}
   [junit4]   2> 2370124 INFO  (TEST-ForceLeaderTest.testLastPublishedStateIsActive-seed#[AE3D80C267E8D998]) [    ] o.e.j.s.h.ContextHandler Stopped o.e.j.s.ServletContextHandler@43e9f6cd{/,null,UNAVAILABLE}
   [junit4]   2> 2370130 INFO  (TEST-ForceLeaderTest.testLastPublishedStateIsActive-seed#[AE3D80C267E8D998]) [    ] o.a.s.c.ChaosMonkey monkey: stop jetty! 52769
   [junit4]   2> 2370130 ERROR (TEST-ForceLeaderTest.testLastPublishedStateIsActive-seed#[AE3D80C267E8D998]) [    ] o.a.z.s.ZooKeeperServer ZKShutdownHandler is not registered, so ZooKeeper server won't take any action on ERROR or SHUTDOWN server state changes
   [junit4]   2> 2370131 INFO  (TEST-ForceLeaderTest.testLastPublishedStateIsActive-seed#[AE3D80C267E8D998]) [    ] o.a.s.c.ZkTestServer connecting to 127.0.0.1:52766 52766
   [junit4]   2> 2370162 INFO  (Thread-3647) [    ] o.a.s.c.ZkTestServer connecting to 127.0.0.1:52766 52766
   [junit4]   2> 2371286 WARN  (Thread-3647) [    ] o.a.s.c.ZkTestServer Watch limit violations: 
   [junit4]   2> Maximum concurrent create/delete watches above limit:
   [junit4]   2> 
   [junit4]   2> 	6	/solr/aliases.json
   [junit4]   2> 	4	/solr/security.json
   [junit4]   2> 	4	/solr/configs/conf1
   [junit4]   2> 
   [junit4]   2> Maximum concurrent data watches above limit:
   [junit4]   2> 
   [junit4]   2> 	6	/solr/clusterstate.json
   [junit4]   2> 	6	/solr/clusterprops.json
   [junit4]   2> 	3	/solr/collections/forceleader_last_published/state.json
   [junit4]   2> 	3	/solr/collections/collection1/state.json
   [junit4]   2> 
   [junit4]   2> Maximum concurrent children watches above limit:
   [junit4]   2> 
   [junit4]   2> 	6	/solr/live_nodes
   [junit4]   2> 	6	/solr/collections
   [junit4]   2> 
   [junit4]   2> 2371286 WARN  (TEST-ForceLeaderTest.testLastPublishedStateIsActive-seed#[AE3D80C267E8D998]) [    ] o.a.s.c.SocketProxy Closing 1 connections to: http://127.0.0.1:52819/, target: http://127.0.0.1:52820/
   [junit4]   2> 2371287 WARN  (TEST-ForceLeaderTest.testLastPublishedStateIsActive-seed#[AE3D80C267E8D998]) [    ] o.a.s.c.SocketProxy Closing 4 connections to: http://127.0.0.1:52809/, target: http://127.0.0.1:52810/
   [junit4]   2> 2371287 WARN  (TEST-ForceLeaderTest.testLastPublishedStateIsActive-seed#[AE3D80C267E8D998]) [    ] o.a.s.c.SocketProxy Closing 6 connections to: http://127.0.0.1:52801/, target: http://127.0.0.1:52802/
   [junit4]   2> 2371287 WARN  (TEST-ForceLeaderTest.testLastPublishedStateIsActive-seed#[AE3D80C267E8D998]) [    ] o.a.s.c.SocketProxy Closing 5 connections to: http://127.0.0.1:52769/, target: http://127.0.0.1:52770/
   [junit4]   2> NOTE: leaving temporary files on disk at: /Users/jenkins/workspace/Lucene-Solr-master-MacOSX/solr/build/solr-core/test/J1/temp/solr.cloud.ForceLeaderTest_AE3D80C267E8D998-001
   [junit4]   2> NOTE: test params are: codec=Lucene70, sim=RandomSimilarity(queryNorm=true): {}, locale=en-IN, timezone=Europe/Minsk
   [junit4]   2> NOTE: Mac OS X 10.11.6 x86_64/Oracle Corporation 1.8.0_144 (64-bit)/cpus=3,threads=1,free=114333272,total=526909440
   [junit4]   2> NOTE: All tests run in this JVM: [TestSolrCloudWithSecureImpersonation, TestCloudRecovery, AtomicUpdateProcessorFactoryTest, TestRequestForwarding, TestDistribIDF, TestTestInjection, TestBM25SimilarityFactory, TestDistribDocBasedVersion, HdfsThreadLeakTest, TestRTGBase, HdfsLockFactoryTest, BlockCacheTest, BasicFunctionalityTest, DeleteShardTest, PingRequestHandlerTest, HdfsRecoverLeaseTest, TestSchemalessBufferedUpdates, TestCustomStream, TestBlendedInfixSuggestions, TestManagedSynonymGraphFilterFactory, DistributedTermsComponentTest, DocExpirationUpdateProcessorFactoryTest, LargeFieldTest, CollectionsAPIDistributedZkTest, StatsReloadRaceTest, TestDocumentBuilder, TestInitParams, DOMUtilTest, TestSchemaNameResource, TestLegacyFieldCache, TestNumericRangeQuery32, TestExpandComponent, ZkSolrClientTest, FacetPivotSmallTest, TestReloadAndDeleteDocs, DebugComponentTest, SolrShardReporterTest, ChaosMonkeySafeLeaderWithPullReplicasTest, BasicZkTest, CoreMergeIndexesAdminHandlerTest, TestStressLucene, TestQueryWrapperFilter, ImplicitSnitchTest, TestFreeTextSuggestions, SolrJmxReporterCloudTest, V2ApiIntegrationTest, SimpleCollectionCreateDeleteTest, TestStressInPlaceUpdates, DirectoryFactoryTest, AddBlockUpdateTest, TestNumericTerms64, TestRemoteStreaming, TestExclusionRuleCollectionAccess, HdfsUnloadDistributedZkTest, TestCoreDiscovery, TestRawResponseWriter, ClassificationUpdateProcessorTest, RankQueryTest, ReplicaListTransformerTest, PeerSyncReplicationTest, TestSolrCloudWithDelegationTokens, CdcrReplicationHandlerTest, TestMacros, SolrCoreCheckLockOnStartupTest, RemoteQueryErrorTest, TestWordDelimiterFilterFactory, BadIndexSchemaTest, OpenCloseCoreStressTest, TestCollationField, TestUnifiedSolrHighlighter, HdfsRestartWhileUpdatingTest, StressHdfsTest, TestQueryUtils, MigrateRouteKeyTest, TestLeaderElectionWithEmptyReplica, TestIndexSearcher, TestJavabinTupleStreamParser, ConvertedLegacyTest, TestBackupRepositoryFactory, TestComponentsName, AssignBackwardCompatibilityTest, TestValueSourceCache, TestGeoJSONResponseWriter, TestLuceneMatchVersion, SpellCheckComponentTest, CloudMLTQParserTest, TestSolrDeletionPolicy1, PeerSyncWithIndexFingerprintCachingTest, ZkStateReaderTest, JavabinLoaderTest, TestManagedStopFilterFactory, TestHashQParserPlugin, SharedFSAutoReplicaFailoverTest, HttpPartitionTest, SolrPluginUtilsTest, DistribCursorPagingTest, HdfsBasicDistributedZk2Test, SampleTest, PluginInfoTest, UUIDUpdateProcessorFallbackTest, TestDistributedGrouping, SearchHandlerTest, TestSystemIdResolver, HdfsDirectoryFactoryTest, TestSha256AuthenticationProvider, ClassificationUpdateProcessorFactoryTest, SpellPossibilityIteratorTest, StatelessScriptUpdateProcessorFactoryTest, BJQParserTest, HdfsChaosMonkeyNothingIsSafeTest, TestConfigReload, SuggesterTSTTest, HLLSerializationTest, AnalyticsQueryTest, TestPayloadCheckQParserPlugin, TestHalfAndHalfDocValues, AsyncCallRequestStatusResponseTest, DistributedFacetPivotSmallAdvancedTest, TestComplexPhraseLeadingWildcard, TestLeaderInitiatedRecoveryThread, TestClusterProperties, TestAddFieldRealTimeGet, TestNumericTokenStream, LoggingHandlerTest, TestBulkSchemaConcurrent, TestNestedDocsSort, VersionInfoTest, BasicAuthIntegrationTest, DistributedMLTComponentTest, TestLegacyTerms, ExplicitHLLTest, ReplicationFactorTest, TestLockTree, TestImpersonationWithHadoopAuth, TestSuggestSpellingConverter, TestUseDocValuesAsStored2, CdcrBootstrapTest, SpellCheckCollatorTest, DistributedFacetPivotLargeTest, ActionThrottleTest, FullSolrCloudDistribCmdsTest, SchemaVersionSpecificBehaviorTest, SmileWriterTest, StatsComponentTest, TestEmbeddedSolrServerConstructors, ParsingFieldUpdateProcessorsTest, TestClassicSimilarityFactory, TestLMJelinekMercerSimilarityFactory, ConfigureRecoveryStrategyTest, TestSolr4Spatial, TestCloudSchemaless, SecurityConfHandlerTest, SolrRequestParserTest, TestLRUCache, TestDocSet, TestFiltering, AutoScalingHandlerTest, TestDocBasedVersionConstraints, TestOnReconnectListenerSupport, CdcrUpdateLogTest, ManagedSchemaRoundRobinCloudTest, OpenExchangeRatesOrgProviderTest, TermVectorComponentDistributedTest, TestTrie, SparseHLLTest, CheckHdfsIndexTest, TestCharFilters, TestPKIAuthenticationPlugin, TestLegacyNumericRangeQueryBuilder, BadComponentTest, TestRandomFlRTGCloud, TestStreamBody, TestBadConfig, TestFastLRUCache, BasicDistributedZkTest, ChaosMonkeySafeLeaderTest, BasicDistributedZk2Test, SyncSliceTest, OverseerTest, LeaderElectionIntegrationTest, ShardRoutingTest, TestReplicationHandler, ClusterStateUpdateTest, TestRandomFaceting, TestZkChroot, TestRandomDVFaceting, ShardRoutingCustomTest, AutoCommitTest, TestRecovery, ZkControllerTest, TestRealTimeGet, TestJoin, TestRangeQuery, TestSort, TestLazyCores, HighlighterTest, ShowFileRequestHandlerTest, DistributedQueryElevationComponentTest, SuggesterTest, SpatialFilterTest, TestCSVLoader, PolyFieldTest, NoCacheHeaderTest, WordBreakSolrSpellCheckerTest, TestUpdate, FieldMutatingUpdateProcessorTest, TestAtomicUpdateErrorCases, QueryEqualityTest, DocValuesMultiTest, XsltUpdateRequestHandlerTest, TestSurroundQueryParser, LukeRequestHandlerTest, TestQueryTypes, FileBasedSpellCheckerTest, RequestHandlersTest, TermVectorComponentTest, MoreLikeThisHandlerTest, TestSolrQueryParser, IndexSchemaRuntimeFieldTest, ReturnFieldsTest, MBeansHandlerTest, JsonLoaderTest, TestPartialUpdateDeduplication, CSVRequestHandlerTest, TestLFUCache, TestStressRecovery, ConcurrentDeleteAndCreateCollectionTest, ConnectionManagerTest, CustomCollectionTest, DeleteReplicaTest, DistributedQueueTest, DocValuesNotIndexedTest, ForceLeaderTest]
   [junit4] Completed [521/730 (1!)] on J1 in 101.58s, 3 tests, 1 failure, 1 skipped <<< FAILURES!

[...truncated 44018 lines...]