You are viewing a plain text version of this content. The canonical link for it is here.
Posted to builds@cassandra.apache.org by Apache Jenkins Server <je...@builds.apache.org> on 2022/11/08 14:15:22 UTC
Build complete: Cassandra-4.1 #205 [UNSTABLE] a805e3267572a86dc731df509f0540fc85e08b78
-------------------------------------------------------------------------------
Build Cassandra-4.1 #205 Still unstable
URL: https://ci-cassandra.apache.org/job/Cassandra-4.1/205/
-------------------------------------------------------------------------------
Changes:
[lewandowski.jacek] Move Schema.FORCE_LOAD_KEYSPACES and Schema.FORCE_LOAD_KEYSPACES_PROP to
-------------------------------------------------------------------------------
Failed Tests:
10 tests failed.
FAILED: dtest-novnode.topology_test.TestTopology.test_decommission
FAILED: dtest-novnode.materialized_views_test.TestMaterializedViewsConsistency.test_multi_partition_consistent_reads_after_write
FAILED: dtest-offheap.cqlsh_tests.test_cqlsh_copy.TestCqlshCopy.test_bulk_round_trip_blogposts_with_max_connections
FAILED: dtest-offheap.global_row_key_cache_test.TestGlobalRowKeyCache.test_functional
FAILED: dtest-offheap.replace_address_test.TestReplaceAddress.test_unsafe_replace
FAILED: dtest-upgrade.upgrade_tests.upgrade_through_versions_test.TestUpgrade_indev_3_11_x_To_indev_4_1_x.test_bootstrap_multidc
FAILED: dtest-upgrade.upgrade_tests.upgrade_through_versions_test.TestProtoV3Upgrade_AllVersions_RandomPartitioner_EndsAt_3_11_X_HEAD.test_parallel_upgrade_with_internode_ssl
FAILED: dtest.replace_address_test.TestReplaceAddress.test_unsafe_replace
FAILED: dtest.bootstrap_test.TestBootstrap.test_simultaneous_bootstrap
FAILED: org.apache.cassandra.net.ProxyHandlerConnectionsTest.testExpireSome-compression
-------------------------------------------------------------------------------
For complete test report and logs see https://nightlies.apache.org/cassandra/Cassandra-4.1/205/