You are viewing a plain text version of this content. The canonical link for it is here.
Posted to dev@zookeeper.apache.org by Apache Jenkins Server <je...@builds.apache.org> on 2011/10/20 12:12:34 UTC
Failed: ZOOKEEPER-1198 PreCommit Build #638
Jira: https://issues.apache.org/jira/browse/ZOOKEEPER-1198
Build: https://builds.apache.org/job/PreCommit-ZOOKEEPER-Build/638/
###################################################################################
########################## LAST 60 LINES OF THE CONSOLE ###########################
[...truncated 143262 lines...]
[exec]
[exec]
[exec]
[exec] -1 overall. Here are the results of testing the latest attachment
[exec] http://issues.apache.org/jira/secure/attachment/12499839/ZOOKEEPER-1198.patch
[exec] against trunk revision 1185994.
[exec]
[exec] +1 @author. The patch does not contain any @author tags.
[exec]
[exec] +1 tests included. The patch appears to include 128 new or modified tests.
[exec]
[exec] +1 javadoc. The javadoc tool did not generate any warning messages.
[exec]
[exec] -1 javac. The patch appears to cause tar ant target to fail.
[exec]
[exec] -1 findbugs. The patch appears to introduce 1 new Findbugs (version 1.3.9) warnings.
[exec]
[exec] +1 release audit. The applied patch does not increase the total number of release audit warnings.
[exec]
[exec] -1 core tests. The patch failed core unit tests.
[exec]
[exec] +1 contrib tests. The patch passed contrib unit tests.
[exec]
[exec] Test results: https://builds.apache.org/job/PreCommit-ZOOKEEPER-Build/638//testReport/
[exec] Findbugs warnings: https://builds.apache.org/job/PreCommit-ZOOKEEPER-Build/638//artifact/trunk/build/test/findbugs/newPatchFindbugsWarnings.html
[exec] Console output: https://builds.apache.org/job/PreCommit-ZOOKEEPER-Build/638//console
[exec]
[exec] This message is automatically generated.
[exec]
[exec]
[exec] ======================================================================
[exec] ======================================================================
[exec] Adding comment to Jira.
[exec] ======================================================================
[exec] ======================================================================
[exec]
[exec]
[exec] Comment added.
[exec] Os327dlc2Q logged out
[exec]
[exec]
[exec] ======================================================================
[exec] ======================================================================
[exec] Finished build.
[exec] ======================================================================
[exec] ======================================================================
[exec]
[exec]
BUILD FAILED
/home/jenkins/jenkins-slave/workspace/PreCommit-ZOOKEEPER-Build/trunk/build.xml:1583: exec returned: 3
Total time: 20 minutes 44 seconds
Build step 'Execute shell' marked build as failure
Archiving artifacts
Recording test results
Description set: ZOOKEEPER-1198
Email was triggered for: Failure
Sending email for trigger: Failure
###################################################################################
############################## FAILED TESTS (if any) ##############################
5 tests failed.
REGRESSION: org.apache.zookeeper.test.ObserverQuorumHammerTest.testHammerBasic
Error Message:
waiting for server up
Stack Trace:
junit.framework.AssertionFailedError: waiting for server up
at org.apache.zookeeper.test.QuorumBase.startServers(QuorumBase.java:193)
at org.apache.zookeeper.test.QuorumBase.setUp(QuorumBase.java:103)
at org.apache.zookeeper.test.ObserverQuorumHammerTest.setUp(ObserverQuorumHammerTest.java:30)
REGRESSION: org.apache.zookeeper.test.ObserverTest.testObserver
Error Message:
KeeperErrorCode = ConnectionLoss for /obstest
Stack Trace:
org.apache.zookeeper.KeeperException$ConnectionLossException: KeeperErrorCode = ConnectionLoss for /obstest
at org.apache.zookeeper.KeeperException.create(KeeperException.java:101)
at org.apache.zookeeper.KeeperException.create(KeeperException.java:53)
at org.apache.zookeeper.ZooKeeper.setData(ZooKeeper.java:1229)
at org.apache.zookeeper.test.ObserverTest.testObserver(ObserverTest.java:109)
at org.apache.zookeeper.JUnit4ZKTestRunner$LoggedInvokeMethod.evaluate(JUnit4ZKTestRunner.java:52)
REGRESSION: org.apache.zookeeper.test.QuorumTest.testSessionMoved
Error Message:
null
Stack Trace:
junit.framework.AssertionFailedError
at org.apache.zookeeper.test.QuorumTest.testSessionMoved(QuorumTest.java:224)
at org.apache.zookeeper.JUnit4ZKTestRunner$LoggedInvokeMethod.evaluate(JUnit4ZKTestRunner.java:52)
REGRESSION: org.apache.zookeeper.test.ReadOnlyModeTest.testSessionEstablishment
Error Message:
Did not connect
Stack Trace:
java.util.concurrent.TimeoutException: Did not connect
at org.apache.zookeeper.test.ClientBase$CountdownWatcher.waitForConnected(ClientBase.java:124)
at org.apache.zookeeper.test.ReadOnlyModeTest.testSessionEstablishment(ReadOnlyModeTest.java:160)
at org.apache.zookeeper.JUnit4ZKTestRunner$LoggedInvokeMethod.evaluate(JUnit4ZKTestRunner.java:52)
REGRESSION: org.apache.zookeeper.test.ReadOnlyModeTest.testSeekForRwServer
Error Message:
Did not connect
Stack Trace:
java.util.concurrent.TimeoutException: Did not connect
at org.apache.zookeeper.test.ClientBase$CountdownWatcher.waitForConnected(ClientBase.java:124)
at org.apache.zookeeper.test.ReadOnlyModeTest.testSeekForRwServer(ReadOnlyModeTest.java:201)
at org.apache.zookeeper.JUnit4ZKTestRunner$LoggedInvokeMethod.evaluate(JUnit4ZKTestRunner.java:52)
Success: ZOOKEEPER-1241 PreCommit Build #641
Posted by Apache Jenkins Server <je...@builds.apache.org>.
Jira: https://issues.apache.org/jira/browse/ZOOKEEPER-1241
Build: https://builds.apache.org/job/PreCommit-ZOOKEEPER-Build/641/
###################################################################################
########################## LAST 60 LINES OF THE CONSOLE ###########################
[...truncated 142429 lines...]
[exec] BUILD SUCCESSFUL
[exec] Total time: 0 seconds
[exec]
[exec]
[exec]
[exec]
[exec] +1 overall. Here are the results of testing the latest attachment
[exec] http://issues.apache.org/jira/secure/attachment/12500366/ZOOKEEPER-1241.patch
[exec] against trunk revision 1186967.
[exec]
[exec] +1 @author. The patch does not contain any @author tags.
[exec]
[exec] +0 tests included. The patch appears to be a documentation patch that doesn't require tests.
[exec]
[exec] +1 javadoc. The javadoc tool did not generate any warning messages.
[exec]
[exec] +1 javac. The applied patch does not increase the total number of javac compiler warnings.
[exec]
[exec] +1 findbugs. The patch does not introduce any new Findbugs (version 1.3.9) warnings.
[exec]
[exec] +1 release audit. The applied patch does not increase the total number of release audit warnings.
[exec]
[exec] +1 core tests. The patch passed core unit tests.
[exec]
[exec] +1 contrib tests. The patch passed contrib unit tests.
[exec]
[exec] Test results: https://builds.apache.org/job/PreCommit-ZOOKEEPER-Build/641//testReport/
[exec] Findbugs warnings: https://builds.apache.org/job/PreCommit-ZOOKEEPER-Build/641//artifact/trunk/build/test/findbugs/newPatchFindbugsWarnings.html
[exec] Console output: https://builds.apache.org/job/PreCommit-ZOOKEEPER-Build/641//console
[exec]
[exec] This message is automatically generated.
[exec]
[exec]
[exec] ======================================================================
[exec] ======================================================================
[exec] Adding comment to Jira.
[exec] ======================================================================
[exec] ======================================================================
[exec]
[exec]
[exec] Comment added.
[exec] 811MwYeIq5 logged out
[exec]
[exec]
[exec] ======================================================================
[exec] ======================================================================
[exec] Finished build.
[exec] ======================================================================
[exec] ======================================================================
[exec]
[exec]
BUILD SUCCESSFUL
Total time: 22 minutes 34 seconds
Archiving artifacts
Recording test results
Description set: ZOOKEEPER-1241
Email was triggered for: Success
Sending email for trigger: Success
###################################################################################
############################## FAILED TESTS (if any) ##############################
All tests passed
Failed: ZOOKEEPER-1198 PreCommit Build #640
Posted by Apache Jenkins Server <je...@builds.apache.org>.
Jira: https://issues.apache.org/jira/browse/ZOOKEEPER-1198
Build: https://builds.apache.org/job/PreCommit-ZOOKEEPER-Build/640/
###################################################################################
########################## LAST 60 LINES OF THE CONSOLE ###########################
[...truncated 135060 lines...]
[exec]
[exec]
[exec]
[exec] -1 overall. Here are the results of testing the latest attachment
[exec] http://issues.apache.org/jira/secure/attachment/12499857/ZOOKEEPER-1198.patch
[exec] against trunk revision 1185994.
[exec]
[exec] +1 @author. The patch does not contain any @author tags.
[exec]
[exec] +1 tests included. The patch appears to include 128 new or modified tests.
[exec]
[exec] +1 javadoc. The javadoc tool did not generate any warning messages.
[exec]
[exec] -1 javac. The patch appears to cause tar ant target to fail.
[exec]
[exec] -1 findbugs. The patch appears to introduce 1 new Findbugs (version 1.3.9) warnings.
[exec]
[exec] +1 release audit. The applied patch does not increase the total number of release audit warnings.
[exec]
[exec] -1 core tests. The patch failed core unit tests.
[exec]
[exec] +1 contrib tests. The patch passed contrib unit tests.
[exec]
[exec] Test results: https://builds.apache.org/job/PreCommit-ZOOKEEPER-Build/640//testReport/
[exec] Findbugs warnings: https://builds.apache.org/job/PreCommit-ZOOKEEPER-Build/640//artifact/trunk/build/test/findbugs/newPatchFindbugsWarnings.html
[exec] Console output: https://builds.apache.org/job/PreCommit-ZOOKEEPER-Build/640//console
[exec]
[exec] This message is automatically generated.
[exec]
[exec]
[exec] ======================================================================
[exec] ======================================================================
[exec] Adding comment to Jira.
[exec] ======================================================================
[exec] ======================================================================
[exec]
[exec]
[exec] Comment added.
[exec] 174EmEr29x logged out
[exec]
[exec]
[exec] ======================================================================
[exec] ======================================================================
[exec] Finished build.
[exec] ======================================================================
[exec] ======================================================================
[exec]
[exec]
BUILD FAILED
/home/jenkins/jenkins-slave/workspace/PreCommit-ZOOKEEPER-Build/trunk/build.xml:1583: exec returned: 3
Total time: 20 minutes 24 seconds
Build step 'Execute shell' marked build as failure
Archiving artifacts
Recording test results
Description set: ZOOKEEPER-1198
Email was triggered for: Failure
Sending email for trigger: Failure
###################################################################################
############################## FAILED TESTS (if any) ##############################
4 tests failed.
FAILED: org.apache.zookeeper.test.ObserverTest.testObserver
Error Message:
KeeperErrorCode = ConnectionLoss for /obstest
Stack Trace:
org.apache.zookeeper.KeeperException$ConnectionLossException: KeeperErrorCode = ConnectionLoss for /obstest
at org.apache.zookeeper.KeeperException.create(KeeperException.java:101)
at org.apache.zookeeper.KeeperException.create(KeeperException.java:53)
at org.apache.zookeeper.ZooKeeper.setData(ZooKeeper.java:1229)
at org.apache.zookeeper.test.ObserverTest.testObserver(ObserverTest.java:109)
at org.apache.zookeeper.JUnit4ZKTestRunner$LoggedInvokeMethod.evaluate(JUnit4ZKTestRunner.java:52)
FAILED: org.apache.zookeeper.test.QuorumTest.testSessionMoved
Error Message:
null
Stack Trace:
junit.framework.AssertionFailedError
at org.apache.zookeeper.test.QuorumTest.testSessionMoved(QuorumTest.java:224)
at org.apache.zookeeper.JUnit4ZKTestRunner$LoggedInvokeMethod.evaluate(JUnit4ZKTestRunner.java:52)
FAILED: org.apache.zookeeper.test.ReadOnlyModeTest.testSessionEstablishment
Error Message:
Did not connect
Stack Trace:
java.util.concurrent.TimeoutException: Did not connect
at org.apache.zookeeper.test.ClientBase$CountdownWatcher.waitForConnected(ClientBase.java:124)
at org.apache.zookeeper.test.ReadOnlyModeTest.testSessionEstablishment(ReadOnlyModeTest.java:160)
at org.apache.zookeeper.JUnit4ZKTestRunner$LoggedInvokeMethod.evaluate(JUnit4ZKTestRunner.java:52)
FAILED: org.apache.zookeeper.test.ReadOnlyModeTest.testSeekForRwServer
Error Message:
Did not connect
Stack Trace:
java.util.concurrent.TimeoutException: Did not connect
at org.apache.zookeeper.test.ClientBase$CountdownWatcher.waitForConnected(ClientBase.java:124)
at org.apache.zookeeper.test.ReadOnlyModeTest.testSeekForRwServer(ReadOnlyModeTest.java:201)
at org.apache.zookeeper.JUnit4ZKTestRunner$LoggedInvokeMethod.evaluate(JUnit4ZKTestRunner.java:52)
Failed: ZOOKEEPER-1198 PreCommit Build #639
Posted by Apache Jenkins Server <je...@builds.apache.org>.
Jira: https://issues.apache.org/jira/browse/ZOOKEEPER-1198
Build: https://builds.apache.org/job/PreCommit-ZOOKEEPER-Build/639/
###################################################################################
########################## LAST 60 LINES OF THE CONSOLE ###########################
[...truncated 133247 lines...]
[exec]
[exec]
[exec]
[exec] -1 overall. Here are the results of testing the latest attachment
[exec] http://issues.apache.org/jira/secure/attachment/12499850/ZOOKEEPER-1198.patch
[exec] against trunk revision 1185994.
[exec]
[exec] +1 @author. The patch does not contain any @author tags.
[exec]
[exec] +1 tests included. The patch appears to include 128 new or modified tests.
[exec]
[exec] +1 javadoc. The javadoc tool did not generate any warning messages.
[exec]
[exec] -1 javac. The patch appears to cause tar ant target to fail.
[exec]
[exec] -1 findbugs. The patch appears to introduce 1 new Findbugs (version 1.3.9) warnings.
[exec]
[exec] +1 release audit. The applied patch does not increase the total number of release audit warnings.
[exec]
[exec] -1 core tests. The patch failed core unit tests.
[exec]
[exec] +1 contrib tests. The patch passed contrib unit tests.
[exec]
[exec] Test results: https://builds.apache.org/job/PreCommit-ZOOKEEPER-Build/639//testReport/
[exec] Findbugs warnings: https://builds.apache.org/job/PreCommit-ZOOKEEPER-Build/639//artifact/trunk/build/test/findbugs/newPatchFindbugsWarnings.html
[exec] Console output: https://builds.apache.org/job/PreCommit-ZOOKEEPER-Build/639//console
[exec]
[exec] This message is automatically generated.
[exec]
[exec]
[exec] ======================================================================
[exec] ======================================================================
[exec] Adding comment to Jira.
[exec] ======================================================================
[exec] ======================================================================
[exec]
[exec]
[exec] Comment added.
[exec] 299ZWZAS72 logged out
[exec]
[exec]
[exec] ======================================================================
[exec] ======================================================================
[exec] Finished build.
[exec] ======================================================================
[exec] ======================================================================
[exec]
[exec]
BUILD FAILED
/home/jenkins/jenkins-slave/workspace/PreCommit-ZOOKEEPER-Build/trunk/build.xml:1583: exec returned: 3
Total time: 19 minutes 54 seconds
Build step 'Execute shell' marked build as failure
Archiving artifacts
Recording test results
Description set: ZOOKEEPER-1198
Email was triggered for: Failure
Sending email for trigger: Failure
###################################################################################
############################## FAILED TESTS (if any) ##############################
4 tests failed.
FAILED: org.apache.zookeeper.test.ObserverTest.testObserver
Error Message:
KeeperErrorCode = ConnectionLoss for /obstest
Stack Trace:
org.apache.zookeeper.KeeperException$ConnectionLossException: KeeperErrorCode = ConnectionLoss for /obstest
at org.apache.zookeeper.KeeperException.create(KeeperException.java:101)
at org.apache.zookeeper.KeeperException.create(KeeperException.java:53)
at org.apache.zookeeper.ZooKeeper.setData(ZooKeeper.java:1229)
at org.apache.zookeeper.test.ObserverTest.testObserver(ObserverTest.java:109)
at org.apache.zookeeper.JUnit4ZKTestRunner$LoggedInvokeMethod.evaluate(JUnit4ZKTestRunner.java:52)
FAILED: org.apache.zookeeper.test.QuorumTest.testSessionMoved
Error Message:
null
Stack Trace:
junit.framework.AssertionFailedError
at org.apache.zookeeper.test.QuorumTest.testSessionMoved(QuorumTest.java:224)
at org.apache.zookeeper.JUnit4ZKTestRunner$LoggedInvokeMethod.evaluate(JUnit4ZKTestRunner.java:52)
FAILED: org.apache.zookeeper.test.ReadOnlyModeTest.testSessionEstablishment
Error Message:
Did not connect
Stack Trace:
java.util.concurrent.TimeoutException: Did not connect
at org.apache.zookeeper.test.ClientBase$CountdownWatcher.waitForConnected(ClientBase.java:124)
at org.apache.zookeeper.test.ReadOnlyModeTest.testSessionEstablishment(ReadOnlyModeTest.java:160)
at org.apache.zookeeper.JUnit4ZKTestRunner$LoggedInvokeMethod.evaluate(JUnit4ZKTestRunner.java:52)
FAILED: org.apache.zookeeper.test.ReadOnlyModeTest.testSeekForRwServer
Error Message:
Did not connect
Stack Trace:
java.util.concurrent.TimeoutException: Did not connect
at org.apache.zookeeper.test.ClientBase$CountdownWatcher.waitForConnected(ClientBase.java:124)
at org.apache.zookeeper.test.ReadOnlyModeTest.testSeekForRwServer(ReadOnlyModeTest.java:201)
at org.apache.zookeeper.JUnit4ZKTestRunner$LoggedInvokeMethod.evaluate(JUnit4ZKTestRunner.java:52)