You are viewing a plain text version of this content. The canonical link for it is here.
Posted to mapreduce-issues@hadoop.apache.org by "Hadoop QA (JIRA)" <ji...@apache.org> on 2015/02/10 05:25:35 UTC

[jira] [Commented] (MAPREDUCE-6234) TestHighRamJob fails due to the change in MAPREDUCE-5785

    [ https://issues.apache.org/jira/browse/MAPREDUCE-6234?page=com.atlassian.jira.plugin.system.issuetabpanels:comment-tabpanel&focusedCommentId=14313534#comment-14313534 ] 

Hadoop QA commented on MAPREDUCE-6234:
--------------------------------------

{color:green}+1 overall{color}.  Here are the results of testing the latest attachment 
  http://issues.apache.org/jira/secure/attachment/12697632/MAPREDUCE-6234.003.patch
  against trunk revision 260b5e3.

    {color:green}+1 @author{color}.  The patch does not contain any @author tags.

    {color:green}+1 tests included{color}.  The patch appears to include 1 new or modified test files.

    {color:green}+1 javac{color}.  The applied patch does not increase the total number of javac compiler warnings.

    {color:green}+1 javadoc{color}.  There were no new javadoc warning messages.

    {color:green}+1 eclipse:eclipse{color}.  The patch built with eclipse:eclipse.

    {color:green}+1 findbugs{color}.  The patch does not introduce any new Findbugs (version 2.0.3) warnings.

    {color:green}+1 release audit{color}.  The applied patch does not increase the total number of release audit warnings.

    {color:green}+1 core tests{color}.  The patch passed unit tests in hadoop-tools/hadoop-gridmix.

Test results: https://builds.apache.org/job/PreCommit-MAPREDUCE-Build/5179//testReport/
Console output: https://builds.apache.org/job/PreCommit-MAPREDUCE-Build/5179//console

This message is automatically generated.

> TestHighRamJob fails due to the change in MAPREDUCE-5785
> --------------------------------------------------------
>
>                 Key: MAPREDUCE-6234
>                 URL: https://issues.apache.org/jira/browse/MAPREDUCE-6234
>             Project: Hadoop Map/Reduce
>          Issue Type: Bug
>          Components: contrib/gridmix, mrv2
>            Reporter: Masatake Iwasaki
>            Assignee: Masatake Iwasaki
>         Attachments: MAPREDUCE-6234.001.patch, MAPREDUCE-6234.002.patch, MAPREDUCE-6234.003.patch
>
>
> TestHighRamJob fails by this.
> {code}
> -------------------------------------------------------
>  T E S T S
> -------------------------------------------------------
> Running org.apache.hadoop.mapred.gridmix.TestHighRamJob
> Tests run: 1, Failures: 1, Errors: 0, Skipped: 0, Time elapsed: 1.162 sec <<< FAILURE! - in org.apache.hadoop.mapred.gridmix.TestHighRamJob
> testHighRamFeatureEmulation(org.apache.hadoop.mapred.gridmix.TestHighRamJob)  Time elapsed: 1.102 sec  <<< FAILURE!
> java.lang.AssertionError: expected:<1024> but was:<-1>
> 	at org.junit.Assert.fail(Assert.java:88)
> 	at org.junit.Assert.failNotEquals(Assert.java:743)
> 	at org.junit.Assert.assertEquals(Assert.java:118)
> 	at org.junit.Assert.assertEquals(Assert.java:555)
> 	at org.junit.Assert.assertEquals(Assert.java:542)
> 	at org.apache.hadoop.mapred.gridmix.TestHighRamJob.testHighRamConfig(TestHighRamJob.java:98)
> 	at org.apache.hadoop.mapred.gridmix.TestHighRamJob.testHighRamFeatureEmulation(TestHighRamJob.java:117)
> {code}



--
This message was sent by Atlassian JIRA
(v6.3.4#6332)