You are viewing a plain text version of this content. The canonical link for it is here.
Posted to builds@cassandra.apache.org by Apache Jenkins Server <je...@builds.apache.org> on 2026/04/21 08:10:44 UTC

Build complete: Cassandra-6.0 #5 [ABORTED] 53f188293dd672c846738594d9975f06ae63bfe0

-------------------------------------------------------------------------------
  Build Cassandra-6.0 #5 Aborted
  URL: https://ci-cassandra.apache.org/job/Cassandra-6.0/5/
  -------------------------------------------------------------------------------
  Changes:
  [Sam Tunnicliffe] Apply changes to gossip state for the local node synchronously, remote


  -------------------------------------------------------------------------------
  Failed Tests:
  717 tests failed.
FAILED:  dtest-large.consistency_test.TestAvailability.Tests / dtest-large jdk17 1/6 / test_network_topology_strategy
FAILED:  dtest-latest.disk_balance_test.TestDiskBalance.Tests / dtest-latest jdk11 49/64 / test_disk_balance_after_boundary_change_lcs
FAILED:  dtest-latest.disk_balance_test.TestDiskBalance.Tests / dtest-latest jdk11 49/64 / test_disk_balance_after_boundary_change_lcs
FAILED:  dtest-latest.disk_balance_test.TestDiskBalance.Tests / dtest-latest jdk17 48/64 / test_disk_balance_after_boundary_change_stcs
FAILED:  dtest-latest.disk_balance_test.TestDiskBalance.Tests / dtest-latest jdk17 48/64 / test_disk_balance_after_boundary_change_stcs
FAILED:  dtest-latest.materialized_views_test.TestMaterializedViews.Tests / dtest-latest jdk11 46/64 / test_drop_mv
FAILED:  dtest-latest.materialized_views_test.TestMaterializedViews.Tests / dtest-latest jdk17 48/64 / test_drop_table
FAILED:  dtest-latest.materialized_views_test.TestMaterializedViews.Tests / dtest-latest jdk21 36/64 / test_view_metadata_cleanup
FAILED:  dtest-latest.materialized_views_test.TestMaterializedViews.Tests / dtest-latest jdk17 36/64 / test_view_metadata_cleanup
FAILED:  dtest-latest.repair_tests.repair_test.TestRepair.Tests / dtest-latest jdk17 10/64 / test_dead_sync_initiator
FAILED:  dtest-novnode.cqlsh_tests.test_cqlsh_copy.TestCqlshCopy.Tests / dtest-novnode jdk11 55/64 / test_bulk_round_trip_with_single_core
FAILED:  dtest-novnode.materialized_views_test.TestMaterializedViews.Tests / dtest-novnode jdk21 5/64 / test_drop_with_stopped_build
FAILED:  dtest-novnode.topology_test.TestTopology.Tests / dtest-novnode jdk17 21/64 / test_movement
FAILED:  dtest-upgrade-large-novnode.upgrade_tests.upgrade_through_versions_test.TestUpgrade_current_6_0_x_To_indev_6_0_x.Tests / dtest-upgrade-large-novnode jdk11 8/40 / test_bootstrap_multidc
FAILED:  dtest-upgrade-large-novnode.upgrade_tests.upgrade_through_versions_test.TestUpgrade_current_6_0_x_To_indev_6_0_x.Tests / dtest-upgrade-large-novnode jdk11 9/40 / test_parallel_upgrade
FAILED:  dtest-upgrade-large-novnode.upgrade_tests.upgrade_through_versions_test.TestUpgrade_current_6_0_x_To_indev_6_0_x.Tests / dtest-upgrade-large-novnode jdk11 11/40 / test_parallel_upgrade_with_internode_ssl
FAILED:  dtest-upgrade-large-novnode.upgrade_tests.upgrade_through_versions_test.TestUpgrade_current_6_0_x_To_indev_6_0_x.Tests / dtest-upgrade-large-novnode jdk11 12/40 / test_rolling_upgrade_with_internode_ssl
FAILED:  dtest-upgrade-large-novnode.upgrade_tests.upgrade_through_versions_test.TestUpgrade_indev_6_0_x_To_indev_trunk.Tests / dtest-upgrade-large-novnode jdk11 31/40 / test_bootstrap
FAILED:  dtest-upgrade-large-novnode.upgrade_tests.upgrade_through_versions_test.TestUpgrade_indev_6_0_x_To_indev_trunk.Tests / dtest-upgrade-large-novnode jdk11 32/40 / test_bootstrap_multidc
FAILED:  dtest-upgrade-large-novnode.upgrade_tests.upgrade_through_versions_test.TestUpgrade_indev_6_0_x_To_indev_trunk.Tests / dtest-upgrade-large-novnode jdk11 33/40 / test_parallel_upgrade
FAILED:  dtest-upgrade-large-novnode.upgrade_tests.upgrade_through_versions_test.TestUpgrade_indev_6_0_x_To_indev_trunk.Tests / dtest-upgrade-large-novnode jdk11 35/40 / test_parallel_upgrade_with_internode_ssl
FAILED:  dtest-upgrade-large-novnode.upgrade_tests.upgrade_through_versions_test.TestUpgrade_indev_6_0_x_To_indev_trunk.Tests / dtest-upgrade-large-novnode jdk11 34/40 / test_rolling_upgrade
FAILED:  dtest-upgrade-large-novnode.upgrade_tests.upgrade_through_versions_test.TestUpgrade_indev_6_0_x_To_indev_trunk.Tests / dtest-upgrade-large-novnode jdk11 36/40 / test_rolling_upgrade_with_internode_ssl
FAILED:  dtest-upgrade-large.upgrade_tests.upgrade_through_versions_test.TestUpgrade_current_6_0_x_To_indev_6_0_x.Tests / dtest-upgrade-large jdk11 11/40 / test_parallel_upgrade_with_internode_ssl
FAILED:  dtest-upgrade-large.upgrade_tests.upgrade_through_versions_test.TestUpgrade_current_6_0_x_To_indev_6_0_x.Tests / dtest-upgrade-large jdk11 12/40 / test_rolling_upgrade_with_internode_ssl
FAILED:  dtest-upgrade-large.upgrade_tests.upgrade_through_versions_test.TestUpgrade_indev_6_0_x_To_indev_trunk.Tests / dtest-upgrade-large jdk11 31/40 / test_bootstrap
FAILED:  dtest-upgrade-large.upgrade_tests.upgrade_through_versions_test.TestUpgrade_indev_6_0_x_To_indev_trunk.Tests / dtest-upgrade-large jdk11 32/40 / test_bootstrap_multidc
FAILED:  dtest-upgrade-large.upgrade_tests.upgrade_through_versions_test.TestUpgrade_indev_6_0_x_To_indev_trunk.Tests / dtest-upgrade-large jdk11 33/40 / test_parallel_upgrade
FAILED:  dtest-upgrade-large.upgrade_tests.upgrade_through_versions_test.TestUpgrade_indev_6_0_x_To_indev_trunk.Tests / dtest-upgrade-large jdk11 35/40 / test_parallel_upgrade_with_internode_ssl
FAILED:  dtest-upgrade-large.upgrade_tests.upgrade_through_versions_test.TestUpgrade_indev_6_0_x_To_indev_trunk.Tests / dtest-upgrade-large jdk11 34/40 / test_rolling_upgrade
FAILED:  dtest-upgrade-large.upgrade_tests.upgrade_through_versions_test.TestUpgrade_indev_6_0_x_To_indev_trunk.Tests / dtest-upgrade-large jdk11 36/40 / test_rolling_upgrade_with_internode_ssl
FAILED:  dtest-upgrade-novnode.upgrade_tests.cql_tests.TestCQLNodes2RF1_Upgrade_current_5_0_x_To_indev_6_0_x.Tests / dtest-upgrade-novnode jdk11 149/160 / test_conditional_delete
FAILED:  dtest-upgrade-novnode.upgrade_tests.cql_tests.TestCQLNodes2RF1_Upgrade_current_5_0_x_To_indev_6_0_x.Tests / dtest-upgrade-novnode jdk11 137/160 / test_edge_2i_on_complex_pk
FAILED:  dtest-upgrade-novnode.upgrade_tests.cql_tests.TestCQLNodes2RF1_Upgrade_current_6_0_x_To_indev_6_0_x.Tests / dtest-upgrade-novnode jdk11 24/160 / test_SIM_assertion_error
FAILED:  dtest-upgrade-novnode.upgrade_tests.cql_tests.TestCQLNodes2RF1_Upgrade_current_6_0_x_To_indev_6_0_x.Tests / dtest-upgrade-novnode jdk11 25/160 / test_blobAs_functions
FAILED:  dtest-upgrade-novnode.upgrade_tests.cql_tests.TestCQLNodes2RF1_Upgrade_current_6_0_x_To_indev_6_0_x.Tests / dtest-upgrade-novnode jdk11 16/160 / test_cas_and_list_index
FAILED:  dtest-upgrade-novnode.upgrade_tests.cql_tests.TestCQLNodes2RF1_Upgrade_current_6_0_x_To_indev_6_0_x.Tests / dtest-upgrade-novnode jdk11 22/160 / test_clustering_order_in
FAILED:  dtest-upgrade-novnode.upgrade_tests.cql_tests.TestCQLNodes2RF1_Upgrade_current_6_0_x_To_indev_6_0_x.Tests / dtest-upgrade-novnode jdk11 60/160 / test_counters
FAILED:  dtest-upgrade-novnode.upgrade_tests.cql_tests.TestCQLNodes2RF1_Upgrade_current_6_0_x_To_indev_6_0_x.Tests / dtest-upgrade-novnode jdk11 54/160 / test_dense_cf
FAILED:  dtest-upgrade-novnode.upgrade_tests.cql_tests.TestCQLNodes2RF1_Upgrade_current_6_0_x_To_indev_6_0_x.Tests / dtest-upgrade-novnode jdk11 53/160 / test_dynamic_cf
FAILED:  dtest-upgrade-novnode.upgrade_tests.cql_tests.TestCQLNodes2RF1_Upgrade_current_6_0_x_To_indev_6_0_x.Tests / dtest-upgrade-novnode jdk11 23/160 / test_end_of_component_uses_oecBound
FAILED:  dtest-upgrade-novnode.upgrade_tests.cql_tests.TestCQLNodes2RF1_Upgrade_current_6_0_x_To_indev_6_0_x.Tests / dtest-upgrade-novnode jdk11 63/160 / test_exclusive_slice
FAILED:  dtest-upgrade-novnode.upgrade_tests.cql_tests.TestCQLNodes2RF1_Upgrade_current_6_0_x_To_indev_6_0_x.Tests / dtest-upgrade-novnode jdk11 11/160 / test_expanded_list_item_conditional
FAILED:  dtest-upgrade-novnode.upgrade_tests.cql_tests.TestCQLNodes2RF1_Upgrade_current_6_0_x_To_indev_6_0_x.Tests / dtest-upgrade-novnode jdk11 15/160 / test_expanded_map_item_conditional
FAILED:  dtest-upgrade-novnode.upgrade_tests.cql_tests.TestCQLNodes2RF1_Upgrade_current_6_0_x_To_indev_6_0_x.Tests / dtest-upgrade-novnode jdk11 145/160 / test_function_with_null
FAILED:  dtest-upgrade-novnode.upgrade_tests.cql_tests.TestCQLNodes2RF1_Upgrade_current_6_0_x_To_indev_6_0_x.Tests / dtest-upgrade-novnode jdk11 64/160 / test_in_clause_wide_rows
FAILED:  dtest-upgrade-novnode.upgrade_tests.cql_tests.TestCQLNodes2RF1_Upgrade_current_6_0_x_To_indev_6_0_x.Tests / dtest-upgrade-novnode jdk11 61/160 / test_indexed_with_eq
FAILED:  dtest-upgrade-novnode.upgrade_tests.cql_tests.TestCQLNodes2RF1_Upgrade_current_6_0_x_To_indev_6_0_x.Tests / dtest-upgrade-novnode jdk11 21/160 / test_invalid_custom_timestamp
FAILED:  dtest-upgrade-novnode.upgrade_tests.cql_tests.TestCQLNodes2RF1_Upgrade_current_6_0_x_To_indev_6_0_x.Tests / dtest-upgrade-novnode jdk11 20/160 / test_key_index_with_reverse_clustering
FAILED:  dtest-upgrade-novnode.upgrade_tests.cql_tests.TestCQLNodes2RF1_Upgrade_current_6_0_x_To_indev_6_0_x.Tests / dtest-upgrade-novnode jdk11 19/160 / test_limit_compact_table
FAILED:  dtest-upgrade-novnode.upgrade_tests.cql_tests.TestCQLNodes2RF1_Upgrade_current_6_0_x_To_indev_6_0_x.Tests / dtest-upgrade-novnode jdk11 57/160 / test_limit_multiget
FAILED:  dtest-upgrade-novnode.upgrade_tests.cql_tests.TestCQLNodes2RF1_Upgrade_current_6_0_x_To_indev_6_0_x.Tests / dtest-upgrade-novnode jdk11 56/160 / test_limit_ranges
FAILED:  dtest-upgrade-novnode.upgrade_tests.cql_tests.TestCQLNodes2RF1_Upgrade_current_6_0_x_To_indev_6_0_x.Tests / dtest-upgrade-novnode jdk11 59/160 / test_limit_sparse
FAILED:  dtest-upgrade-novnode.upgrade_tests.cql_tests.TestCQLNodes2RF1_Upgrade_current_6_0_x_To_indev_6_0_x.Tests / dtest-upgrade-novnode jdk11 14/160 / test_map_item_conditional
FAILED:  dtest-upgrade-novnode.upgrade_tests.cql_tests.TestCQLNodes2RF1_Upgrade_current_6_0_x_To_indev_6_0_x.Tests / dtest-upgrade-novnode jdk11 66/160 / test_more_order_by
FAILED:  dtest-upgrade-novnode.upgrade_tests.cql_tests.TestCQLNodes2RF1_Upgrade_current_6_0_x_To_indev_6_0_x.Tests / dtest-upgrade-novnode jdk11 118/160 / test_multi_in_compact_non_composite
FAILED:  dtest-upgrade-novnode.upgrade_tests.cql_tests.TestCQLNodes2RF1_Upgrade_current_6_0_x_To_indev_6_0_x.Tests / dtest-upgrade-novnode jdk11 27/160 / test_negative_timestamp
FAILED:  dtest-upgrade-novnode.upgrade_tests.cql_tests.TestCQLNodes2RF1_Upgrade_current_6_0_x_To_indev_6_0_x.Tests / dtest-upgrade-novnode jdk11 52/160 / test_noncomposite_static_cf
FAILED:  dtest-upgrade-novnode.upgrade_tests.cql_tests.TestCQLNodes2RF1_Upgrade_current_6_0_x_To_indev_6_0_x.Tests / dtest-upgrade-novnode jdk11 65/160 / test_order_by
FAILED:  dtest-upgrade-novnode.upgrade_tests.cql_tests.TestCQLNodes2RF1_Upgrade_current_6_0_x_To_indev_6_0_x.Tests / dtest-upgrade-novnode jdk11 102/160 / test_refuse_in_with_indexes
FAILED:  dtest-upgrade-novnode.upgrade_tests.cql_tests.TestCQLNodes2RF1_Upgrade_current_6_0_x_To_indev_6_0_x.Tests / dtest-upgrade-novnode jdk11 104/160 / test_reversed_compact_multikey
FAILED:  dtest-upgrade-novnode.upgrade_tests.cql_tests.TestCQLNodes2RF1_Upgrade_current_6_0_x_To_indev_6_0_x.Tests / dtest-upgrade-novnode jdk11 62/160 / test_select_key_in
FAILED:  dtest-upgrade-novnode.upgrade_tests.cql_tests.TestCQLNodes2RF1_Upgrade_current_6_0_x_To_indev_6_0_x.Tests / dtest-upgrade-novnode jdk11 58/160 / test_simple_tuple_query
FAILED:  dtest-upgrade-novnode.upgrade_tests.cql_tests.TestCQLNodes2RF1_Upgrade_current_6_0_x_To_indev_6_0_x.Tests / dtest-upgrade-novnode jdk11 55/160 / test_sparse_cf
FAILED:  dtest-upgrade-novnode.upgrade_tests.cql_tests.TestCQLNodes2RF1_Upgrade_current_6_0_x_To_indev_6_0_x.Tests / dtest-upgrade-novnode jdk11 158/160 / test_static_columns
FAILED:  dtest-upgrade-novnode.upgrade_tests.cql_tests.TestCQLNodes2RF1_Upgrade_current_6_0_x_To_indev_6_0_x.Tests / dtest-upgrade-novnode jdk11 18/160 / test_static_with_empty_clustering
FAILED:  dtest-upgrade-novnode.upgrade_tests.cql_tests.TestCQLNodes2RF1_Upgrade_current_6_0_x_To_indev_6_0_x.Tests / dtest-upgrade-novnode jdk11 17/160 / test_static_with_limit
FAILED:  dtest-upgrade-novnode.upgrade_tests.cql_tests.TestCQLNodes2RF1_Upgrade_current_6_0_x_To_indev_6_0_x.Tests / dtest-upgrade-novnode jdk11 36/160 / test_tracing_prevents_startup_after_upgrading
FAILED:  dtest-upgrade-novnode.upgrade_tests.cql_tests.TestCQLNodes2RF1_Upgrade_current_6_0_x_To_indev_6_0_x.Tests / dtest-upgrade-novnode jdk11 9/160 / test_whole_list_conditional
FAILED:  dtest-upgrade-novnode.upgrade_tests.cql_tests.TestCQLNodes2RF1_Upgrade_current_6_0_x_To_indev_6_0_x.Tests / dtest-upgrade-novnode jdk11 13/160 / test_whole_map_conditional
FAILED:  dtest-upgrade-novnode.upgrade_tests.cql_tests.TestCQLNodes2RF1_Upgrade_current_6_0_x_To_indev_6_0_x.Tests / dtest-upgrade-novnode jdk11 12/160 / test_whole_set_conditional
FAILED:  dtest-upgrade-novnode.upgrade_tests.cql_tests.TestCQLNodes3RF3_Upgrade_current_5_0_x_To_indev_6_0_x.Tests / dtest-upgrade-novnode jdk11 142/160 / test_deleted_row_select
FAILED:  dtest-upgrade-novnode.upgrade_tests.cql_tests.TestCQLNodes3RF3_Upgrade_current_6_0_x_To_indev_6_0_x.Tests / dtest-upgrade-novnode jdk11 104/160 / test_cas_and_compact
FAILED:  dtest-upgrade-novnode.upgrade_tests.cql_tests.TestCQLNodes3RF3_Upgrade_current_6_0_x_To_indev_6_0_x.Tests / dtest-upgrade-novnode jdk11 60/160 / test_clustering_indexing
FAILED:  dtest-upgrade-novnode.upgrade_tests.cql_tests.TestCQLNodes3RF3_Upgrade_current_6_0_x_To_indev_6_0_x.Tests / dtest-upgrade-novnode jdk11 118/160 / test_clustering_order_in
FAILED:  dtest-upgrade-novnode.upgrade_tests.cql_tests.TestCQLNodes3RF3_Upgrade_current_6_0_x_To_indev_6_0_x.Tests / dtest-upgrade-novnode jdk11 58/160 / test_compact_metadata
FAILED:  dtest-upgrade-novnode.upgrade_tests.cql_tests.TestCQLNodes3RF3_Upgrade_current_6_0_x_To_indev_6_0_x.Tests / dtest-upgrade-novnode jdk11 47/160 / test_composite_index_collections
FAILED:  dtest-upgrade-novnode.upgrade_tests.cql_tests.TestCQLNodes3RF3_Upgrade_current_6_0_x_To_indev_6_0_x.Tests / dtest-upgrade-novnode jdk11 32/160 / test_composite_index_with_pk
FAILED:  dtest-upgrade-novnode.upgrade_tests.cql_tests.TestCQLNodes3RF3_Upgrade_current_6_0_x_To_indev_6_0_x.Tests / dtest-upgrade-novnode jdk11 51/160 / test_composite_partition_key_validation
FAILED:  dtest-upgrade-novnode.upgrade_tests.cql_tests.TestCQLNodes3RF3_Upgrade_current_6_0_x_To_indev_6_0_x.Tests / dtest-upgrade-novnode jdk11 24/160 / test_composite_row_key
FAILED:  dtest-upgrade-novnode.upgrade_tests.cql_tests.TestCQLNodes3RF3_Upgrade_current_6_0_x_To_indev_6_0_x.Tests / dtest-upgrade-novnode jdk11 64/160 / test_conversion_functions
FAILED:  dtest-upgrade-novnode.upgrade_tests.cql_tests.TestCQLNodes3RF3_Upgrade_current_6_0_x_To_indev_6_0_x.Tests / dtest-upgrade-novnode jdk11 9/160 / test_count
FAILED:  dtest-upgrade-novnode.upgrade_tests.cql_tests.TestCQLNodes3RF3_Upgrade_current_6_0_x_To_indev_6_0_x.Tests / dtest-upgrade-novnode jdk11 30/160 / test_date
FAILED:  dtest-upgrade-novnode.upgrade_tests.cql_tests.TestCQLNodes3RF3_Upgrade_current_6_0_x_To_indev_6_0_x.Tests / dtest-upgrade-novnode jdk11 17/160 / test_delete_row
FAILED:  dtest-upgrade-novnode.upgrade_tests.cql_tests.TestCQLNodes3RF3_Upgrade_current_6_0_x_To_indev_6_0_x.Tests / dtest-upgrade-novnode jdk11 61/160 / test_edge_2i_on_complex_pk
FAILED:  dtest-upgrade-novnode.upgrade_tests.cql_tests.TestCQLNodes3RF3_Upgrade_current_6_0_x_To_indev_6_0_x.Tests / dtest-upgrade-novnode jdk11 62/160 / test_end_of_component_as_end_key
FAILED:  dtest-upgrade-novnode.upgrade_tests.cql_tests.TestCQLNodes3RF3_Upgrade_current_6_0_x_To_indev_6_0_x.Tests / dtest-upgrade-novnode jdk11 57/160 / test_float_with_exponent
FAILED:  dtest-upgrade-novnode.upgrade_tests.cql_tests.TestCQLNodes3RF3_Upgrade_current_6_0_x_To_indev_6_0_x.Tests / dtest-upgrade-novnode jdk11 66/160 / test_function_and_reverse_type
FAILED:  dtest-upgrade-novnode.upgrade_tests.cql_tests.TestCQLNodes3RF3_Upgrade_current_6_0_x_To_indev_6_0_x.Tests / dtest-upgrade-novnode jdk11 102/160 / test_in_with_desc_order
FAILED:  dtest-upgrade-novnode.upgrade_tests.cql_tests.TestCQLNodes3RF3_Upgrade_current_6_0_x_To_indev_6_0_x.Tests / dtest-upgrade-novnode jdk11 55/160 / test_large_clustering_in
FAILED:  dtest-upgrade-novnode.upgrade_tests.cql_tests.TestCQLNodes3RF3_Upgrade_current_6_0_x_To_indev_6_0_x.Tests / dtest-upgrade-novnode jdk11 33/160 / test_limit_bugs
FAILED:  dtest-upgrade-novnode.upgrade_tests.cql_tests.TestCQLNodes3RF3_Upgrade_current_6_0_x_To_indev_6_0_x.Tests / dtest-upgrade-novnode jdk11 21/160 / test_list
FAILED:  dtest-upgrade-novnode.upgrade_tests.cql_tests.TestCQLNodes3RF3_Upgrade_current_6_0_x_To_indev_6_0_x.Tests / dtest-upgrade-novnode jdk11 20/160 / test_map
FAILED:  dtest-upgrade-novnode.upgrade_tests.cql_tests.TestCQLNodes3RF3_Upgrade_current_6_0_x_To_indev_6_0_x.Tests / dtest-upgrade-novnode jdk11 22/160 / test_multi_collection
FAILED:  dtest-upgrade-novnode.upgrade_tests.cql_tests.TestCQLNodes3RF3_Upgrade_current_6_0_x_To_indev_6_0_x.Tests / dtest-upgrade-novnode jdk11 52/160 / test_multi_in
FAILED:  dtest-upgrade-novnode.upgrade_tests.cql_tests.TestCQLNodes3RF3_Upgrade_current_6_0_x_To_indev_6_0_x.Tests / dtest-upgrade-novnode jdk11 53/160 / test_multi_in_compact
FAILED:  dtest-upgrade-novnode.upgrade_tests.cql_tests.TestCQLNodes3RF3_Upgrade_current_6_0_x_To_indev_6_0_x.Tests / dtest-upgrade-novnode jdk11 54/160 / test_multi_in_compact_non_composite
FAILED:  dtest-upgrade-novnode.upgrade_tests.cql_tests.TestCQLNodes3RF3_Upgrade_current_6_0_x_To_indev_6_0_x.Tests / dtest-upgrade-novnode jdk11 29/160 / test_no_clustering
FAILED:  dtest-upgrade-novnode.upgrade_tests.cql_tests.TestCQLNodes3RF3_Upgrade_current_6_0_x_To_indev_6_0_x.Tests / dtest-upgrade-novnode jdk11 13/160 / test_no_range_ghost
FAILED:  dtest-upgrade-novnode.upgrade_tests.cql_tests.TestCQLNodes3RF3_Upgrade_current_6_0_x_To_indev_6_0_x.Tests / dtest-upgrade-novnode jdk11 28/160 / test_only_pk
FAILED:  dtest-upgrade-novnode.upgrade_tests.cql_tests.TestCQLNodes3RF3_Upgrade_current_6_0_x_To_indev_6_0_x.Tests / dtest-upgrade-novnode jdk11 35/160 / test_order_by_multikey
FAILED:  dtest-upgrade-novnode.upgrade_tests.cql_tests.TestCQLNodes3RF3_Upgrade_current_6_0_x_To_indev_6_0_x.Tests / dtest-upgrade-novnode jdk11 59/160 / test_query_compact_tables_during_upgrade
FAILED:  dtest-upgrade-novnode.upgrade_tests.cql_tests.TestCQLNodes3RF3_Upgrade_current_6_0_x_To_indev_6_0_x.Tests / dtest-upgrade-novnode jdk11 23/160 / test_range_query
FAILED:  dtest-upgrade-novnode.upgrade_tests.cql_tests.TestCQLNodes3RF3_Upgrade_current_6_0_x_To_indev_6_0_x.Tests / dtest-upgrade-novnode jdk11 18/160 / test_range_query_2ndary
FAILED:  dtest-upgrade-novnode.upgrade_tests.cql_tests.TestCQLNodes3RF3_Upgrade_current_6_0_x_To_indev_6_0_x.Tests / dtest-upgrade-novnode jdk11 31/160 / test_range_slice
FAILED:  dtest-upgrade-novnode.upgrade_tests.cql_tests.TestCQLNodes3RF3_Upgrade_current_6_0_x_To_indev_6_0_x.Tests / dtest-upgrade-novnode jdk11 15/160 / test_range_tombstones
FAILED:  dtest-upgrade-novnode.upgrade_tests.cql_tests.TestCQLNodes3RF3_Upgrade_current_6_0_x_To_indev_6_0_x.Tests / dtest-upgrade-novnode jdk11 16/160 / test_range_tombstones_compaction
FAILED:  dtest-upgrade-novnode.upgrade_tests.cql_tests.TestCQLNodes3RF3_Upgrade_current_6_0_x_To_indev_6_0_x.Tests / dtest-upgrade-novnode jdk11 36/160 / test_remove_range_slice
FAILED:  dtest-upgrade-novnode.upgrade_tests.cql_tests.TestCQLNodes3RF3_Upgrade_current_6_0_x_To_indev_6_0_x.Tests / dtest-upgrade-novnode jdk11 45/160 / test_returned_null
FAILED:  dtest-upgrade-novnode.upgrade_tests.cql_tests.TestCQLNodes3RF3_Upgrade_current_6_0_x_To_indev_6_0_x.Tests / dtest-upgrade-novnode jdk11 39/160 / test_reversed_compact
FAILED:  dtest-upgrade-novnode.upgrade_tests.cql_tests.TestCQLNodes3RF3_Upgrade_current_6_0_x_To_indev_6_0_x.Tests / dtest-upgrade-novnode jdk11 40/160 / test_reversed_compact_multikey
FAILED:  dtest-upgrade-novnode.upgrade_tests.cql_tests.TestCQLNodes3RF3_Upgrade_current_6_0_x_To_indev_6_0_x.Tests / dtest-upgrade-novnode jdk11 27/160 / test_row_existence
FAILED:  dtest-upgrade-novnode.upgrade_tests.cql_tests.TestCQLNodes3RF3_Upgrade_current_6_0_x_To_indev_6_0_x.Tests / dtest-upgrade-novnode jdk11 158/160 / test_select_key_in
FAILED:  dtest-upgrade-novnode.upgrade_tests.cql_tests.TestCQLNodes3RF3_Upgrade_current_6_0_x_To_indev_6_0_x.Tests / dtest-upgrade-novnode jdk11 19/160 / test_set
FAILED:  dtest-upgrade-novnode.upgrade_tests.cql_tests.TestCQLNodes3RF3_Upgrade_current_6_0_x_To_indev_6_0_x.Tests / dtest-upgrade-novnode jdk11 114/160 / test_static_with_empty_clustering
FAILED:  dtest-upgrade-novnode.upgrade_tests.cql_tests.TestCQLNodes3RF3_Upgrade_current_6_0_x_To_indev_6_0_x.Tests / dtest-upgrade-novnode jdk11 63/160 / test_ticket_5230
FAILED:  dtest-upgrade-novnode.upgrade_tests.cql_tests.TestCQLNodes3RF3_Upgrade_current_6_0_x_To_indev_6_0_x.Tests / dtest-upgrade-novnode jdk11 12/160 / test_timestamp_and_ttl
FAILED:  dtest-upgrade-novnode.upgrade_tests.cql_tests.TestCQLNodes3RF3_Upgrade_current_6_0_x_To_indev_6_0_x.Tests / dtest-upgrade-novnode jdk11 56/160 / test_timeuuid
FAILED:  dtest-upgrade-novnode.upgrade_tests.cql_tests.TestCQLNodes3RF3_Upgrade_current_6_0_x_To_indev_6_0_x.Tests / dtest-upgrade-novnode jdk11 11/160 / test_token_range
FAILED:  dtest-upgrade-novnode.upgrade_tests.cql_tests.TestCQLNodes3RF3_Upgrade_current_6_0_x_To_indev_6_0_x.Tests / dtest-upgrade-novnode jdk11 14/160 / test_undefined_column_handling
FAILED:  dtest-upgrade-novnode.upgrade_tests.cql_tests.TestCQLNodes3RF3_Upgrade_indev_4_0_x_To_indev_6_0_x.Tests / dtest-upgrade-novnode jdk11 65/160 / test_empty_in
FAILED:  dtest-upgrade-novnode.upgrade_tests.paging_test.TestPagingDataNodes2RF1_Upgrade_current_6_0_x_To_indev_6_0_x.Tests / dtest-upgrade-novnode jdk11 61/160 / test_basic_compound_paging
FAILED:  dtest-upgrade-novnode.upgrade_tests.paging_test.TestPagingDataNodes2RF1_Upgrade_current_6_0_x_To_indev_6_0_x.Tests / dtest-upgrade-novnode jdk11 60/160 / test_basic_paging
FAILED:  dtest-upgrade-novnode.upgrade_tests.paging_test.TestPagingDataNodes2RF1_Upgrade_current_6_0_x_To_indev_6_0_x.Tests / dtest-upgrade-novnode jdk11 62/160 / test_paging_a_single_wide_row
FAILED:  dtest-upgrade-novnode.upgrade_tests.paging_test.TestPagingDataNodes2RF1_Upgrade_current_6_0_x_To_indev_6_0_x.Tests / dtest-upgrade-novnode jdk11 63/160 / test_paging_across_multi_wide_rows
FAILED:  dtest-upgrade-novnode.upgrade_tests.paging_test.TestPagingDataNodes2RF1_Upgrade_current_6_0_x_To_indev_6_0_x.Tests / dtest-upgrade-novnode jdk11 64/160 / test_paging_using_secondary_indexes
FAILED:  dtest-upgrade-novnode.upgrade_tests.paging_test.TestPagingDataNodes2RF1_Upgrade_current_6_0_x_To_indev_6_0_x.Tests / dtest-upgrade-novnode jdk11 66/160 / test_paging_using_secondary_indexes_with_static_cols
FAILED:  dtest-upgrade-novnode.upgrade_tests.paging_test.TestPagingDataNodes2RF1_Upgrade_current_6_0_x_To_indev_6_0_x.Tests / dtest-upgrade-novnode jdk11 65/160 / test_static_columns_paging
FAILED:  dtest-upgrade-novnode.upgrade_tests.paging_test.TestPagingDataNodes3RF3_Upgrade_current_6_0_x_To_indev_6_0_x.Tests / dtest-upgrade-novnode jdk11 9/160 / test_static_columns_paging
FAILED:  dtest-upgrade-novnode.upgrade_tests.paging_test.TestPagingSizeNodes2RF1_Upgrade_current_6_0_x_To_indev_6_0_x.Tests / dtest-upgrade-novnode jdk11 58/160 / test_undefined_page_size_default
FAILED:  dtest-upgrade-novnode.upgrade_tests.paging_test.TestPagingSizeNodes2RF1_Upgrade_current_6_0_x_To_indev_6_0_x.Tests / dtest-upgrade-novnode jdk11 57/160 / test_with_equal_results_to_page_size
FAILED:  dtest-upgrade-novnode.upgrade_tests.paging_test.TestPagingSizeNodes2RF1_Upgrade_current_6_0_x_To_indev_6_0_x.Tests / dtest-upgrade-novnode jdk11 55/160 / test_with_less_results_than_page_size
FAILED:  dtest-upgrade-novnode.upgrade_tests.paging_test.TestPagingSizeNodes2RF1_Upgrade_current_6_0_x_To_indev_6_0_x.Tests / dtest-upgrade-novnode jdk11 56/160 / test_with_more_results_than_page_size
FAILED:  dtest-upgrade-novnode.upgrade_tests.paging_test.TestPagingSizeNodes2RF1_Upgrade_current_6_0_x_To_indev_6_0_x.Tests / dtest-upgrade-novnode jdk11 54/160 / test_with_no_results
FAILED:  dtest-upgrade-novnode.upgrade_tests.paging_test.TestPagingSizeNodes3RF3_Upgrade_current_6_0_x_To_indev_6_0_x.Tests / dtest-upgrade-novnode jdk11 18/160 / test_undefined_page_size_default
FAILED:  dtest-upgrade-novnode.upgrade_tests.paging_test.TestPagingSizeNodes3RF3_Upgrade_current_6_0_x_To_indev_6_0_x.Tests / dtest-upgrade-novnode jdk11 17/160 / test_with_equal_results_to_page_size
FAILED:  dtest-upgrade-novnode.upgrade_tests.paging_test.TestPagingSizeNodes3RF3_Upgrade_current_6_0_x_To_indev_6_0_x.Tests / dtest-upgrade-novnode jdk11 15/160 / test_with_less_results_than_page_size
FAILED:  dtest-upgrade-novnode.upgrade_tests.paging_test.TestPagingSizeNodes3RF3_Upgrade_current_6_0_x_To_indev_6_0_x.Tests / dtest-upgrade-novnode jdk11 16/160 / test_with_more_results_than_page_size
FAILED:  dtest-upgrade-novnode.upgrade_tests.paging_test.TestPagingSizeNodes3RF3_Upgrade_current_6_0_x_To_indev_6_0_x.Tests / dtest-upgrade-novnode jdk11 14/160 / test_with_no_results
FAILED:  dtest-upgrade-novnode.upgrade_tests.paging_test.TestPagingWithDeletionsNodes3RF3_Upgrade_current_6_0_x_To_indev_6_0_x.Tests / dtest-upgrade-novnode jdk11 40/160 / test_multiple_cell_deletions
FAILED:  dtest-upgrade-novnode.upgrade_tests.paging_test.TestPagingWithDeletionsNodes3RF3_Upgrade_current_6_0_x_To_indev_6_0_x.Tests / dtest-upgrade-novnode jdk11 39/160 / test_single_cell_deletions
FAILED:  dtest-upgrade-novnode.upgrade_tests.paging_test.TestPagingWithDeletionsNodes3RF3_Upgrade_current_6_0_x_To_indev_6_0_x.Tests / dtest-upgrade-novnode jdk11 36/160 / test_single_partition_deletions
FAILED:  dtest-upgrade.upgrade_tests.cql_tests.TestCQLNodes2RF1_Upgrade_current_6_0_x_To_indev_6_0_x.Tests / dtest-upgrade jdk11 49/160 / test_SIM_assertion_error
FAILED:  dtest-upgrade.upgrade_tests.cql_tests.TestCQLNodes2RF1_Upgrade_current_6_0_x_To_indev_6_0_x.Tests / dtest-upgrade jdk11 14/160 / test_add_deletion_info_in_unsorted_column
FAILED:  dtest-upgrade.upgrade_tests.cql_tests.TestCQLNodes2RF1_Upgrade_current_6_0_x_To_indev_6_0_x.Tests / dtest-upgrade jdk11 50/160 / test_blobAs_functions
FAILED:  dtest-upgrade.upgrade_tests.cql_tests.TestCQLNodes2RF1_Upgrade_current_6_0_x_To_indev_6_0_x.Tests / dtest-upgrade jdk11 28/160 / test_cas_and_ttl
FAILED:  dtest-upgrade.upgrade_tests.cql_tests.TestCQLNodes2RF1_Upgrade_current_6_0_x_To_indev_6_0_x.Tests / dtest-upgrade jdk11 11/160 / test_cas_simple
FAILED:  dtest-upgrade.upgrade_tests.cql_tests.TestCQLNodes2RF1_Upgrade_current_6_0_x_To_indev_6_0_x.Tests / dtest-upgrade jdk11 47/160 / test_clustering_order_in
FAILED:  dtest-upgrade.upgrade_tests.cql_tests.TestCQLNodes2RF1_Upgrade_current_6_0_x_To_indev_6_0_x.Tests / dtest-upgrade jdk11 20/160 / test_collection_indexing
FAILED:  dtest-upgrade.upgrade_tests.cql_tests.TestCQLNodes2RF1_Upgrade_current_6_0_x_To_indev_6_0_x.Tests / dtest-upgrade jdk11 15/160 / test_column_name_validation
FAILED:  dtest-upgrade.upgrade_tests.cql_tests.TestCQLNodes2RF1_Upgrade_current_6_0_x_To_indev_6_0_x.Tests / dtest-upgrade jdk11 59/160 / test_deleted_row_select
FAILED:  dtest-upgrade.upgrade_tests.cql_tests.TestCQLNodes2RF1_Upgrade_current_6_0_x_To_indev_6_0_x.Tests / dtest-upgrade jdk11 7/160 / test_empty_in
FAILED:  dtest-upgrade.upgrade_tests.cql_tests.TestCQLNodes2RF1_Upgrade_current_6_0_x_To_indev_6_0_x.Tests / dtest-upgrade jdk11 48/160 / test_end_of_component_uses_oecBound
FAILED:  dtest-upgrade.upgrade_tests.cql_tests.TestCQLNodes2RF1_Upgrade_current_6_0_x_To_indev_6_0_x.Tests / dtest-upgrade jdk11 36/160 / test_expanded_list_item_conditional
FAILED:  dtest-upgrade.upgrade_tests.cql_tests.TestCQLNodes2RF1_Upgrade_current_6_0_x_To_indev_6_0_x.Tests / dtest-upgrade jdk11 40/160 / test_expanded_map_item_conditional
FAILED:  dtest-upgrade.upgrade_tests.cql_tests.TestCQLNodes2RF1_Upgrade_current_6_0_x_To_indev_6_0_x.Tests / dtest-upgrade jdk11 157/160 / test_function_and_reverse_type
FAILED:  dtest-upgrade.upgrade_tests.cql_tests.TestCQLNodes2RF1_Upgrade_current_6_0_x_To_indev_6_0_x.Tests / dtest-upgrade jdk11 32/160 / test_in_order_by_without_selecting
FAILED:  dtest-upgrade.upgrade_tests.cql_tests.TestCQLNodes2RF1_Upgrade_current_6_0_x_To_indev_6_0_x.Tests / dtest-upgrade jdk11 31/160 / test_in_with_desc_order
FAILED:  dtest-upgrade.upgrade_tests.cql_tests.TestCQLNodes2RF1_Upgrade_current_6_0_x_To_indev_6_0_x.Tests / dtest-upgrade jdk11 12/160 / test_internal_application_error_on_select
FAILED:  dtest-upgrade.upgrade_tests.cql_tests.TestCQLNodes2RF1_Upgrade_current_6_0_x_To_indev_6_0_x.Tests / dtest-upgrade jdk11 18/160 / test_intersection_logic_returns_empty_result
FAILED:  dtest-upgrade.upgrade_tests.cql_tests.TestCQLNodes2RF1_Upgrade_current_6_0_x_To_indev_6_0_x.Tests / dtest-upgrade jdk11 46/160 / test_invalid_custom_timestamp
FAILED:  dtest-upgrade.upgrade_tests.cql_tests.TestCQLNodes2RF1_Upgrade_current_6_0_x_To_indev_6_0_x.Tests / dtest-upgrade jdk11 19/160 / test_large_count
FAILED:  dtest-upgrade.upgrade_tests.cql_tests.TestCQLNodes2RF1_Upgrade_current_6_0_x_To_indev_6_0_x.Tests / dtest-upgrade jdk11 44/160 / test_limit_compact_table
FAILED:  dtest-upgrade.upgrade_tests.cql_tests.TestCQLNodes2RF1_Upgrade_current_6_0_x_To_indev_6_0_x.Tests / dtest-upgrade jdk11 35/160 / test_list_item_conditional
FAILED:  dtest-upgrade.upgrade_tests.cql_tests.TestCQLNodes2RF1_Upgrade_current_6_0_x_To_indev_6_0_x.Tests / dtest-upgrade jdk11 39/160 / test_map_item_conditional
FAILED:  dtest-upgrade.upgrade_tests.cql_tests.TestCQLNodes2RF1_Upgrade_current_6_0_x_To_indev_6_0_x.Tests / dtest-upgrade jdk11 21/160 / test_map_keys_indexing
FAILED:  dtest-upgrade.upgrade_tests.cql_tests.TestCQLNodes2RF1_Upgrade_current_6_0_x_To_indev_6_0_x.Tests / dtest-upgrade jdk11 62/160 / test_materialized_view_simple
FAILED:  dtest-upgrade.upgrade_tests.cql_tests.TestCQLNodes2RF1_Upgrade_current_6_0_x_To_indev_6_0_x.Tests / dtest-upgrade jdk11 17/160 / test_more_user_types
FAILED:  dtest-upgrade.upgrade_tests.cql_tests.TestCQLNodes2RF1_Upgrade_current_6_0_x_To_indev_6_0_x.Tests / dtest-upgrade jdk11 22/160 / test_nan_infinity
FAILED:  dtest-upgrade.upgrade_tests.cql_tests.TestCQLNodes2RF1_Upgrade_current_6_0_x_To_indev_6_0_x.Tests / dtest-upgrade jdk11 52/160 / test_negative_timestamp
FAILED:  dtest-upgrade.upgrade_tests.cql_tests.TestCQLNodes2RF1_Upgrade_current_6_0_x_To_indev_6_0_x.Tests / dtest-upgrade jdk11 99/160 / test_order_by
FAILED:  dtest-upgrade.upgrade_tests.cql_tests.TestCQLNodes2RF1_Upgrade_current_6_0_x_To_indev_6_0_x.Tests / dtest-upgrade jdk11 27/160 / test_select_count_paging
FAILED:  dtest-upgrade.upgrade_tests.cql_tests.TestCQLNodes2RF1_Upgrade_current_6_0_x_To_indev_6_0_x.Tests / dtest-upgrade jdk11 9/160 / test_select_distinct_with_deletions
FAILED:  dtest-upgrade.upgrade_tests.cql_tests.TestCQLNodes2RF1_Upgrade_current_6_0_x_To_indev_6_0_x.Tests / dtest-upgrade jdk11 90/160 / test_sparse_cf
FAILED:  dtest-upgrade.upgrade_tests.cql_tests.TestCQLNodes2RF1_Upgrade_current_6_0_x_To_indev_6_0_x.Tests / dtest-upgrade jdk11 23/160 / test_static_columns
FAILED:  dtest-upgrade.upgrade_tests.cql_tests.TestCQLNodes2RF1_Upgrade_current_6_0_x_To_indev_6_0_x.Tests / dtest-upgrade jdk11 24/160 / test_static_columns_cas
FAILED:  dtest-upgrade.upgrade_tests.cql_tests.TestCQLNodes2RF1_Upgrade_current_6_0_x_To_indev_6_0_x.Tests / dtest-upgrade jdk11 25/160 / test_static_columns_with_2i
FAILED:  dtest-upgrade.upgrade_tests.cql_tests.TestCQLNodes2RF1_Upgrade_current_6_0_x_To_indev_6_0_x.Tests / dtest-upgrade jdk11 26/160 / test_static_columns_with_distinct
FAILED:  dtest-upgrade.upgrade_tests.cql_tests.TestCQLNodes2RF1_Upgrade_current_6_0_x_To_indev_6_0_x.Tests / dtest-upgrade jdk11 43/160 / test_static_with_empty_clustering
FAILED:  dtest-upgrade.upgrade_tests.cql_tests.TestCQLNodes2RF1_Upgrade_current_6_0_x_To_indev_6_0_x.Tests / dtest-upgrade jdk11 42/160 / test_static_with_limit
FAILED:  dtest-upgrade.upgrade_tests.cql_tests.TestCQLNodes2RF1_Upgrade_current_6_0_x_To_indev_6_0_x.Tests / dtest-upgrade jdk11 13/160 / test_store_sets_with_if_not_exists
FAILED:  dtest-upgrade.upgrade_tests.cql_tests.TestCQLNodes2RF1_Upgrade_current_6_0_x_To_indev_6_0_x.Tests / dtest-upgrade jdk11 61/160 / test_tracing_prevents_startup_after_upgrading
FAILED:  dtest-upgrade.upgrade_tests.cql_tests.TestCQLNodes2RF1_Upgrade_current_6_0_x_To_indev_6_0_x.Tests / dtest-upgrade jdk11 29/160 / test_tuple_notation
FAILED:  dtest-upgrade.upgrade_tests.cql_tests.TestCQLNodes2RF1_Upgrade_current_6_0_x_To_indev_6_0_x.Tests / dtest-upgrade jdk11 16/160 / test_user_types
FAILED:  dtest-upgrade.upgrade_tests.cql_tests.TestCQLNodes2RF1_Upgrade_current_6_0_x_To_indev_6_0_x.Tests / dtest-upgrade jdk11 34/160 / test_whole_list_conditional
FAILED:  dtest-upgrade.upgrade_tests.cql_tests.TestCQLNodes2RF1_Upgrade_current_6_0_x_To_indev_6_0_x.Tests / dtest-upgrade jdk11 37/160 / test_whole_set_conditional
FAILED:  dtest-upgrade.upgrade_tests.cql_tests.TestCQLNodes3RF3_Upgrade_current_5_0_x_To_indev_6_0_x.Tests / dtest-upgrade jdk11 144/160 / test_deletion
FAILED:  dtest-upgrade.upgrade_tests.cql_tests.TestCQLNodes3RF3_Upgrade_current_5_0_x_To_indev_6_0_x.Tests / dtest-upgrade jdk11 143/160 / test_nameless_index
FAILED:  dtest-upgrade.upgrade_tests.cql_tests.TestCQLNodes3RF3_Upgrade_current_6_0_x_To_indev_6_0_x.Tests / dtest-upgrade jdk11 14/160 / test_NPE_during_select_with_token
FAILED:  dtest-upgrade.upgrade_tests.cql_tests.TestCQLNodes3RF3_Upgrade_current_6_0_x_To_indev_6_0_x.Tests / dtest-upgrade jdk11 65/160 / test_SIM_assertion_error
FAILED:  dtest-upgrade.upgrade_tests.cql_tests.TestCQLNodes3RF3_Upgrade_current_6_0_x_To_indev_6_0_x.Tests / dtest-upgrade jdk11 30/160 / test_add_deletion_info_in_unsorted_column
FAILED:  dtest-upgrade.upgrade_tests.cql_tests.TestCQLNodes3RF3_Upgrade_current_6_0_x_To_indev_6_0_x.Tests / dtest-upgrade jdk11 66/160 / test_blobAs_functions
FAILED:  dtest-upgrade.upgrade_tests.cql_tests.TestCQLNodes3RF3_Upgrade_current_6_0_x_To_indev_6_0_x.Tests / dtest-upgrade jdk11 49/160 / test_cas_and_compact
FAILED:  dtest-upgrade.upgrade_tests.cql_tests.TestCQLNodes3RF3_Upgrade_current_6_0_x_To_indev_6_0_x.Tests / dtest-upgrade jdk11 57/160 / test_cas_and_list_index
FAILED:  dtest-upgrade.upgrade_tests.cql_tests.TestCQLNodes3RF3_Upgrade_current_6_0_x_To_indev_6_0_x.Tests / dtest-upgrade jdk11 44/160 / test_cas_and_ttl
FAILED:  dtest-upgrade.upgrade_tests.cql_tests.TestCQLNodes3RF3_Upgrade_current_6_0_x_To_indev_6_0_x.Tests / dtest-upgrade jdk11 27/160 / test_cas_simple
FAILED:  dtest-upgrade.upgrade_tests.cql_tests.TestCQLNodes3RF3_Upgrade_current_6_0_x_To_indev_6_0_x.Tests / dtest-upgrade jdk11 7/160 / test_clustering_indexing
FAILED:  dtest-upgrade.upgrade_tests.cql_tests.TestCQLNodes3RF3_Upgrade_current_6_0_x_To_indev_6_0_x.Tests / dtest-upgrade jdk11 17/160 / test_clustering_order_and_functions
FAILED:  dtest-upgrade.upgrade_tests.cql_tests.TestCQLNodes3RF3_Upgrade_current_6_0_x_To_indev_6_0_x.Tests / dtest-upgrade jdk11 63/160 / test_clustering_order_in
FAILED:  dtest-upgrade.upgrade_tests.cql_tests.TestCQLNodes3RF3_Upgrade_current_6_0_x_To_indev_6_0_x.Tests / dtest-upgrade jdk11 24/160 / test_collection_flush
FAILED:  dtest-upgrade.upgrade_tests.cql_tests.TestCQLNodes3RF3_Upgrade_current_6_0_x_To_indev_6_0_x.Tests / dtest-upgrade jdk11 36/160 / test_collection_indexing
FAILED:  dtest-upgrade.upgrade_tests.cql_tests.TestCQLNodes3RF3_Upgrade_current_6_0_x_To_indev_6_0_x.Tests / dtest-upgrade jdk11 31/160 / test_column_name_validation
FAILED:  dtest-upgrade.upgrade_tests.cql_tests.TestCQLNodes3RF3_Upgrade_current_6_0_x_To_indev_6_0_x.Tests / dtest-upgrade jdk11 20/160 / test_conditional_delete
FAILED:  dtest-upgrade.upgrade_tests.cql_tests.TestCQLNodes3RF3_Upgrade_current_6_0_x_To_indev_6_0_x.Tests / dtest-upgrade jdk11 18/160 / test_conditional_update
FAILED:  dtest-upgrade.upgrade_tests.cql_tests.TestCQLNodes3RF3_Upgrade_current_6_0_x_To_indev_6_0_x.Tests / dtest-upgrade jdk11 11/160 / test_conversion_functions
FAILED:  dtest-upgrade.upgrade_tests.cql_tests.TestCQLNodes3RF3_Upgrade_current_6_0_x_To_indev_6_0_x.Tests / dtest-upgrade jdk11 15/160 / test_empty_blob
FAILED:  dtest-upgrade.upgrade_tests.cql_tests.TestCQLNodes3RF3_Upgrade_current_6_0_x_To_indev_6_0_x.Tests / dtest-upgrade jdk11 23/160 / test_empty_in
FAILED:  dtest-upgrade.upgrade_tests.cql_tests.TestCQLNodes3RF3_Upgrade_current_6_0_x_To_indev_6_0_x.Tests / dtest-upgrade jdk11 9/160 / test_end_of_component_as_end_key
FAILED:  dtest-upgrade.upgrade_tests.cql_tests.TestCQLNodes3RF3_Upgrade_current_6_0_x_To_indev_6_0_x.Tests / dtest-upgrade jdk11 64/160 / test_end_of_component_uses_oecBound
FAILED:  dtest-upgrade.upgrade_tests.cql_tests.TestCQLNodes3RF3_Upgrade_current_6_0_x_To_indev_6_0_x.Tests / dtest-upgrade jdk11 52/160 / test_expanded_list_item_conditional
FAILED:  dtest-upgrade.upgrade_tests.cql_tests.TestCQLNodes3RF3_Upgrade_current_6_0_x_To_indev_6_0_x.Tests / dtest-upgrade jdk11 13/160 / test_function_and_reverse_type
FAILED:  dtest-upgrade.upgrade_tests.cql_tests.TestCQLNodes3RF3_Upgrade_current_6_0_x_To_indev_6_0_x.Tests / dtest-upgrade jdk11 26/160 / test_function_with_null
FAILED:  dtest-upgrade.upgrade_tests.cql_tests.TestCQLNodes3RF3_Upgrade_current_6_0_x_To_indev_6_0_x.Tests / dtest-upgrade jdk11 48/160 / test_in_order_by_without_selecting
FAILED:  dtest-upgrade.upgrade_tests.cql_tests.TestCQLNodes3RF3_Upgrade_current_6_0_x_To_indev_6_0_x.Tests / dtest-upgrade jdk11 47/160 / test_in_with_desc_order
FAILED:  dtest-upgrade.upgrade_tests.cql_tests.TestCQLNodes3RF3_Upgrade_current_6_0_x_To_indev_6_0_x.Tests / dtest-upgrade jdk11 28/160 / test_internal_application_error_on_select
FAILED:  dtest-upgrade.upgrade_tests.cql_tests.TestCQLNodes3RF3_Upgrade_current_6_0_x_To_indev_6_0_x.Tests / dtest-upgrade jdk11 34/160 / test_intersection_logic_returns_empty_result
FAILED:  dtest-upgrade.upgrade_tests.cql_tests.TestCQLNodes3RF3_Upgrade_current_6_0_x_To_indev_6_0_x.Tests / dtest-upgrade jdk11 62/160 / test_invalid_custom_timestamp
FAILED:  dtest-upgrade.upgrade_tests.cql_tests.TestCQLNodes3RF3_Upgrade_current_6_0_x_To_indev_6_0_x.Tests / dtest-upgrade jdk11 61/160 / test_key_index_with_reverse_clustering
FAILED:  dtest-upgrade.upgrade_tests.cql_tests.TestCQLNodes3RF3_Upgrade_current_6_0_x_To_indev_6_0_x.Tests / dtest-upgrade jdk11 35/160 / test_large_count
FAILED:  dtest-upgrade.upgrade_tests.cql_tests.TestCQLNodes3RF3_Upgrade_current_6_0_x_To_indev_6_0_x.Tests / dtest-upgrade jdk11 60/160 / test_limit_compact_table
FAILED:  dtest-upgrade.upgrade_tests.cql_tests.TestCQLNodes3RF3_Upgrade_current_6_0_x_To_indev_6_0_x.Tests / dtest-upgrade jdk11 51/160 / test_list_item_conditional
FAILED:  dtest-upgrade.upgrade_tests.cql_tests.TestCQLNodes3RF3_Upgrade_current_6_0_x_To_indev_6_0_x.Tests / dtest-upgrade jdk11 55/160 / test_map_item_conditional
FAILED:  dtest-upgrade.upgrade_tests.cql_tests.TestCQLNodes3RF3_Upgrade_current_6_0_x_To_indev_6_0_x.Tests / dtest-upgrade jdk11 37/160 / test_map_keys_indexing
FAILED:  dtest-upgrade.upgrade_tests.cql_tests.TestCQLNodes3RF3_Upgrade_current_6_0_x_To_indev_6_0_x.Tests / dtest-upgrade jdk11 19/160 / test_non_eq_conditional_update
FAILED:  dtest-upgrade.upgrade_tests.cql_tests.TestCQLNodes3RF3_Upgrade_current_6_0_x_To_indev_6_0_x.Tests / dtest-upgrade jdk11 22/160 / test_nonpure_function_collection
FAILED:  dtest-upgrade.upgrade_tests.cql_tests.TestCQLNodes3RF3_Upgrade_current_6_0_x_To_indev_6_0_x.Tests / dtest-upgrade jdk11 43/160 / test_select_count_paging
FAILED:  dtest-upgrade.upgrade_tests.cql_tests.TestCQLNodes3RF3_Upgrade_current_6_0_x_To_indev_6_0_x.Tests / dtest-upgrade jdk11 25/160 / test_select_distinct_with_deletions
FAILED:  dtest-upgrade.upgrade_tests.cql_tests.TestCQLNodes3RF3_Upgrade_current_6_0_x_To_indev_6_0_x.Tests / dtest-upgrade jdk11 21/160 / test_select_with_alias
FAILED:  dtest-upgrade.upgrade_tests.cql_tests.TestCQLNodes3RF3_Upgrade_current_6_0_x_To_indev_6_0_x.Tests / dtest-upgrade jdk11 39/160 / test_static_columns
FAILED:  dtest-upgrade.upgrade_tests.cql_tests.TestCQLNodes3RF3_Upgrade_current_6_0_x_To_indev_6_0_x.Tests / dtest-upgrade jdk11 40/160 / test_static_columns_cas
FAILED:  dtest-upgrade.upgrade_tests.cql_tests.TestCQLNodes3RF3_Upgrade_current_6_0_x_To_indev_6_0_x.Tests / dtest-upgrade jdk11 42/160 / test_static_columns_with_distinct
FAILED:  dtest-upgrade.upgrade_tests.cql_tests.TestCQLNodes3RF3_Upgrade_current_6_0_x_To_indev_6_0_x.Tests / dtest-upgrade jdk11 59/160 / test_static_with_empty_clustering
FAILED:  dtest-upgrade.upgrade_tests.cql_tests.TestCQLNodes3RF3_Upgrade_current_6_0_x_To_indev_6_0_x.Tests / dtest-upgrade jdk11 58/160 / test_static_with_limit
FAILED:  dtest-upgrade.upgrade_tests.cql_tests.TestCQLNodes3RF3_Upgrade_current_6_0_x_To_indev_6_0_x.Tests / dtest-upgrade jdk11 29/160 / test_store_sets_with_if_not_exists
FAILED:  dtest-upgrade.upgrade_tests.cql_tests.TestCQLNodes3RF3_Upgrade_current_6_0_x_To_indev_6_0_x.Tests / dtest-upgrade jdk11 32/160 / test_user_types
FAILED:  dtest-upgrade.upgrade_tests.cql_tests.TestCQLNodes3RF3_Upgrade_current_6_0_x_To_indev_6_0_x.Tests / dtest-upgrade jdk11 50/160 / test_whole_list_conditional
FAILED:  dtest-upgrade.upgrade_tests.cql_tests.TestCQLNodes3RF3_Upgrade_current_6_0_x_To_indev_6_0_x.Tests / dtest-upgrade jdk11 54/160 / test_whole_map_conditional
FAILED:  dtest-upgrade.upgrade_tests.cql_tests.TestCQLNodes3RF3_Upgrade_current_6_0_x_To_indev_6_0_x.Tests / dtest-upgrade jdk11 53/160 / test_whole_set_conditional
FAILED:  dtest-upgrade.upgrade_tests.paging_test.TestPagingDataNodes2RF1_Upgrade_current_6_0_x_To_indev_6_0_x.Tests / dtest-upgrade jdk11 46/160 / test_basic_compound_paging
FAILED:  dtest-upgrade.upgrade_tests.paging_test.TestPagingDataNodes2RF1_Upgrade_current_6_0_x_To_indev_6_0_x.Tests / dtest-upgrade jdk11 47/160 / test_paging_a_single_wide_row
FAILED:  dtest-upgrade.upgrade_tests.paging_test.TestPagingDataNodes2RF1_Upgrade_current_6_0_x_To_indev_6_0_x.Tests / dtest-upgrade jdk11 48/160 / test_paging_across_multi_wide_rows
FAILED:  dtest-upgrade.upgrade_tests.paging_test.TestPagingDataNodes2RF1_Upgrade_current_6_0_x_To_indev_6_0_x.Tests / dtest-upgrade jdk11 49/160 / test_paging_using_secondary_indexes
FAILED:  dtest-upgrade.upgrade_tests.paging_test.TestPagingDataNodes2RF1_Upgrade_current_6_0_x_To_indev_6_0_x.Tests / dtest-upgrade jdk11 51/160 / test_paging_using_secondary_indexes_with_static_cols
FAILED:  dtest-upgrade.upgrade_tests.paging_test.TestPagingDataNodes2RF1_Upgrade_current_6_0_x_To_indev_6_0_x.Tests / dtest-upgrade jdk11 50/160 / test_static_columns_paging
FAILED:  dtest-upgrade.upgrade_tests.paging_test.TestPagingSizeNodes2RF1_Upgrade_current_6_0_x_To_indev_6_0_x.Tests / dtest-upgrade jdk11 43/160 / test_undefined_page_size_default
FAILED:  dtest-upgrade.upgrade_tests.paging_test.TestPagingSizeNodes2RF1_Upgrade_current_6_0_x_To_indev_6_0_x.Tests / dtest-upgrade jdk11 42/160 / test_with_equal_results_to_page_size
FAILED:  dtest-upgrade.upgrade_tests.paging_test.TestPagingSizeNodes2RF1_Upgrade_current_6_0_x_To_indev_6_0_x.Tests / dtest-upgrade jdk11 40/160 / test_with_less_results_than_page_size
FAILED:  dtest-upgrade.upgrade_tests.paging_test.TestPagingSizeNodes2RF1_Upgrade_current_6_0_x_To_indev_6_0_x.Tests / dtest-upgrade jdk11 39/160 / test_with_no_results
FAILED:  dtest-upgrade.upgrade_tests.paging_test.TestPagingWithDeletionsNodes3RF3_Upgrade_current_6_0_x_To_indev_6_0_x.Tests / dtest-upgrade jdk11 27/160 / test_failure_threshold_deletions
FAILED:  dtest-upgrade.upgrade_tests.paging_test.TestPagingWithDeletionsNodes3RF3_Upgrade_current_6_0_x_To_indev_6_0_x.Tests / dtest-upgrade jdk11 25/160 / test_multiple_cell_deletions
FAILED:  dtest-upgrade.upgrade_tests.paging_test.TestPagingWithDeletionsNodes3RF3_Upgrade_current_6_0_x_To_indev_6_0_x.Tests / dtest-upgrade jdk11 22/160 / test_multiple_partition_deletions
FAILED:  dtest-upgrade.upgrade_tests.paging_test.TestPagingWithDeletionsNodes3RF3_Upgrade_current_6_0_x_To_indev_6_0_x.Tests / dtest-upgrade jdk11 24/160 / test_single_cell_deletions
FAILED:  dtest-upgrade.upgrade_tests.paging_test.TestPagingWithDeletionsNodes3RF3_Upgrade_current_6_0_x_To_indev_6_0_x.Tests / dtest-upgrade jdk11 21/160 / test_single_partition_deletions
FAILED:  dtest-upgrade.upgrade_tests.paging_test.TestPagingWithDeletionsNodes3RF3_Upgrade_current_6_0_x_To_indev_6_0_x.Tests / dtest-upgrade jdk11 23/160 / test_single_row_deletions
FAILED:  dtest-upgrade.upgrade_tests.paging_test.TestPagingWithDeletionsNodes3RF3_Upgrade_current_6_0_x_To_indev_6_0_x.Tests / dtest-upgrade jdk11 26/160 / test_ttl_deletions
FAILED:  dtest.repair_tests.repair_test.TestRepair.Tests / dtest jdk21 10/64 / test_dead_sync_initiator
FAILED:  junit.framework.TestSuite.Tests / jvm-dtest jdk11 15/16 / org.apache.cassandra.distributed.test.QueriesTableTest-_jdk11_x86_64
FAILED:  junit.framework.TestSuite.Tests / jvm-dtest jdk17 5/16 / org.apache.cassandra.distributed.test.accord.MigrationFromAccordWriteRaceTest-_jdk17_x86_64
FAILED:  junit.framework.TestSuite.Tests / test-oa jdk17 10/20 / org.apache.cassandra.index.accord.RouteIndexTest-oa_jdk17_x86_64
FAILED:  org.apache.cassandra.distributed.test.QueriesTableTest.Tests / jvm-dtest jdk11 15/16 / shouldExposeCAS-_jdk11_x86_64
FAILED:  org.apache.cassandra.distributed.test.QueriesTableTest.Tests / jvm-dtest jdk11 15/16 / shouldExposeReadsAndWrites-_jdk11_x86_64
FAILED:  org.apache.cassandra.distributed.test.QueriesTableTest.Tests / jvm-dtest jdk11 15/16 / shouldExposeTransaction-_jdk11_x86_64
FAILED:  org.apache.cassandra.distributed.test.accord.MigrationFromAccordWriteRaceTest.Tests / jvm-dtest jdk11 5/16 / testSplitAndRetryNonSerialLoggedBatchTwoTablesTwoPkey-_jdk11_x86_64
FAILED:  org.apache.cassandra.distributed.test.accord.MigrationFromAccordWriteRaceTest.Tests / jvm-dtest jdk17 5/16 / testSplitAndRetryNonSerialLoggedBatchTwoTablesTwoPkeyHintedViaBatchLogRoutingFailure-_jdk17_x86_64
FAILED:  org.apache.cassandra.distributed.test.cql3.MixedReadsAccordInteropMultiNodeTableWalkTest.Tests / jvm-dtest jdk17 13/16 / test-_jdk17_x86_64
FAILED:  org.apache.cassandra.distributed.upgrade.ClusterMetadataUpgradeAbortMigrationTest.Tests / jvm-dtest-upgrade jdk11 5/6 / upgradeLostNotifyTest-_jdk11_x86_64
FAILED:  org.apache.cassandra.fuzz.sai.MultiNodeSAITest.Tests / jvm-dtest jdk21 8/16 / indexOnlySaiTest-cassandra.testtag_IS_UNDEFINED
FAILED:  org.apache.cassandra.repair.autorepair.AutoRepairParameterizedTest.Tests / test jdk17 7/20 / testDisabledAutoRepairForATableThroughTableLevelConfiguration[repairType=PREVIEW_REPAIRED]-cassandra.testtag_IS_UNDEFINED
FAILED:  org.apache.cassandra.repair.autorepair.AutoRepairParameterizedTest.Tests / test-oa jdk21 7/20 / testGetAllMVs[repairType=PREVIEW_REPAIRED]-cassandra.testtag_IS_UNDEFINED
FAILED:  org.apache.cassandra.simulator.test.SingleNodeSingleTableASTTest.Tests / simulator-dtest jdk11 1/2 / normal-cassandra.testtag_IS_UNDEFINED
FAILED:  org.apache.cassandra.transport.AuthMessageSizeLimitTest.Tests / test-cdc jdk17 1/20 / sendTooBigAuthMultiFrameMessage-cdc_jdk17_x86_64
FAILED:  dtest-upgrade-large-novnode.upgrade_tests.upgrade_through_versions_test.TestUpgrade_current_6_0_x_To_indev_6_0_x.Tests / dtest-upgrade-large-novnode jdk11 7/40 / test_bootstrap
FAILED:  dtest-upgrade-large-novnode.upgrade_tests.upgrade_through_versions_test.TestUpgrade_current_6_0_x_To_indev_6_0_x.Tests / dtest-upgrade-large-novnode jdk11 10/40 / test_rolling_upgrade
FAILED:  dtest-upgrade-large.upgrade_tests.upgrade_through_versions_test.TestUpgrade_current_6_0_x_To_indev_6_0_x.Tests / dtest-upgrade-large jdk11 7/40 / test_bootstrap
FAILED:  dtest-upgrade-large.upgrade_tests.upgrade_through_versions_test.TestUpgrade_current_6_0_x_To_indev_6_0_x.Tests / dtest-upgrade-large jdk11 8/40 / test_bootstrap_multidc
FAILED:  dtest-upgrade-large.upgrade_tests.upgrade_through_versions_test.TestUpgrade_current_6_0_x_To_indev_6_0_x.Tests / dtest-upgrade-large jdk11 9/40 / test_parallel_upgrade
FAILED:  dtest-upgrade-large.upgrade_tests.upgrade_through_versions_test.TestUpgrade_current_6_0_x_To_indev_6_0_x.Tests / dtest-upgrade-large jdk11 10/40 / test_rolling_upgrade
FAILED:  dtest-upgrade-novnode.upgrade_tests.cql_tests.TestCQLNodes2RF1_Upgrade_current_6_0_x_To_indev_6_0_x.Tests / dtest-upgrade-novnode jdk11 8/160 / test_cas_and_compact
FAILED:  dtest-upgrade-novnode.upgrade_tests.cql_tests.TestCQLNodes2RF1_Upgrade_current_6_0_x_To_indev_6_0_x.Tests / dtest-upgrade-novnode jdk11 3/160 / test_cas_and_ttl
FAILED:  dtest-upgrade-novnode.upgrade_tests.cql_tests.TestCQLNodes2RF1_Upgrade_current_6_0_x_To_indev_6_0_x.Tests / dtest-upgrade-novnode jdk11 7/160 / test_in_order_by_without_selecting
FAILED:  dtest-upgrade-novnode.upgrade_tests.cql_tests.TestCQLNodes2RF1_Upgrade_current_6_0_x_To_indev_6_0_x.Tests / dtest-upgrade-novnode jdk11 6/160 / test_in_with_desc_order
FAILED:  dtest-upgrade-novnode.upgrade_tests.cql_tests.TestCQLNodes2RF1_Upgrade_current_6_0_x_To_indev_6_0_x.Tests / dtest-upgrade-novnode jdk11 10/160 / test_list_item_conditional
FAILED:  dtest-upgrade-novnode.upgrade_tests.cql_tests.TestCQLNodes2RF1_Upgrade_current_6_0_x_To_indev_6_0_x.Tests / dtest-upgrade-novnode jdk11 2/160 / test_select_count_paging
FAILED:  dtest-upgrade-novnode.upgrade_tests.cql_tests.TestCQLNodes2RF1_Upgrade_current_6_0_x_To_indev_6_0_x.Tests / dtest-upgrade-novnode jdk11 1/160 / test_static_columns_with_distinct
FAILED:  dtest-upgrade-novnode.upgrade_tests.cql_tests.TestCQLNodes2RF1_Upgrade_current_6_0_x_To_indev_6_0_x.Tests / dtest-upgrade-novnode jdk11 4/160 / test_tuple_notation
FAILED:  dtest-upgrade-novnode.upgrade_tests.cql_tests.TestCQLNodes3RF3_Upgrade_current_6_0_x_To_indev_6_0_x.Tests / dtest-upgrade-novnode jdk11 10/160 / test_batch
FAILED:  dtest-upgrade-novnode.upgrade_tests.cql_tests.TestCQLNodes3RF3_Upgrade_current_6_0_x_To_indev_6_0_x.Tests / dtest-upgrade-novnode jdk11 8/160 / test_deletion
FAILED:  dtest-upgrade-novnode.upgrade_tests.cql_tests.TestCQLNodes3RF3_Upgrade_current_6_0_x_To_indev_6_0_x.Tests / dtest-upgrade-novnode jdk11 2/160 / test_more_order_by
FAILED:  dtest-upgrade-novnode.upgrade_tests.cql_tests.TestCQLNodes3RF3_Upgrade_current_6_0_x_To_indev_6_0_x.Tests / dtest-upgrade-novnode jdk11 7/160 / test_nameless_index
FAILED:  dtest-upgrade-novnode.upgrade_tests.cql_tests.TestCQLNodes3RF3_Upgrade_current_6_0_x_To_indev_6_0_x.Tests / dtest-upgrade-novnode jdk11 6/160 / test_null_support
FAILED:  dtest-upgrade-novnode.upgrade_tests.cql_tests.TestCQLNodes3RF3_Upgrade_current_6_0_x_To_indev_6_0_x.Tests / dtest-upgrade-novnode jdk11 1/160 / test_order_by
FAILED:  dtest-upgrade-novnode.upgrade_tests.cql_tests.TestCQLNodes3RF3_Upgrade_current_6_0_x_To_indev_6_0_x.Tests / dtest-upgrade-novnode jdk11 3/160 / test_order_by_validation
FAILED:  dtest-upgrade-novnode.upgrade_tests.cql_tests.TestCQLNodes3RF3_Upgrade_current_6_0_x_To_indev_6_0_x.Tests / dtest-upgrade-novnode jdk11 4/160 / test_order_by_with_in
FAILED:  dtest-upgrade-novnode.upgrade_tests.cql_tests.TestCQLNodes3RF3_Upgrade_current_6_0_x_To_indev_6_0_x.Tests / dtest-upgrade-novnode jdk11 5/160 / test_reversed_comparator
FAILED:  dtest-upgrade-novnode.upgrade_tests.paging_test.TestPagingDataNodes3RF3_Upgrade_current_6_0_x_To_indev_6_0_x.Tests / dtest-upgrade-novnode jdk11 5/160 / test_basic_compound_paging
FAILED:  dtest-upgrade-novnode.upgrade_tests.paging_test.TestPagingDataNodes3RF3_Upgrade_current_6_0_x_To_indev_6_0_x.Tests / dtest-upgrade-novnode jdk11 4/160 / test_basic_paging
FAILED:  dtest-upgrade-novnode.upgrade_tests.paging_test.TestPagingDataNodes3RF3_Upgrade_current_6_0_x_To_indev_6_0_x.Tests / dtest-upgrade-novnode jdk11 6/160 / test_paging_a_single_wide_row
FAILED:  dtest-upgrade-novnode.upgrade_tests.paging_test.TestPagingDataNodes3RF3_Upgrade_current_6_0_x_To_indev_6_0_x.Tests / dtest-upgrade-novnode jdk11 7/160 / test_paging_across_multi_wide_rows
FAILED:  dtest-upgrade-novnode.upgrade_tests.paging_test.TestPagingDataNodes3RF3_Upgrade_current_6_0_x_To_indev_6_0_x.Tests / dtest-upgrade-novnode jdk11 8/160 / test_paging_using_secondary_indexes
FAILED:  dtest-upgrade-novnode.upgrade_tests.paging_test.TestPagingDataNodes3RF3_Upgrade_current_6_0_x_To_indev_6_0_x.Tests / dtest-upgrade-novnode jdk11 10/160 / test_paging_using_secondary_indexes_with_static_cols
FAILED:  dtest-upgrade-novnode.upgrade_tests.paging_test.TestPagingQueryIsolationNodes2RF1_Upgrade_current_6_0_x_To_indev_6_0_x.Tests / dtest-upgrade-novnode jdk11 10/160 / test_query_isolation
FAILED:  dtest-upgrade-novnode.upgrade_tests.paging_test.TestPagingQueryIsolationNodes3RF3_Upgrade_current_6_0_x_To_indev_6_0_x.Tests / dtest-upgrade-novnode jdk11 2/160 / test_query_isolation
FAILED:  dtest-upgrade.upgrade_tests.cql_tests.TestCQLNodes2RF1_Upgrade_current_6_0_x_To_indev_6_0_x.Tests / dtest-upgrade jdk11 1/160 / test_clustering_order_and_functions
FAILED:  dtest-upgrade.upgrade_tests.cql_tests.TestCQLNodes2RF1_Upgrade_current_6_0_x_To_indev_6_0_x.Tests / dtest-upgrade jdk11 8/160 / test_collection_flush
FAILED:  dtest-upgrade.upgrade_tests.cql_tests.TestCQLNodes2RF1_Upgrade_current_6_0_x_To_indev_6_0_x.Tests / dtest-upgrade jdk11 4/160 / test_conditional_delete
FAILED:  dtest-upgrade.upgrade_tests.cql_tests.TestCQLNodes2RF1_Upgrade_current_6_0_x_To_indev_6_0_x.Tests / dtest-upgrade jdk11 2/160 / test_conditional_update
FAILED:  dtest-upgrade.upgrade_tests.cql_tests.TestCQLNodes2RF1_Upgrade_current_6_0_x_To_indev_6_0_x.Tests / dtest-upgrade jdk11 10/160 / test_function_with_null
FAILED:  dtest-upgrade.upgrade_tests.cql_tests.TestCQLNodes2RF1_Upgrade_current_6_0_x_To_indev_6_0_x.Tests / dtest-upgrade jdk11 3/160 / test_non_eq_conditional_update
FAILED:  dtest-upgrade.upgrade_tests.cql_tests.TestCQLNodes2RF1_Upgrade_current_6_0_x_To_indev_6_0_x.Tests / dtest-upgrade jdk11 6/160 / test_nonpure_function_collection
FAILED:  dtest-upgrade.upgrade_tests.cql_tests.TestCQLNodes2RF1_Upgrade_current_6_0_x_To_indev_6_0_x.Tests / dtest-upgrade jdk11 5/160 / test_select_with_alias
FAILED:  dtest-upgrade.upgrade_tests.cql_tests.TestCQLNodes3RF3_Upgrade_current_6_0_x_To_indev_6_0_x.Tests / dtest-upgrade jdk11 5/160 / test_compact_metadata
FAILED:  dtest-upgrade.upgrade_tests.cql_tests.TestCQLNodes3RF3_Upgrade_current_6_0_x_To_indev_6_0_x.Tests / dtest-upgrade jdk11 8/160 / test_edge_2i_on_complex_pk
FAILED:  dtest-upgrade.upgrade_tests.cql_tests.TestCQLNodes3RF3_Upgrade_current_6_0_x_To_indev_6_0_x.Tests / dtest-upgrade jdk11 4/160 / test_float_with_exponent
FAILED:  dtest-upgrade.upgrade_tests.cql_tests.TestCQLNodes3RF3_Upgrade_current_6_0_x_To_indev_6_0_x.Tests / dtest-upgrade jdk11 2/160 / test_large_clustering_in
FAILED:  dtest-upgrade.upgrade_tests.cql_tests.TestCQLNodes3RF3_Upgrade_current_6_0_x_To_indev_6_0_x.Tests / dtest-upgrade jdk11 1/160 / test_multi_in_compact_non_composite
FAILED:  dtest-upgrade.upgrade_tests.cql_tests.TestCQLNodes3RF3_Upgrade_current_6_0_x_To_indev_6_0_x.Tests / dtest-upgrade jdk11 6/160 / test_query_compact_tables_during_upgrade
FAILED:  dtest-upgrade.upgrade_tests.cql_tests.TestCQLNodes3RF3_Upgrade_current_6_0_x_To_indev_6_0_x.Tests / dtest-upgrade jdk11 10/160 / test_ticket_5230
FAILED:  dtest-upgrade.upgrade_tests.cql_tests.TestCQLNodes3RF3_Upgrade_current_6_0_x_To_indev_6_0_x.Tests / dtest-upgrade jdk11 3/160 / test_timeuuid
FAILED:  dtest-upgrade.upgrade_tests.paging_test.TestPagingSizeNodes3RF3_Upgrade_current_6_0_x_To_indev_6_0_x.Tests / dtest-upgrade jdk11 3/160 / test_undefined_page_size_default
FAILED:  dtest-upgrade.upgrade_tests.paging_test.TestPagingSizeNodes3RF3_Upgrade_current_6_0_x_To_indev_6_0_x.Tests / dtest-upgrade jdk11 2/160 / test_with_equal_results_to_page_size
FAILED:  dtest-upgrade.upgrade_tests.paging_test.TestPagingSizeNodes3RF3_Upgrade_current_6_0_x_To_indev_6_0_x.Tests / dtest-upgrade jdk11 1/160 / test_with_more_results_than_page_size
FAILED:  org.apache.cassandra.distributed.test.accord.AccordMetricsTest.Tests / jvm-dtest jdk21 3/16 / testTimeoutMetrics-_jdk21_x86_64
FAILED:  dtest-latest.bootstrap_test.TestBootstrap.Tests / dtest-latest jdk11 7/64 / test_consistent_range_movement_false_with_rf1_should_succeed
FAILED:  dtest-latest.bootstrap_test.TestBootstrap.Tests / dtest-latest jdk17 7/64 / test_consistent_range_movement_false_with_rf1_should_succeed
FAILED:  dtest-latest.bootstrap_test.TestBootstrap.Tests / dtest-latest jdk21 7/64 / test_consistent_range_movement_false_with_rf1_should_succeed
FAILED:  dtest-latest.bootstrap_test.TestBootstrap.Tests / dtest-latest jdk17 6/64 / test_consistent_range_movement_true_with_rf1_should_fail
FAILED:  dtest-latest.bootstrap_test.TestBootstrap.Tests / dtest-latest jdk21 6/64 / test_consistent_range_movement_true_with_rf1_should_fail
FAILED:  dtest-latest.bootstrap_test.TestBootstrap.Tests / dtest-latest jdk11 6/64 / test_consistent_range_movement_true_with_rf1_should_fail
FAILED:  dtest-latest.client_request_metrics_test.TestClientRequestMetrics.Tests / dtest-latest jdk11 34/64 / test_client_request_metrics
FAILED:  dtest-latest.client_request_metrics_test.TestClientRequestMetrics.Tests / dtest-latest jdk17 34/64 / test_client_request_metrics
FAILED:  dtest-latest.client_request_metrics_test.TestClientRequestMetrics.Tests / dtest-latest jdk21 34/64 / test_client_request_metrics
FAILED:  dtest-latest.replace_address_test.TestReplaceAddress.Tests / dtest-latest jdk11 23/64 / test_replace_with_insufficient_replicas
FAILED:  dtest-latest.replace_address_test.TestReplaceAddress.Tests / dtest-latest jdk17 23/64 / test_replace_with_insufficient_replicas
FAILED:  dtest-latest.replace_address_test.TestReplaceAddress.Tests / dtest-latest jdk17 23/64 / test_replace_with_insufficient_replicas
FAILED:  dtest-latest.replace_address_test.TestReplaceAddress.Tests / dtest-latest jdk11 23/64 / test_replace_with_insufficient_replicas
FAILED:  dtest-latest.replace_address_test.TestReplaceAddress.Tests / dtest-latest jdk21 23/64 / test_replace_with_insufficient_replicas
FAILED:  dtest-latest.replace_address_test.TestReplaceAddress.Tests / dtest-latest jdk21 23/64 / test_replace_with_insufficient_replicas
FAILED:  dtest-latest.replace_address_test.TestReplaceAddress.Tests / dtest-latest jdk17 23/64 / test_replace_with_insufficient_replicas
FAILED:  dtest-latest.replace_address_test.TestReplaceAddress.Tests / dtest-latest jdk11 23/64 / test_replace_with_insufficient_replicas
FAILED:  dtest-latest.replace_address_test.TestReplaceAddress.Tests / dtest-latest jdk21 23/64 / test_replace_with_insufficient_replicas
FAILED:  dtest-upgrade-novnode.upgrade_tests.cql_tests.TestCQLNodes2RF1_Upgrade_current_6_0_x_To_indev_6_0_x.Tests / dtest-upgrade-novnode jdk11 131/160 / test_NPE_during_select_with_token
FAILED:  dtest-upgrade-novnode.upgrade_tests.cql_tests.TestCQLNodes2RF1_Upgrade_current_6_0_x_To_indev_6_0_x.Tests / dtest-upgrade-novnode jdk11 149/160 / test_add_deletion_info_in_unsorted_column
FAILED:  dtest-upgrade-novnode.upgrade_tests.cql_tests.TestCQLNodes2RF1_Upgrade_current_6_0_x_To_indev_6_0_x.Tests / dtest-upgrade-novnode jdk11 74/160 / test_batch
FAILED:  dtest-upgrade-novnode.upgrade_tests.cql_tests.TestCQLNodes2RF1_Upgrade_current_6_0_x_To_indev_6_0_x.Tests / dtest-upgrade-novnode jdk11 106/160 / test_batch_and_list
FAILED:  dtest-upgrade-novnode.upgrade_tests.cql_tests.TestCQLNodes2RF1_Upgrade_current_6_0_x_To_indev_6_0_x.Tests / dtest-upgrade-novnode jdk11 107/160 / test_boolean
FAILED:  dtest-upgrade-novnode.upgrade_tests.cql_tests.TestCQLNodes2RF1_Upgrade_current_6_0_x_To_indev_6_0_x.Tests / dtest-upgrade-novnode jdk11 146/160 / test_cas_simple
FAILED:  dtest-upgrade-novnode.upgrade_tests.cql_tests.TestCQLNodes2RF1_Upgrade_current_6_0_x_To_indev_6_0_x.Tests / dtest-upgrade-novnode jdk11 124/160 / test_clustering_indexing
FAILED:  dtest-upgrade-novnode.upgrade_tests.cql_tests.TestCQLNodes2RF1_Upgrade_current_6_0_x_To_indev_6_0_x.Tests / dtest-upgrade-novnode jdk11 105/160 / test_collection_and_regular
FAILED:  dtest-upgrade-novnode.upgrade_tests.cql_tests.TestCQLNodes2RF1_Upgrade_current_6_0_x_To_indev_6_0_x.Tests / dtest-upgrade-novnode jdk11 142/160 / test_collection_flush
FAILED:  dtest-upgrade-novnode.upgrade_tests.cql_tests.TestCQLNodes2RF1_Upgrade_current_6_0_x_To_indev_6_0_x.Tests / dtest-upgrade-novnode jdk11 155/160 / test_collection_indexing
FAILED:  dtest-upgrade-novnode.upgrade_tests.cql_tests.TestCQLNodes2RF1_Upgrade_current_6_0_x_To_indev_6_0_x.Tests / dtest-upgrade-novnode jdk11 150/160 / test_column_name_validation
FAILED:  dtest-upgrade-novnode.upgrade_tests.cql_tests.TestCQLNodes2RF1_Upgrade_current_6_0_x_To_indev_6_0_x.Tests / dtest-upgrade-novnode jdk11 122/160 / test_compact_metadata
FAILED:  dtest-upgrade-novnode.upgrade_tests.cql_tests.TestCQLNodes2RF1_Upgrade_current_6_0_x_To_indev_6_0_x.Tests / dtest-upgrade-novnode jdk11 111/160 / test_composite_index_collections
FAILED:  dtest-upgrade-novnode.upgrade_tests.cql_tests.TestCQLNodes2RF1_Upgrade_current_6_0_x_To_indev_6_0_x.Tests / dtest-upgrade-novnode jdk11 96/160 / test_composite_index_with_pk
FAILED:  dtest-upgrade-novnode.upgrade_tests.cql_tests.TestCQLNodes2RF1_Upgrade_current_6_0_x_To_indev_6_0_x.Tests / dtest-upgrade-novnode jdk11 115/160 / test_composite_partition_key_validation
FAILED:  dtest-upgrade-novnode.upgrade_tests.cql_tests.TestCQLNodes2RF1_Upgrade_current_6_0_x_To_indev_6_0_x.Tests / dtest-upgrade-novnode jdk11 88/160 / test_composite_row_key
FAILED:  dtest-upgrade-novnode.upgrade_tests.cql_tests.TestCQLNodes2RF1_Upgrade_current_6_0_x_To_indev_6_0_x.Tests / dtest-upgrade-novnode jdk11 137/160 / test_conditional_delete
FAILED:  dtest-upgrade-novnode.upgrade_tests.cql_tests.TestCQLNodes2RF1_Upgrade_current_6_0_x_To_indev_6_0_x.Tests / dtest-upgrade-novnode jdk11 135/160 / test_conditional_update
FAILED:  dtest-upgrade-novnode.upgrade_tests.cql_tests.TestCQLNodes2RF1_Upgrade_current_6_0_x_To_indev_6_0_x.Tests / dtest-upgrade-novnode jdk11 128/160 / test_conversion_functions
FAILED:  dtest-upgrade-novnode.upgrade_tests.cql_tests.TestCQLNodes2RF1_Upgrade_current_6_0_x_To_indev_6_0_x.Tests / dtest-upgrade-novnode jdk11 73/160 / test_count
FAILED:  dtest-upgrade-novnode.upgrade_tests.cql_tests.TestCQLNodes2RF1_Upgrade_current_6_0_x_To_indev_6_0_x.Tests / dtest-upgrade-novnode jdk11 94/160 / test_date
FAILED:  dtest-upgrade-novnode.upgrade_tests.cql_tests.TestCQLNodes2RF1_Upgrade_current_6_0_x_To_indev_6_0_x.Tests / dtest-upgrade-novnode jdk11 81/160 / test_delete_row
FAILED:  dtest-upgrade-novnode.upgrade_tests.cql_tests.TestCQLNodes2RF1_Upgrade_current_6_0_x_To_indev_6_0_x.Tests / dtest-upgrade-novnode jdk11 34/160 / test_deleted_row_select
FAILED:  dtest-upgrade-novnode.upgrade_tests.cql_tests.TestCQLNodes2RF1_Upgrade_current_6_0_x_To_indev_6_0_x.Tests / dtest-upgrade-novnode jdk11 72/160 / test_deletion
FAILED:  dtest-upgrade-novnode.upgrade_tests.cql_tests.TestCQLNodes2RF1_Upgrade_current_6_0_x_To_indev_6_0_x.Tests / dtest-upgrade-novnode jdk11 125/160 / test_edge_2i_on_complex_pk
FAILED:  dtest-upgrade-novnode.upgrade_tests.cql_tests.TestCQLNodes2RF1_Upgrade_current_6_0_x_To_indev_6_0_x.Tests / dtest-upgrade-novnode jdk11 132/160 / test_empty_blob
FAILED:  dtest-upgrade-novnode.upgrade_tests.cql_tests.TestCQLNodes2RF1_Upgrade_current_6_0_x_To_indev_6_0_x.Tests / dtest-upgrade-novnode jdk11 141/160 / test_empty_in
FAILED:  dtest-upgrade-novnode.upgrade_tests.cql_tests.TestCQLNodes2RF1_Upgrade_current_6_0_x_To_indev_6_0_x.Tests / dtest-upgrade-novnode jdk11 126/160 / test_end_of_component_as_end_key
FAILED:  dtest-upgrade-novnode.upgrade_tests.cql_tests.TestCQLNodes2RF1_Upgrade_current_6_0_x_To_indev_6_0_x.Tests / dtest-upgrade-novnode jdk11 121/160 / test_float_with_exponent
FAILED:  dtest-upgrade-novnode.upgrade_tests.cql_tests.TestCQLNodes2RF1_Upgrade_current_6_0_x_To_indev_6_0_x.Tests / dtest-upgrade-novnode jdk11 130/160 / test_function_and_reverse_type
FAILED:  dtest-upgrade-novnode.upgrade_tests.cql_tests.TestCQLNodes2RF1_Upgrade_current_6_0_x_To_indev_6_0_x.Tests / dtest-upgrade-novnode jdk11 101/160 / test_indexes_composite
FAILED:  dtest-upgrade-novnode.upgrade_tests.cql_tests.TestCQLNodes2RF1_Upgrade_current_6_0_x_To_indev_6_0_x.Tests / dtest-upgrade-novnode jdk11 147/160 / test_internal_application_error_on_select
FAILED:  dtest-upgrade-novnode.upgrade_tests.cql_tests.TestCQLNodes2RF1_Upgrade_current_6_0_x_To_indev_6_0_x.Tests / dtest-upgrade-novnode jdk11 153/160 / test_intersection_logic_returns_empty_result
FAILED:  dtest-upgrade-novnode.upgrade_tests.cql_tests.TestCQLNodes2RF1_Upgrade_current_6_0_x_To_indev_6_0_x.Tests / dtest-upgrade-novnode jdk11 119/160 / test_large_clustering_in
FAILED:  dtest-upgrade-novnode.upgrade_tests.cql_tests.TestCQLNodes2RF1_Upgrade_current_6_0_x_To_indev_6_0_x.Tests / dtest-upgrade-novnode jdk11 154/160 / test_large_count
FAILED:  dtest-upgrade-novnode.upgrade_tests.cql_tests.TestCQLNodes2RF1_Upgrade_current_6_0_x_To_indev_6_0_x.Tests / dtest-upgrade-novnode jdk11 97/160 / test_limit_bugs
FAILED:  dtest-upgrade-novnode.upgrade_tests.cql_tests.TestCQLNodes2RF1_Upgrade_current_6_0_x_To_indev_6_0_x.Tests / dtest-upgrade-novnode jdk11 85/160 / test_list
FAILED:  dtest-upgrade-novnode.upgrade_tests.cql_tests.TestCQLNodes2RF1_Upgrade_current_6_0_x_To_indev_6_0_x.Tests / dtest-upgrade-novnode jdk11 84/160 / test_map
FAILED:  dtest-upgrade-novnode.upgrade_tests.cql_tests.TestCQLNodes2RF1_Upgrade_current_6_0_x_To_indev_6_0_x.Tests / dtest-upgrade-novnode jdk11 156/160 / test_map_keys_indexing
FAILED:  dtest-upgrade-novnode.upgrade_tests.cql_tests.TestCQLNodes2RF1_Upgrade_current_6_0_x_To_indev_6_0_x.Tests / dtest-upgrade-novnode jdk11 37/160 / test_materialized_view_simple
FAILED:  dtest-upgrade-novnode.upgrade_tests.cql_tests.TestCQLNodes2RF1_Upgrade_current_6_0_x_To_indev_6_0_x.Tests / dtest-upgrade-novnode jdk11 152/160 / test_more_user_types
FAILED:  dtest-upgrade-novnode.upgrade_tests.cql_tests.TestCQLNodes2RF1_Upgrade_current_6_0_x_To_indev_6_0_x.Tests / dtest-upgrade-novnode jdk11 86/160 / test_multi_collection
FAILED:  dtest-upgrade-novnode.upgrade_tests.cql_tests.TestCQLNodes2RF1_Upgrade_current_6_0_x_To_indev_6_0_x.Tests / dtest-upgrade-novnode jdk11 116/160 / test_multi_in
FAILED:  dtest-upgrade-novnode.upgrade_tests.cql_tests.TestCQLNodes2RF1_Upgrade_current_6_0_x_To_indev_6_0_x.Tests / dtest-upgrade-novnode jdk11 117/160 / test_multi_in_compact
FAILED:  dtest-upgrade-novnode.upgrade_tests.cql_tests.TestCQLNodes2RF1_Upgrade_current_6_0_x_To_indev_6_0_x.Tests / dtest-upgrade-novnode jdk11 110/160 / test_multi_list_set
FAILED:  dtest-upgrade-novnode.upgrade_tests.cql_tests.TestCQLNodes2RF1_Upgrade_current_6_0_x_To_indev_6_0_x.Tests / dtest-upgrade-novnode jdk11 108/160 / test_multiordering
FAILED:  dtest-upgrade-novnode.upgrade_tests.cql_tests.TestCQLNodes2RF1_Upgrade_current_6_0_x_To_indev_6_0_x.Tests / dtest-upgrade-novnode jdk11 71/160 / test_nameless_index
FAILED:  dtest-upgrade-novnode.upgrade_tests.cql_tests.TestCQLNodes2RF1_Upgrade_current_6_0_x_To_indev_6_0_x.Tests / dtest-upgrade-novnode jdk11 157/160 / test_nan_infinity
FAILED:  dtest-upgrade-novnode.upgrade_tests.cql_tests.TestCQLNodes2RF1_Upgrade_current_6_0_x_To_indev_6_0_x.Tests / dtest-upgrade-novnode jdk11 93/160 / test_no_clustering
FAILED:  dtest-upgrade-novnode.upgrade_tests.cql_tests.TestCQLNodes2RF1_Upgrade_current_6_0_x_To_indev_6_0_x.Tests / dtest-upgrade-novnode jdk11 77/160 / test_no_range_ghost
FAILED:  dtest-upgrade-novnode.upgrade_tests.cql_tests.TestCQLNodes2RF1_Upgrade_current_6_0_x_To_indev_6_0_x.Tests / dtest-upgrade-novnode jdk11 136/160 / test_non_eq_conditional_update
FAILED:  dtest-upgrade-novnode.upgrade_tests.cql_tests.TestCQLNodes2RF1_Upgrade_current_6_0_x_To_indev_6_0_x.Tests / dtest-upgrade-novnode jdk11 140/160 / test_nonpure_function_collection
FAILED:  dtest-upgrade-novnode.upgrade_tests.cql_tests.TestCQLNodes2RF1_Upgrade_current_6_0_x_To_indev_6_0_x.Tests / dtest-upgrade-novnode jdk11 98/160 / test_npe_composite_table_slice
FAILED:  dtest-upgrade-novnode.upgrade_tests.cql_tests.TestCQLNodes2RF1_Upgrade_current_6_0_x_To_indev_6_0_x.Tests / dtest-upgrade-novnode jdk11 70/160 / test_null_support
FAILED:  dtest-upgrade-novnode.upgrade_tests.cql_tests.TestCQLNodes2RF1_Upgrade_current_6_0_x_To_indev_6_0_x.Tests / dtest-upgrade-novnode jdk11 92/160 / test_only_pk
FAILED:  dtest-upgrade-novnode.upgrade_tests.cql_tests.TestCQLNodes2RF1_Upgrade_current_6_0_x_To_indev_6_0_x.Tests / dtest-upgrade-novnode jdk11 99/160 / test_order_by_multikey
FAILED:  dtest-upgrade-novnode.upgrade_tests.cql_tests.TestCQLNodes2RF1_Upgrade_current_6_0_x_To_indev_6_0_x.Tests / dtest-upgrade-novnode jdk11 67/160 / test_order_by_validation
FAILED:  dtest-upgrade-novnode.upgrade_tests.cql_tests.TestCQLNodes2RF1_Upgrade_current_6_0_x_To_indev_6_0_x.Tests / dtest-upgrade-novnode jdk11 68/160 / test_order_by_with_in
FAILED:  dtest-upgrade-novnode.upgrade_tests.cql_tests.TestCQLNodes2RF1_Upgrade_current_6_0_x_To_indev_6_0_x.Tests / dtest-upgrade-novnode jdk11 123/160 / test_query_compact_tables_during_upgrade
FAILED:  dtest-upgrade-novnode.upgrade_tests.cql_tests.TestCQLNodes2RF1_Upgrade_current_6_0_x_To_indev_6_0_x.Tests / dtest-upgrade-novnode jdk11 138/160 / test_range_key_ordered
FAILED:  dtest-upgrade-novnode.upgrade_tests.cql_tests.TestCQLNodes2RF1_Upgrade_current_6_0_x_To_indev_6_0_x.Tests / dtest-upgrade-novnode jdk11 87/160 / test_range_query
FAILED:  dtest-upgrade-novnode.upgrade_tests.cql_tests.TestCQLNodes2RF1_Upgrade_current_6_0_x_To_indev_6_0_x.Tests / dtest-upgrade-novnode jdk11 82/160 / test_range_query_2ndary
FAILED:  dtest-upgrade-novnode.upgrade_tests.cql_tests.TestCQLNodes2RF1_Upgrade_current_6_0_x_To_indev_6_0_x.Tests / dtest-upgrade-novnode jdk11 95/160 / test_range_slice
FAILED:  dtest-upgrade-novnode.upgrade_tests.cql_tests.TestCQLNodes2RF1_Upgrade_current_6_0_x_To_indev_6_0_x.Tests / dtest-upgrade-novnode jdk11 79/160 / test_range_tombstones
FAILED:  dtest-upgrade-novnode.upgrade_tests.cql_tests.TestCQLNodes2RF1_Upgrade_current_6_0_x_To_indev_6_0_x.Tests / dtest-upgrade-novnode jdk11 80/160 / test_range_tombstones_compaction
FAILED:  dtest-upgrade-novnode.upgrade_tests.cql_tests.TestCQLNodes2RF1_Upgrade_current_6_0_x_To_indev_6_0_x.Tests / dtest-upgrade-novnode jdk11 113/160 / test_range_with_deletes
FAILED:  dtest-upgrade-novnode.upgrade_tests.cql_tests.TestCQLNodes2RF1_Upgrade_current_6_0_x_To_indev_6_0_x.Tests / dtest-upgrade-novnode jdk11 100/160 / test_remove_range_slice
FAILED:  dtest-upgrade-novnode.upgrade_tests.cql_tests.TestCQLNodes2RF1_Upgrade_current_6_0_x_To_indev_6_0_x.Tests / dtest-upgrade-novnode jdk11 109/160 / test_returned_null
FAILED:  dtest-upgrade-novnode.upgrade_tests.cql_tests.TestCQLNodes2RF1_Upgrade_current_6_0_x_To_indev_6_0_x.Tests / dtest-upgrade-novnode jdk11 103/160 / test_reversed_compact
FAILED:  dtest-upgrade-novnode.upgrade_tests.cql_tests.TestCQLNodes2RF1_Upgrade_current_6_0_x_To_indev_6_0_x.Tests / dtest-upgrade-novnode jdk11 69/160 / test_reversed_comparator
FAILED:  dtest-upgrade-novnode.upgrade_tests.cql_tests.TestCQLNodes2RF1_Upgrade_current_6_0_x_To_indev_6_0_x.Tests / dtest-upgrade-novnode jdk11 91/160 / test_row_existence
FAILED:  dtest-upgrade-novnode.upgrade_tests.cql_tests.TestCQLNodes2RF1_Upgrade_current_6_0_x_To_indev_6_0_x.Tests / dtest-upgrade-novnode jdk11 143/160 / test_select_distinct
FAILED:  dtest-upgrade-novnode.upgrade_tests.cql_tests.TestCQLNodes2RF1_Upgrade_current_6_0_x_To_indev_6_0_x.Tests / dtest-upgrade-novnode jdk11 144/160 / test_select_distinct_with_deletions
FAILED:  dtest-upgrade-novnode.upgrade_tests.cql_tests.TestCQLNodes2RF1_Upgrade_current_6_0_x_To_indev_6_0_x.Tests / dtest-upgrade-novnode jdk11 139/160 / test_select_with_alias
FAILED:  dtest-upgrade-novnode.upgrade_tests.cql_tests.TestCQLNodes2RF1_Upgrade_current_6_0_x_To_indev_6_0_x.Tests / dtest-upgrade-novnode jdk11 83/160 / test_set
FAILED:  dtest-upgrade-novnode.upgrade_tests.cql_tests.TestCQLNodes2RF1_Upgrade_current_6_0_x_To_indev_6_0_x.Tests / dtest-upgrade-novnode jdk11 50/160 / test_static_cf
FAILED:  dtest-upgrade-novnode.upgrade_tests.cql_tests.TestCQLNodes2RF1_Upgrade_current_6_0_x_To_indev_6_0_x.Tests / dtest-upgrade-novnode jdk11 159/160 / test_static_columns_cas
FAILED:  dtest-upgrade-novnode.upgrade_tests.cql_tests.TestCQLNodes2RF1_Upgrade_current_6_0_x_To_indev_6_0_x.Tests / dtest-upgrade-novnode jdk11 160/160 / test_static_columns_with_2i
FAILED:  dtest-upgrade-novnode.upgrade_tests.cql_tests.TestCQLNodes2RF1_Upgrade_current_6_0_x_To_indev_6_0_x.Tests / dtest-upgrade-novnode jdk11 148/160 / test_store_sets_with_if_not_exists
FAILED:  dtest-upgrade-novnode.upgrade_tests.cql_tests.TestCQLNodes2RF1_Upgrade_current_6_0_x_To_indev_6_0_x.Tests / dtest-upgrade-novnode jdk11 127/160 / test_ticket_5230
FAILED:  dtest-upgrade-novnode.upgrade_tests.cql_tests.TestCQLNodes2RF1_Upgrade_current_6_0_x_To_indev_6_0_x.Tests / dtest-upgrade-novnode jdk11 76/160 / test_timestamp_and_ttl
FAILED:  dtest-upgrade-novnode.upgrade_tests.cql_tests.TestCQLNodes2RF1_Upgrade_current_6_0_x_To_indev_6_0_x.Tests / dtest-upgrade-novnode jdk11 120/160 / test_timeuuid
FAILED:  dtest-upgrade-novnode.upgrade_tests.cql_tests.TestCQLNodes2RF1_Upgrade_current_6_0_x_To_indev_6_0_x.Tests / dtest-upgrade-novnode jdk11 75/160 / test_token_range
FAILED:  dtest-upgrade-novnode.upgrade_tests.cql_tests.TestCQLNodes2RF1_Upgrade_current_6_0_x_To_indev_6_0_x.Tests / dtest-upgrade-novnode jdk11 78/160 / test_undefined_column_handling
FAILED:  dtest-upgrade-novnode.upgrade_tests.cql_tests.TestCQLNodes2RF1_Upgrade_current_6_0_x_To_indev_6_0_x.Tests / dtest-upgrade-novnode jdk11 151/160 / test_user_types
FAILED:  dtest-upgrade-novnode.upgrade_tests.cql_tests.TestCQLNodes3RF3_Upgrade_current_6_0_x_To_indev_6_0_x.Tests / dtest-upgrade-novnode jdk11 67/160 / test_NPE_during_select_with_token
FAILED:  dtest-upgrade-novnode.upgrade_tests.cql_tests.TestCQLNodes3RF3_Upgrade_current_6_0_x_To_indev_6_0_x.Tests / dtest-upgrade-novnode jdk11 120/160 / test_SIM_assertion_error
FAILED:  dtest-upgrade-novnode.upgrade_tests.cql_tests.TestCQLNodes3RF3_Upgrade_current_6_0_x_To_indev_6_0_x.Tests / dtest-upgrade-novnode jdk11 85/160 / test_add_deletion_info_in_unsorted_column
FAILED:  dtest-upgrade-novnode.upgrade_tests.cql_tests.TestCQLNodes3RF3_Upgrade_current_6_0_x_To_indev_6_0_x.Tests / dtest-upgrade-novnode jdk11 42/160 / test_batch_and_list
FAILED:  dtest-upgrade-novnode.upgrade_tests.cql_tests.TestCQLNodes3RF3_Upgrade_current_6_0_x_To_indev_6_0_x.Tests / dtest-upgrade-novnode jdk11 121/160 / test_blobAs_functions
FAILED:  dtest-upgrade-novnode.upgrade_tests.cql_tests.TestCQLNodes3RF3_Upgrade_current_6_0_x_To_indev_6_0_x.Tests / dtest-upgrade-novnode jdk11 43/160 / test_boolean
FAILED:  dtest-upgrade-novnode.upgrade_tests.cql_tests.TestCQLNodes3RF3_Upgrade_current_6_0_x_To_indev_6_0_x.Tests / dtest-upgrade-novnode jdk11 112/160 / test_cas_and_list_index
FAILED:  dtest-upgrade-novnode.upgrade_tests.cql_tests.TestCQLNodes3RF3_Upgrade_current_6_0_x_To_indev_6_0_x.Tests / dtest-upgrade-novnode jdk11 99/160 / test_cas_and_ttl
FAILED:  dtest-upgrade-novnode.upgrade_tests.cql_tests.TestCQLNodes3RF3_Upgrade_current_6_0_x_To_indev_6_0_x.Tests / dtest-upgrade-novnode jdk11 82/160 / test_cas_simple
FAILED:  dtest-upgrade-novnode.upgrade_tests.cql_tests.TestCQLNodes3RF3_Upgrade_current_6_0_x_To_indev_6_0_x.Tests / dtest-upgrade-novnode jdk11 70/160 / test_clustering_order_and_functions
FAILED:  dtest-upgrade-novnode.upgrade_tests.cql_tests.TestCQLNodes3RF3_Upgrade_current_6_0_x_To_indev_6_0_x.Tests / dtest-upgrade-novnode jdk11 41/160 / test_collection_and_regular
FAILED:  dtest-upgrade-novnode.upgrade_tests.cql_tests.TestCQLNodes3RF3_Upgrade_current_6_0_x_To_indev_6_0_x.Tests / dtest-upgrade-novnode jdk11 78/160 / test_collection_flush
FAILED:  dtest-upgrade-novnode.upgrade_tests.cql_tests.TestCQLNodes3RF3_Upgrade_current_6_0_x_To_indev_6_0_x.Tests / dtest-upgrade-novnode jdk11 91/160 / test_collection_indexing
FAILED:  dtest-upgrade-novnode.upgrade_tests.cql_tests.TestCQLNodes3RF3_Upgrade_current_6_0_x_To_indev_6_0_x.Tests / dtest-upgrade-novnode jdk11 86/160 / test_column_name_validation
FAILED:  dtest-upgrade-novnode.upgrade_tests.cql_tests.TestCQLNodes3RF3_Upgrade_current_6_0_x_To_indev_6_0_x.Tests / dtest-upgrade-novnode jdk11 73/160 / test_conditional_delete
FAILED:  dtest-upgrade-novnode.upgrade_tests.cql_tests.TestCQLNodes3RF3_Upgrade_current_6_0_x_To_indev_6_0_x.Tests / dtest-upgrade-novnode jdk11 71/160 / test_conditional_update
FAILED:  dtest-upgrade-novnode.upgrade_tests.cql_tests.TestCQLNodes3RF3_Upgrade_current_6_0_x_To_indev_6_0_x.Tests / dtest-upgrade-novnode jdk11 156/160 / test_counters
FAILED:  dtest-upgrade-novnode.upgrade_tests.cql_tests.TestCQLNodes3RF3_Upgrade_current_6_0_x_To_indev_6_0_x.Tests / dtest-upgrade-novnode jdk11 130/160 / test_deleted_row_select
FAILED:  dtest-upgrade-novnode.upgrade_tests.cql_tests.TestCQLNodes3RF3_Upgrade_current_6_0_x_To_indev_6_0_x.Tests / dtest-upgrade-novnode jdk11 150/160 / test_dense_cf
FAILED:  dtest-upgrade-novnode.upgrade_tests.cql_tests.TestCQLNodes3RF3_Upgrade_current_6_0_x_To_indev_6_0_x.Tests / dtest-upgrade-novnode jdk11 149/160 / test_dynamic_cf
FAILED:  dtest-upgrade-novnode.upgrade_tests.cql_tests.TestCQLNodes3RF3_Upgrade_current_6_0_x_To_indev_6_0_x.Tests / dtest-upgrade-novnode jdk11 68/160 / test_empty_blob
FAILED:  dtest-upgrade-novnode.upgrade_tests.cql_tests.TestCQLNodes3RF3_Upgrade_current_6_0_x_To_indev_6_0_x.Tests / dtest-upgrade-novnode jdk11 77/160 / test_empty_in
FAILED:  dtest-upgrade-novnode.upgrade_tests.cql_tests.TestCQLNodes3RF3_Upgrade_current_6_0_x_To_indev_6_0_x.Tests / dtest-upgrade-novnode jdk11 119/160 / test_end_of_component_uses_oecBound
FAILED:  dtest-upgrade-novnode.upgrade_tests.cql_tests.TestCQLNodes3RF3_Upgrade_current_6_0_x_To_indev_6_0_x.Tests / dtest-upgrade-novnode jdk11 159/160 / test_exclusive_slice
FAILED:  dtest-upgrade-novnode.upgrade_tests.cql_tests.TestCQLNodes3RF3_Upgrade_current_6_0_x_To_indev_6_0_x.Tests / dtest-upgrade-novnode jdk11 107/160 / test_expanded_list_item_conditional
FAILED:  dtest-upgrade-novnode.upgrade_tests.cql_tests.TestCQLNodes3RF3_Upgrade_current_6_0_x_To_indev_6_0_x.Tests / dtest-upgrade-novnode jdk11 111/160 / test_expanded_map_item_conditional
FAILED:  dtest-upgrade-novnode.upgrade_tests.cql_tests.TestCQLNodes3RF3_Upgrade_current_6_0_x_To_indev_6_0_x.Tests / dtest-upgrade-novnode jdk11 81/160 / test_function_with_null
FAILED:  dtest-upgrade-novnode.upgrade_tests.cql_tests.TestCQLNodes3RF3_Upgrade_current_6_0_x_To_indev_6_0_x.Tests / dtest-upgrade-novnode jdk11 160/160 / test_in_clause_wide_rows
FAILED:  dtest-upgrade-novnode.upgrade_tests.cql_tests.TestCQLNodes3RF3_Upgrade_current_6_0_x_To_indev_6_0_x.Tests / dtest-upgrade-novnode jdk11 103/160 / test_in_order_by_without_selecting
FAILED:  dtest-upgrade-novnode.upgrade_tests.cql_tests.TestCQLNodes3RF3_Upgrade_current_6_0_x_To_indev_6_0_x.Tests / dtest-upgrade-novnode jdk11 157/160 / test_indexed_with_eq
FAILED:  dtest-upgrade-novnode.upgrade_tests.cql_tests.TestCQLNodes3RF3_Upgrade_current_6_0_x_To_indev_6_0_x.Tests / dtest-upgrade-novnode jdk11 37/160 / test_indexes_composite
FAILED:  dtest-upgrade-novnode.upgrade_tests.cql_tests.TestCQLNodes3RF3_Upgrade_current_6_0_x_To_indev_6_0_x.Tests / dtest-upgrade-novnode jdk11 83/160 / test_internal_application_error_on_select
FAILED:  dtest-upgrade-novnode.upgrade_tests.cql_tests.TestCQLNodes3RF3_Upgrade_current_6_0_x_To_indev_6_0_x.Tests / dtest-upgrade-novnode jdk11 89/160 / test_intersection_logic_returns_empty_result
FAILED:  dtest-upgrade-novnode.upgrade_tests.cql_tests.TestCQLNodes3RF3_Upgrade_current_6_0_x_To_indev_6_0_x.Tests / dtest-upgrade-novnode jdk11 117/160 / test_invalid_custom_timestamp
FAILED:  dtest-upgrade-novnode.upgrade_tests.cql_tests.TestCQLNodes3RF3_Upgrade_current_6_0_x_To_indev_6_0_x.Tests / dtest-upgrade-novnode jdk11 116/160 / test_key_index_with_reverse_clustering
FAILED:  dtest-upgrade-novnode.upgrade_tests.cql_tests.TestCQLNodes3RF3_Upgrade_current_6_0_x_To_indev_6_0_x.Tests / dtest-upgrade-novnode jdk11 90/160 / test_large_count
FAILED:  dtest-upgrade-novnode.upgrade_tests.cql_tests.TestCQLNodes3RF3_Upgrade_current_6_0_x_To_indev_6_0_x.Tests / dtest-upgrade-novnode jdk11 115/160 / test_limit_compact_table
FAILED:  dtest-upgrade-novnode.upgrade_tests.cql_tests.TestCQLNodes3RF3_Upgrade_current_6_0_x_To_indev_6_0_x.Tests / dtest-upgrade-novnode jdk11 153/160 / test_limit_multiget
FAILED:  dtest-upgrade-novnode.upgrade_tests.cql_tests.TestCQLNodes3RF3_Upgrade_current_6_0_x_To_indev_6_0_x.Tests / dtest-upgrade-novnode jdk11 152/160 / test_limit_ranges
FAILED:  dtest-upgrade-novnode.upgrade_tests.cql_tests.TestCQLNodes3RF3_Upgrade_current_6_0_x_To_indev_6_0_x.Tests / dtest-upgrade-novnode jdk11 155/160 / test_limit_sparse
FAILED:  dtest-upgrade-novnode.upgrade_tests.cql_tests.TestCQLNodes3RF3_Upgrade_current_6_0_x_To_indev_6_0_x.Tests / dtest-upgrade-novnode jdk11 106/160 / test_list_item_conditional
FAILED:  dtest-upgrade-novnode.upgrade_tests.cql_tests.TestCQLNodes3RF3_Upgrade_current_6_0_x_To_indev_6_0_x.Tests / dtest-upgrade-novnode jdk11 110/160 / test_map_item_conditional
FAILED:  dtest-upgrade-novnode.upgrade_tests.cql_tests.TestCQLNodes3RF3_Upgrade_current_6_0_x_To_indev_6_0_x.Tests / dtest-upgrade-novnode jdk11 92/160 / test_map_keys_indexing
FAILED:  dtest-upgrade-novnode.upgrade_tests.cql_tests.TestCQLNodes3RF3_Upgrade_current_6_0_x_To_indev_6_0_x.Tests / dtest-upgrade-novnode jdk11 133/160 / test_materialized_view_simple
FAILED:  dtest-upgrade-novnode.upgrade_tests.cql_tests.TestCQLNodes3RF3_Upgrade_current_6_0_x_To_indev_6_0_x.Tests / dtest-upgrade-novnode jdk11 88/160 / test_more_user_types
FAILED:  dtest-upgrade-novnode.upgrade_tests.cql_tests.TestCQLNodes3RF3_Upgrade_current_6_0_x_To_indev_6_0_x.Tests / dtest-upgrade-novnode jdk11 46/160 / test_multi_list_set
FAILED:  dtest-upgrade-novnode.upgrade_tests.cql_tests.TestCQLNodes3RF3_Upgrade_current_6_0_x_To_indev_6_0_x.Tests / dtest-upgrade-novnode jdk11 44/160 / test_multiordering
FAILED:  dtest-upgrade-novnode.upgrade_tests.cql_tests.TestCQLNodes3RF3_Upgrade_current_6_0_x_To_indev_6_0_x.Tests / dtest-upgrade-novnode jdk11 93/160 / test_nan_infinity
FAILED:  dtest-upgrade-novnode.upgrade_tests.cql_tests.TestCQLNodes3RF3_Upgrade_current_6_0_x_To_indev_6_0_x.Tests / dtest-upgrade-novnode jdk11 123/160 / test_negative_timestamp
FAILED:  dtest-upgrade-novnode.upgrade_tests.cql_tests.TestCQLNodes3RF3_Upgrade_current_6_0_x_To_indev_6_0_x.Tests / dtest-upgrade-novnode jdk11 72/160 / test_non_eq_conditional_update
FAILED:  dtest-upgrade-novnode.upgrade_tests.cql_tests.TestCQLNodes3RF3_Upgrade_current_6_0_x_To_indev_6_0_x.Tests / dtest-upgrade-novnode jdk11 148/160 / test_noncomposite_static_cf
FAILED:  dtest-upgrade-novnode.upgrade_tests.cql_tests.TestCQLNodes3RF3_Upgrade_current_6_0_x_To_indev_6_0_x.Tests / dtest-upgrade-novnode jdk11 76/160 / test_nonpure_function_collection
FAILED:  dtest-upgrade-novnode.upgrade_tests.cql_tests.TestCQLNodes3RF3_Upgrade_current_6_0_x_To_indev_6_0_x.Tests / dtest-upgrade-novnode jdk11 34/160 / test_npe_composite_table_slice
FAILED:  dtest-upgrade-novnode.upgrade_tests.cql_tests.TestCQLNodes3RF3_Upgrade_current_6_0_x_To_indev_6_0_x.Tests / dtest-upgrade-novnode jdk11 74/160 / test_range_key_ordered
FAILED:  dtest-upgrade-novnode.upgrade_tests.cql_tests.TestCQLNodes3RF3_Upgrade_current_6_0_x_To_indev_6_0_x.Tests / dtest-upgrade-novnode jdk11 49/160 / test_range_with_deletes
FAILED:  dtest-upgrade-novnode.upgrade_tests.cql_tests.TestCQLNodes3RF3_Upgrade_current_6_0_x_To_indev_6_0_x.Tests / dtest-upgrade-novnode jdk11 38/160 / test_refuse_in_with_indexes
FAILED:  dtest-upgrade-novnode.upgrade_tests.cql_tests.TestCQLNodes3RF3_Upgrade_current_6_0_x_To_indev_6_0_x.Tests / dtest-upgrade-novnode jdk11 98/160 / test_select_count_paging
FAILED:  dtest-upgrade-novnode.upgrade_tests.cql_tests.TestCQLNodes3RF3_Upgrade_current_6_0_x_To_indev_6_0_x.Tests / dtest-upgrade-novnode jdk11 79/160 / test_select_distinct
FAILED:  dtest-upgrade-novnode.upgrade_tests.cql_tests.TestCQLNodes3RF3_Upgrade_current_6_0_x_To_indev_6_0_x.Tests / dtest-upgrade-novnode jdk11 80/160 / test_select_distinct_with_deletions
FAILED:  dtest-upgrade-novnode.upgrade_tests.cql_tests.TestCQLNodes3RF3_Upgrade_current_6_0_x_To_indev_6_0_x.Tests / dtest-upgrade-novnode jdk11 75/160 / test_select_with_alias
FAILED:  dtest-upgrade-novnode.upgrade_tests.cql_tests.TestCQLNodes3RF3_Upgrade_current_6_0_x_To_indev_6_0_x.Tests / dtest-upgrade-novnode jdk11 154/160 / test_simple_tuple_query
FAILED:  dtest-upgrade-novnode.upgrade_tests.cql_tests.TestCQLNodes3RF3_Upgrade_current_6_0_x_To_indev_6_0_x.Tests / dtest-upgrade-novnode jdk11 151/160 / test_sparse_cf
FAILED:  dtest-upgrade-novnode.upgrade_tests.cql_tests.TestCQLNodes3RF3_Upgrade_current_6_0_x_To_indev_6_0_x.Tests / dtest-upgrade-novnode jdk11 146/160 / test_static_cf
FAILED:  dtest-upgrade-novnode.upgrade_tests.cql_tests.TestCQLNodes3RF3_Upgrade_current_6_0_x_To_indev_6_0_x.Tests / dtest-upgrade-novnode jdk11 94/160 / test_static_columns
FAILED:  dtest-upgrade-novnode.upgrade_tests.cql_tests.TestCQLNodes3RF3_Upgrade_current_6_0_x_To_indev_6_0_x.Tests / dtest-upgrade-novnode jdk11 95/160 / test_static_columns_cas
FAILED:  dtest-upgrade-novnode.upgrade_tests.cql_tests.TestCQLNodes3RF3_Upgrade_current_6_0_x_To_indev_6_0_x.Tests / dtest-upgrade-novnode jdk11 96/160 / test_static_columns_with_2i
FAILED:  dtest-upgrade-novnode.upgrade_tests.cql_tests.TestCQLNodes3RF3_Upgrade_current_6_0_x_To_indev_6_0_x.Tests / dtest-upgrade-novnode jdk11 97/160 / test_static_columns_with_distinct
FAILED:  dtest-upgrade-novnode.upgrade_tests.cql_tests.TestCQLNodes3RF3_Upgrade_current_6_0_x_To_indev_6_0_x.Tests / dtest-upgrade-novnode jdk11 113/160 / test_static_with_limit
FAILED:  dtest-upgrade-novnode.upgrade_tests.cql_tests.TestCQLNodes3RF3_Upgrade_current_6_0_x_To_indev_6_0_x.Tests / dtest-upgrade-novnode jdk11 84/160 / test_store_sets_with_if_not_exists
FAILED:  dtest-upgrade-novnode.upgrade_tests.cql_tests.TestCQLNodes3RF3_Upgrade_current_6_0_x_To_indev_6_0_x.Tests / dtest-upgrade-novnode jdk11 132/160 / test_tracing_prevents_startup_after_upgrading
FAILED:  dtest-upgrade-novnode.upgrade_tests.cql_tests.TestCQLNodes3RF3_Upgrade_current_6_0_x_To_indev_6_0_x.Tests / dtest-upgrade-novnode jdk11 100/160 / test_tuple_notation
FAILED:  dtest-upgrade-novnode.upgrade_tests.cql_tests.TestCQLNodes3RF3_Upgrade_current_6_0_x_To_indev_6_0_x.Tests / dtest-upgrade-novnode jdk11 87/160 / test_user_types
FAILED:  dtest-upgrade-novnode.upgrade_tests.cql_tests.TestCQLNodes3RF3_Upgrade_current_6_0_x_To_indev_6_0_x.Tests / dtest-upgrade-novnode jdk11 105/160 / test_whole_list_conditional
FAILED:  dtest-upgrade-novnode.upgrade_tests.cql_tests.TestCQLNodes3RF3_Upgrade_current_6_0_x_To_indev_6_0_x.Tests / dtest-upgrade-novnode jdk11 109/160 / test_whole_map_conditional
FAILED:  dtest-upgrade-novnode.upgrade_tests.cql_tests.TestCQLNodes3RF3_Upgrade_current_6_0_x_To_indev_6_0_x.Tests / dtest-upgrade-novnode jdk11 108/160 / test_whole_set_conditional
... and 217 other failed tests.

  -------------------------------------------------------------------------------
  For complete test report and logs see https://nightlies.apache.org/cassandra/Cassandra-6.0/5/