You are viewing a plain text version of this content. The canonical link for it is here.
Posted to builds@mesos.apache.org by Apache Jenkins Server <je...@builds.apache.org> on 2017/10/05 14:39:33 UTC

Build failed in Jenkins: Mesos-Buildbot » autotools,gcc,--verbose --disable-libtool-wrapper --enable-libevent --enable-ssl,GLOG_v=1 MESOS_VERBOSE=1,ubuntu:14.04,(ubuntu)&&(!ubuntu-us1)&&(!ubuntu-eu2)&&(!qnode3)&&(!H23) #4287

See <https://builds.apache.org/job/Mesos-Buildbot/BUILDTOOL=autotools,COMPILER=gcc,CONFIGURATION=--verbose%20--disable-libtool-wrapper%20--enable-libevent%20--enable-ssl,ENVIRONMENT=GLOG_v=1%20MESOS_VERBOSE=1,OS=ubuntu%3A14.04,label_exp=(ubuntu)&&(!ubuntu-us1)&&(!ubuntu-eu2)&&(!qnode3)&&(!H23)/4287/display/redirect?page=changes>

Changes:

[klueska] Added helper functions for linters using a virtual environment.

------------------------------------------
[...truncated 33.46 MB...]
I1005 14:39:24.742535 30310 slave.cpp:254] Mesos agent started on (827)@172.17.0.2:46758
I1005 14:39:24.742563 30310 slave.cpp:255] Flags at startup: --acls="" --appc_simple_discovery_uri_prefix="http://" --appc_store_dir="/tmp/Endpoint_SlaveEndpointTest_UnauthorizedRequest_0_p22VA6/store/appc" --authenticate_http_executors="true" --authenticate_http_readonly="true" --authenticate_http_readwrite="true" --authenticatee="crammd5" --authentication_backoff_factor="1secs" --authorizer="local" --cgroups_cpu_enable_pids_and_tids_count="false" --cgroups_enable_cfs="false" --cgroups_hierarchy="/sys/fs/cgroup" --cgroups_limit_swap="false" --cgroups_root="mesos" --container_disk_watch_interval="15secs" --containerizers="mesos" --credential="/tmp/Endpoint_SlaveEndpointTest_UnauthorizedRequest_0_p22VA6/credential" --default_role="*" --disallow_sharing_agent_pid_namespace="false" --disk_watch_interval="1mins" --docker="docker" --docker_kill_orphans="true" --docker_registry="https://registry-1.docker.io" --docker_remove_delay="6hrs" --docker_socket="/var/run/docker.sock" --docker_stop_timeout="0ns" --docker_store_dir="/tmp/Endpoint_SlaveEndpointTest_UnauthorizedRequest_0_p22VA6/store/docker" --docker_volume_checkpoint_dir="/var/run/mesos/isolators/docker/volume" --enforce_container_disk_quota="false" --executor_registration_timeout="1mins" --executor_reregistration_timeout="2secs" --executor_secret_key="/tmp/Endpoint_SlaveEndpointTest_UnauthorizedRequest_0_p22VA6/executor_secret_key" --executor_shutdown_grace_period="5secs" --fetcher_cache_dir="/tmp/Endpoint_SlaveEndpointTest_UnauthorizedRequest_0_p22VA6/fetch" --fetcher_cache_size="2GB" --frameworks_home="" --gc_delay="1weeks" --gc_disk_headroom="0.1" --hadoop_home="" --help="false" --hostname_lookup="true" --http_command_executor="false" --http_credentials="/tmp/Endpoint_SlaveEndpointTest_UnauthorizedRequest_0_p22VA6/http_credentials" --http_heartbeat_interval="30secs" --initialize_driver_logging="true" --isolation="posix/cpu,posix/mem" --launcher="posix" --launcher_dir="/mesos/mesos-1.5.0/_build/src" --logbufsecs="0" --logging_level="INFO" --max_completed_executors_per_framework="150" --oversubscribed_resources_interval="15secs" --perf_duration="10secs" --perf_interval="1mins" --port="5051" --qos_correction_interval_min="0ns" --quiet="false" --recover="reconnect" --recovery_timeout="15mins" --registration_backoff_factor="10ms" --resources="cpus:2;gpus:0;mem:1024;disk:1024;ports:[31000-32000]" --revocable_cpu_low_priority="true" --runtime_dir="/tmp/Endpoint_SlaveEndpointTest_UnauthorizedRequest_0_p22VA6" --sandbox_directory="/mnt/mesos/sandbox" --strict="true" --switch_user="true" --systemd_enable_support="true" --systemd_runtime_directory="/run/systemd/system" --version="false" --work_dir="/tmp/Endpoint_SlaveEndpointTest_UnauthorizedRequest_0_Ao6lYK" --zk_session_timeout="10secs"
I1005 14:39:24.743156 30310 credentials.hpp:86] Loading credential for authentication from '/tmp/Endpoint_SlaveEndpointTest_UnauthorizedRequest_0_p22VA6/credential'
I1005 14:39:24.743345 30310 slave.cpp:287] Agent using credential for: test-principal
I1005 14:39:24.743372 30310 credentials.hpp:37] Loading credentials for authentication from '/tmp/Endpoint_SlaveEndpointTest_UnauthorizedRequest_0_p22VA6/http_credentials'
I1005 14:39:24.743713 30310 http.cpp:1045] Creating default 'basic' HTTP authenticator for realm 'mesos-agent-executor'
I1005 14:39:24.743820 30310 http.cpp:1066] Creating default 'jwt' HTTP authenticator for realm 'mesos-agent-executor'
I1005 14:39:24.743999 30310 http.cpp:1045] Creating default 'basic' HTTP authenticator for realm 'mesos-agent-readonly'
I1005 14:39:24.744087 30310 http.cpp:1066] Creating default 'jwt' HTTP authenticator for realm 'mesos-agent-readonly'
I1005 14:39:24.744254 30310 http.cpp:1045] Creating default 'basic' HTTP authenticator for realm 'mesos-agent-readwrite'
I1005 14:39:24.744364 30310 http.cpp:1066] Creating default 'jwt' HTTP authenticator for realm 'mesos-agent-readwrite'
I1005 14:39:24.745687 30310 slave.cpp:585] Agent resources: [{"name":"cpus","scalar":{"value":2.0},"type":"SCALAR"},{"name":"mem","scalar":{"value":1024.0},"type":"SCALAR"},{"name":"disk","scalar":{"value":1024.0},"type":"SCALAR"},{"name":"ports","ranges":{"range":[{"begin":31000,"end":32000}]},"type":"RANGES"}]
I1005 14:39:24.745896 30310 slave.cpp:593] Agent attributes: [  ]
I1005 14:39:24.745909 30310 slave.cpp:602] Agent hostname: bfc101a8da67
I1005 14:39:24.746018 30308 status_update_manager.cpp:177] Pausing sending status updates
I1005 14:39:24.747334 30319 state.cpp:64] Recovering state from '/tmp/Endpoint_SlaveEndpointTest_UnauthorizedRequest_0_Ao6lYK/meta'
I1005 14:39:24.747581 30312 status_update_manager.cpp:203] Recovering status update manager
I1005 14:39:24.747746 30314 containerizer.cpp:648] Recovering containerizer
I1005 14:39:24.748798 30328 provisioner.cpp:416] Provisioner recovery complete
I1005 14:39:24.749053 30324 slave.cpp:6310] Finished recovery
I1005 14:39:24.749445 30324 slave.cpp:6492] Querying resource estimator for oversubscribable resources
I1005 14:39:24.749653 30312 slave.cpp:6506] Received oversubscribable resources {} from the resource estimator
I1005 14:39:24.751340 30329 process.cpp:3929] Handling HTTP event for process 'slave(827)' with path: '/slave(827)/monitor/statistics'
I1005 14:39:24.752688 30328 http.cpp:1185] HTTP GET for /slave(827)/monitor/statistics from 172.17.0.2:34458
I1005 14:39:24.752745 30328 http.cpp:976] Authorizing principal 'test-principal' to GET the '/monitor/statistics' endpoint
I1005 14:39:24.754401 30318 slave.cpp:869] Agent terminating
[       OK ] Endpoint/SlaveEndpointTest.UnauthorizedRequest/0 (24 ms)
[ RUN      ] Endpoint/SlaveEndpointTest.UnauthorizedRequest/1
I1005 14:39:24.763479  8719 containerizer.cpp:292] Using isolation { environment_secret, posix/cpu, posix/mem, filesystem/posix, network/cni }
W1005 14:39:24.764058  8719 backend.cpp:76] Failed to create 'aufs' backend: AufsBackend requires root privileges
W1005 14:39:24.764164  8719 backend.cpp:76] Failed to create 'bind' backend: BindBackend requires root privileges
I1005 14:39:24.764199  8719 provisioner.cpp:255] Using default backend 'copy'
I1005 14:39:24.767693 30320 slave.cpp:254] Mesos agent started on (828)@172.17.0.2:46758
I1005 14:39:24.767711 30320 slave.cpp:255] Flags at startup: --acls="" --appc_simple_discovery_uri_prefix="http://" --appc_store_dir="/tmp/Endpoint_SlaveEndpointTest_UnauthorizedRequest_1_cAuOhv/store/appc" --authenticate_http_executors="true" --authenticate_http_readonly="true" --authenticate_http_readwrite="true" --authenticatee="crammd5" --authentication_backoff_factor="1secs" --authorizer="local" --cgroups_cpu_enable_pids_and_tids_count="false" --cgroups_enable_cfs="false" --cgroups_hierarchy="/sys/fs/cgroup" --cgroups_limit_swap="false" --cgroups_root="mesos" --container_disk_watch_interval="15secs" --containerizers="mesos" --credential="/tmp/Endpoint_SlaveEndpointTest_UnauthorizedRequest_1_cAuOhv/credential" --default_role="*" --disallow_sharing_agent_pid_namespace="false" --disk_watch_interval="1mins" --docker="docker" --docker_kill_orphans="true" --docker_registry="https://registry-1.docker.io" --docker_remove_delay="6hrs" --docker_socket="/var/run/docker.sock" --docker_stop_timeout="0ns" --docker_store_dir="/tmp/Endpoint_SlaveEndpointTest_UnauthorizedRequest_1_cAuOhv/store/docker" --docker_volume_checkpoint_dir="/var/run/mesos/isolators/docker/volume" --enforce_container_disk_quota="false" --executor_registration_timeout="1mins" --executor_reregistration_timeout="2secs" --executor_secret_key="/tmp/Endpoint_SlaveEndpointTest_UnauthorizedRequest_1_cAuOhv/executor_secret_key" --executor_shutdown_grace_period="5secs" --fetcher_cache_dir="/tmp/Endpoint_SlaveEndpointTest_UnauthorizedRequest_1_cAuOhv/fetch" --fetcher_cache_size="2GB" --frameworks_home="" --gc_delay="1weeks" --gc_disk_headroom="0.1" --hadoop_home="" --help="false" --hostname_lookup="true" --http_command_executor="false" --http_credentials="/tmp/Endpoint_SlaveEndpointTest_UnauthorizedRequest_1_cAuOhv/http_credentials" --http_heartbeat_interval="30secs" --initialize_driver_logging="true" --isolation="posix/cpu,posix/mem" --launcher="posix" --launcher_dir="/mesos/mesos-1.5.0/_build/src" --logbufsecs="0" --logging_level="INFO" --max_completed_executors_per_framework="150" --oversubscribed_resources_interval="15secs" --perf_duration="10secs" --perf_interval="1mins" --port="5051" --qos_correction_interval_min="0ns" --quiet="false" --recover="reconnect" --recovery_timeout="15mins" --registration_backoff_factor="10ms" --resources="cpus:2;gpus:0;mem:1024;disk:1024;ports:[31000-32000]" --revocable_cpu_low_priority="true" --runtime_dir="/tmp/Endpoint_SlaveEndpointTest_UnauthorizedRequest_1_cAuOhv" --sandbox_directory="/mnt/mesos/sandbox" --strict="true" --switch_user="true" --systemd_enable_support="true" --systemd_runtime_directory="/run/systemd/system" --version="false" --work_dir="/tmp/Endpoint_SlaveEndpointTest_UnauthorizedRequest_1_zepAB9" --zk_session_timeout="10secs"
I1005 14:39:24.768041 30320 credentials.hpp:86] Loading credential for authentication from '/tmp/Endpoint_SlaveEndpointTest_UnauthorizedRequest_1_cAuOhv/credential'
I1005 14:39:24.768173 30320 slave.cpp:287] Agent using credential for: test-principal
I1005 14:39:24.768196 30320 credentials.hpp:37] Loading credentials for authentication from '/tmp/Endpoint_SlaveEndpointTest_UnauthorizedRequest_1_cAuOhv/http_credentials'
I1005 14:39:24.768447 30320 http.cpp:1045] Creating default 'basic' HTTP authenticator for realm 'mesos-agent-executor'
I1005 14:39:24.768551 30320 http.cpp:1066] Creating default 'jwt' HTTP authenticator for realm 'mesos-agent-executor'
I1005 14:39:24.768724 30320 http.cpp:1045] Creating default 'basic' HTTP authenticator for realm 'mesos-agent-readonly'
I1005 14:39:24.768815 30320 http.cpp:1066] Creating default 'jwt' HTTP authenticator for realm 'mesos-agent-readonly'
I1005 14:39:24.768980 30320 http.cpp:1045] Creating default 'basic' HTTP authenticator for realm 'mesos-agent-readwrite'
I1005 14:39:24.769069 30320 http.cpp:1066] Creating default 'jwt' HTTP authenticator for realm 'mesos-agent-readwrite'
I1005 14:39:24.770264 30320 slave.cpp:585] Agent resources: [{"name":"cpus","scalar":{"value":2.0},"type":"SCALAR"},{"name":"mem","scalar":{"value":1024.0},"type":"SCALAR"},{"name":"disk","scalar":{"value":1024.0},"type":"SCALAR"},{"name":"ports","ranges":{"range":[{"begin":31000,"end":32000}]},"type":"RANGES"}]
I1005 14:39:24.770488 30320 slave.cpp:593] Agent attributes: [  ]
I1005 14:39:24.770509 30320 slave.cpp:602] Agent hostname: bfc101a8da67
I1005 14:39:24.770619 30316 status_update_manager.cpp:177] Pausing sending status updates
I1005 14:39:24.771822 30308 state.cpp:64] Recovering state from '/tmp/Endpoint_SlaveEndpointTest_UnauthorizedRequest_1_zepAB9/meta'
I1005 14:39:24.772039 30308 status_update_manager.cpp:203] Recovering status update manager
I1005 14:39:24.772183 30327 containerizer.cpp:648] Recovering containerizer
I1005 14:39:24.773182 30317 provisioner.cpp:416] Provisioner recovery complete
I1005 14:39:24.773448 30316 slave.cpp:6310] Finished recovery
I1005 14:39:24.773824 30316 slave.cpp:6492] Querying resource estimator for oversubscribable resources
I1005 14:39:24.774029 30328 slave.cpp:6506] Received oversubscribable resources {} from the resource estimator
I1005 14:39:24.775595 30318 process.cpp:3929] Handling HTTP event for process 'slave(828)' with path: '/slave(828)/monitor/statistics.json'
I1005 14:39:24.776963 30322 http.cpp:1185] HTTP GET for /slave(828)/monitor/statistics.json from 172.17.0.2:34460
I1005 14:39:24.777017 30322 http.cpp:976] Authorizing principal 'test-principal' to GET the '/monitor/statistics.json' endpoint
I1005 14:39:24.778378 30321 slave.cpp:869] Agent terminating
[       OK ] Endpoint/SlaveEndpointTest.UnauthorizedRequest/1 (23 ms)
[ RUN      ] Endpoint/SlaveEndpointTest.UnauthorizedRequest/2
I1005 14:39:24.787384  8719 containerizer.cpp:292] Using isolation { environment_secret, posix/cpu, posix/mem, filesystem/posix, network/cni }
W1005 14:39:24.787792  8719 backend.cpp:76] Failed to create 'aufs' backend: AufsBackend requires root privileges
W1005 14:39:24.787891  8719 backend.cpp:76] Failed to create 'bind' backend: BindBackend requires root privileges
I1005 14:39:24.787935  8719 provisioner.cpp:255] Using default backend 'copy'
I1005 14:39:24.790874 30326 slave.cpp:254] Mesos agent started on (829)@172.17.0.2:46758
I1005 14:39:24.790891 30326 slave.cpp:255] Flags at startup: --acls="" --appc_simple_discovery_uri_prefix="http://" --appc_store_dir="/tmp/Endpoint_SlaveEndpointTest_UnauthorizedRequest_2_Oil1cU/store/appc" --authenticate_http_executors="true" --authenticate_http_readonly="true" --authenticate_http_readwrite="true" --authenticatee="crammd5" --authentication_backoff_factor="1secs" --authorizer="local" --cgroups_cpu_enable_pids_and_tids_count="false" --cgroups_enable_cfs="false" --cgroups_hierarchy="/sys/fs/cgroup" --cgroups_limit_swap="false" --cgroups_root="mesos" --container_disk_watch_interval="15secs" --containerizers="mesos" --credential="/tmp/Endpoint_SlaveEndpointTest_UnauthorizedRequest_2_Oil1cU/credential" --default_role="*" --disallow_sharing_agent_pid_namespace="false" --disk_watch_interval="1mins" --docker="docker" --docker_kill_orphans="true" --docker_registry="https://registry-1.docker.io" --docker_remove_delay="6hrs" --docker_socket="/var/run/docker.sock" --docker_stop_timeout="0ns" --docker_store_dir="/tmp/Endpoint_SlaveEndpointTest_UnauthorizedRequest_2_Oil1cU/store/docker" --docker_volume_checkpoint_dir="/var/run/mesos/isolators/docker/volume" --enforce_container_disk_quota="false" --executor_registration_timeout="1mins" --executor_reregistration_timeout="2secs" --executor_secret_key="/tmp/Endpoint_SlaveEndpointTest_UnauthorizedRequest_2_Oil1cU/executor_secret_key" --executor_shutdown_grace_period="5secs" --fetcher_cache_dir="/tmp/Endpoint_SlaveEndpointTest_UnauthorizedRequest_2_Oil1cU/fetch" --fetcher_cache_size="2GB" --frameworks_home="" --gc_delay="1weeks" --gc_disk_headroom="0.1" --hadoop_home="" --help="false" --hostname_lookup="true" --http_command_executor="false" --http_credentials="/tmp/Endpoint_SlaveEndpointTest_UnauthorizedRequest_2_Oil1cU/http_credentials" --http_heartbeat_interval="30secs" --initialize_driver_logging="true" --isolation="posix/cpu,posix/mem" --launcher="posix" --launcher_dir="/mesos/mesos-1.5.0/_build/src" --logbufsecs="0" --logging_level="INFO" --max_completed_executors_per_framework="150" --oversubscribed_resources_interval="15secs" --perf_duration="10secs" --perf_interval="1mins" --port="5051" --qos_correction_interval_min="0ns" --quiet="false" --recover="reconnect" --recovery_timeout="15mins" --registration_backoff_factor="10ms" --resources="cpus:2;gpus:0;mem:1024;disk:1024;ports:[31000-32000]" --revocable_cpu_low_priority="true" --runtime_dir="/tmp/Endpoint_SlaveEndpointTest_UnauthorizedRequest_2_Oil1cU" --sandbox_directory="/mnt/mesos/sandbox" --strict="true" --switch_user="true" --systemd_enable_support="true" --systemd_runtime_directory="/run/systemd/system" --version="false" --work_dir="/tmp/Endpoint_SlaveEndpointTest_UnauthorizedRequest_2_846dty" --zk_session_timeout="10secs"
I1005 14:39:24.791219 30326 credentials.hpp:86] Loading credential for authentication from '/tmp/Endpoint_SlaveEndpointTest_UnauthorizedRequest_2_Oil1cU/credential'
I1005 14:39:24.791359 30326 slave.cpp:287] Agent using credential for: test-principal
I1005 14:39:24.791378 30326 credentials.hpp:37] Loading credentials for authentication from '/tmp/Endpoint_SlaveEndpointTest_UnauthorizedRequest_2_Oil1cU/http_credentials'
I1005 14:39:24.791615 30326 http.cpp:1045] Creating default 'basic' HTTP authenticator for realm 'mesos-agent-executor'
I1005 14:39:24.791718 30326 http.cpp:1066] Creating default 'jwt' HTTP authenticator for realm 'mesos-agent-executor'
I1005 14:39:24.791882 30326 http.cpp:1045] Creating default 'basic' HTTP authenticator for realm 'mesos-agent-readonly'
I1005 14:39:24.791971 30326 http.cpp:1066] Creating default 'jwt' HTTP authenticator for realm 'mesos-agent-readonly'
I1005 14:39:24.792129 30326 http.cpp:1045] Creating default 'basic' HTTP authenticator for realm 'mesos-agent-readwrite'
I1005 14:39:24.792213 30326 http.cpp:1066] Creating default 'jwt' HTTP authenticator for realm 'mesos-agent-readwrite'
I1005 14:39:24.793421 30326 slave.cpp:585] Agent resources: [{"name":"cpus","scalar":{"value":2.0},"type":"SCALAR"},{"name":"mem","scalar":{"value":1024.0},"type":"SCALAR"},{"name":"disk","scalar":{"value":1024.0},"type":"SCALAR"},{"name":"ports","ranges":{"range":[{"begin":31000,"end":32000}]},"type":"RANGES"}]
I1005 14:39:24.793632 30326 slave.cpp:593] Agent attributes: [  ]
I1005 14:39:24.793643 30326 slave.cpp:602] Agent hostname: bfc101a8da67
I1005 14:39:24.793789 30310 status_update_manager.cpp:177] Pausing sending status updates
I1005 14:39:24.794955 30329 state.cpp:64] Recovering state from '/tmp/Endpoint_SlaveEndpointTest_UnauthorizedRequest_2_846dty/meta'
I1005 14:39:24.795181 30325 status_update_manager.cpp:203] Recovering status update manager
I1005 14:39:24.795354 30323 containerizer.cpp:648] Recovering containerizer
I1005 14:39:24.796339 30308 provisioner.cpp:416] Provisioner recovery complete
I1005 14:39:24.796628 30310 slave.cpp:6310] Finished recovery
I1005 14:39:24.797003 30310 slave.cpp:6492] Querying resource estimator for oversubscribable resources
I1005 14:39:24.797221 30322 slave.cpp:6506] Received oversubscribable resources {} from the resource estimator
I1005 14:39:24.798795 30316 process.cpp:3929] Handling HTTP event for process 'slave(829)' with path: '/slave(829)/containers'
I1005 14:39:24.800168 30330 http.cpp:1185] HTTP GET for /slave(829)/containers from 172.17.0.2:34462
I1005 14:39:24.800225 30330 http.cpp:976] Authorizing principal 'test-principal' to GET the '/containers' endpoint
I1005 14:39:24.801573 30314 slave.cpp:869] Agent terminating
[       OK ] Endpoint/SlaveEndpointTest.UnauthorizedRequest/2 (23 ms)
[ RUN      ] Endpoint/SlaveEndpointTest.NoAuthorizer/0
I1005 14:39:24.810987  8719 containerizer.cpp:292] Using isolation { environment_secret, posix/cpu, posix/mem, filesystem/posix, network/cni }
W1005 14:39:24.811390  8719 backend.cpp:76] Failed to create 'aufs' backend: AufsBackend requires root privileges
W1005 14:39:24.811496  8719 backend.cpp:76] Failed to create 'bind' backend: BindBackend requires root privileges
I1005 14:39:24.811535  8719 provisioner.cpp:255] Using default backend 'copy'
I1005 14:39:24.812937  8719 cluster.cpp:448] Creating default 'local' authorizer
I1005 14:39:24.814652 30328 slave.cpp:254] Mesos agent started on (830)@172.17.0.2:46758
I1005 14:39:24.814677 30328 slave.cpp:255] Flags at startup: --acls="" --appc_simple_discovery_uri_prefix="http://" --appc_store_dir="/tmp/Endpoint_SlaveEndpointTest_NoAuthorizer_0_jYG7lj/store/appc" --authenticate_http_executors="true" --authenticate_http_readonly="true" --authenticate_http_readwrite="true" --authenticatee="crammd5" --authentication_backoff_factor="1secs" --authorizer="local" --cgroups_cpu_enable_pids_and_tids_count="false" --cgroups_enable_cfs="false" --cgroups_hierarchy="/sys/fs/cgroup" --cgroups_limit_swap="false" --cgroups_root="mesos" --container_disk_watch_interval="15secs" --containerizers="mesos" --credential="/tmp/Endpoint_SlaveEndpointTest_NoAuthorizer_0_jYG7lj/credential" --default_role="*" --disallow_sharing_agent_pid_namespace="false" --disk_watch_interval="1mins" --docker="docker" --docker_kill_orphans="true" --docker_registry="https://registry-1.docker.io" --docker_remove_delay="6hrs" --docker_socket="/var/run/docker.sock" --docker_stop_timeout="0ns" --docker_store_dir="/tmp/Endpoint_SlaveEndpointTest_NoAuthorizer_0_jYG7lj/store/docker" --docker_volume_checkpoint_dir="/var/run/mesos/isolators/docker/volume" --enforce_container_disk_quota="false" --executor_registration_timeout="1mins" --executor_reregistration_timeout="2secs" --executor_secret_key="/tmp/Endpoint_SlaveEndpointTest_NoAuthorizer_0_jYG7lj/executor_secret_key" --executor_shutdown_grace_period="5secs" --fetcher_cache_dir="/tmp/Endpoint_SlaveEndpointTest_NoAuthorizer_0_jYG7lj/fetch" --fetcher_cache_size="2GB" --frameworks_home="" --gc_delay="1weeks" --gc_disk_headroom="0.1" --hadoop_home="" --help="false" --hostname_lookup="true" --http_command_executor="false" --http_credentials="/tmp/Endpoint_SlaveEndpointTest_NoAuthorizer_0_jYG7lj/http_credentials" --http_heartbeat_interval="30secs" --initialize_driver_logging="true" --isolation="posix/cpu,posix/mem" --launcher="posix" --launcher_dir="/mesos/mesos-1.5.0/_build/src" --logbufsecs="0" --logging_level="INFO" --max_completed_executors_per_framework="150" --oversubscribed_resources_interval="15secs" --perf_duration="10secs" --perf_interval="1mins" --port="5051" --qos_correction_interval_min="0ns" --quiet="false" --recover="reconnect" --recovery_timeout="15mins" --registration_backoff_factor="10ms" --resources="cpus:2;gpus:0;mem:1024;disk:1024;ports:[31000-32000]" --revocable_cpu_low_priority="true" --runtime_dir="/tmp/Endpoint_SlaveEndpointTest_NoAuthorizer_0_jYG7lj" --sandbox_directory="/mnt/mesos/sandbox" --strict="true" --switch_user="true" --systemd_enable_support="true" --systemd_runtime_directory="/run/systemd/system" --version="false" --work_dir="/tmp/Endpoint_SlaveEndpointTest_NoAuthorizer_0_YTLQyX" --zk_session_timeout="10secs"
I1005 14:39:24.815241 30328 credentials.hpp:86] Loading credential for authentication from '/tmp/Endpoint_SlaveEndpointTest_NoAuthorizer_0_jYG7lj/credential'
I1005 14:39:24.815400 30328 slave.cpp:287] Agent using credential for: test-principal
I1005 14:39:24.815428 30328 credentials.hpp:37] Loading credentials for authentication from '/tmp/Endpoint_SlaveEndpointTest_NoAuthorizer_0_jYG7lj/http_credentials'
I1005 14:39:24.815784 30328 http.cpp:1045] Creating default 'basic' HTTP authenticator for realm 'mesos-agent-executor'
I1005 14:39:24.815886 30328 http.cpp:1066] Creating default 'jwt' HTTP authenticator for realm 'mesos-agent-executor'
I1005 14:39:24.816054 30328 http.cpp:1045] Creating default 'basic' HTTP authenticator for realm 'mesos-agent-readonly'
I1005 14:39:24.816148 30328 http.cpp:1066] Creating default 'jwt' HTTP authenticator for realm 'mesos-agent-readonly'
I1005 14:39:24.816318 30328 http.cpp:1045] Creating default 'basic' HTTP authenticator for realm 'mesos-agent-readwrite'
I1005 14:39:24.816414 30328 http.cpp:1066] Creating default 'jwt' HTTP authenticator for realm 'mesos-agent-readwrite'
I1005 14:39:24.817636 30328 slave.cpp:585] Agent resources: [{"name":"cpus","scalar":{"value":2.0},"type":"SCALAR"},{"name":"mem","scalar":{"value":1024.0},"type":"SCALAR"},{"name":"disk","scalar":{"value":1024.0},"type":"SCALAR"},{"name":"ports","ranges":{"range":[{"begin":31000,"end":32000}]},"type":"RANGES"}]
I1005 14:39:24.817836 30328 slave.cpp:593] Agent attributes: [  ]
I1005 14:39:24.817848 30328 slave.cpp:602] Agent hostname: bfc101a8da67
I1005 14:39:24.817958 30316 status_update_manager.cpp:177] Pausing sending status updates
I1005 14:39:24.819151 30308 state.cpp:64] Recovering state from '/tmp/Endpoint_SlaveEndpointTest_NoAuthorizer_0_YTLQyX/meta'
I1005 14:39:24.819361 30324 status_update_manager.cpp:203] Recovering status update manager
I1005 14:39:24.819517 30331 containerizer.cpp:648] Recovering containerizer
I1005 14:39:24.820505 30322 provisioner.cpp:416] Provisioner recovery complete
I1005 14:39:24.820757 30316 slave.cpp:6310] Finished recovery
I1005 14:39:24.821133 30316 slave.cpp:6492] Querying resource estimator for oversubscribable resources
I1005 14:39:24.821312 30314 slave.cpp:6506] Received oversubscribable resources {} from the resource estimator
I1005 14:39:24.822891 30326 process.cpp:3929] Handling HTTP event for process 'slave(830)' with path: '/slave(830)/monitor/statistics'
I1005 14:39:24.824206 30322 http.cpp:1185] HTTP GET for /slave(830)/monitor/statistics from 172.17.0.2:34464
I1005 14:39:24.824264 30322 http.cpp:976] Authorizing principal 'test-principal' to GET the '/monitor/statistics' endpoint
I1005 14:39:24.826252 30331 slave.cpp:869] Agent terminating
[       OK ] Endpoint/SlaveEndpointTest.NoAuthorizer/0 (25 ms)
[ RUN      ] Endpoint/SlaveEndpointTest.NoAuthorizer/1
I1005 14:39:24.836262  8719 containerizer.cpp:292] Using isolation { environment_secret, posix/cpu, posix/mem, filesystem/posix, network/cni }
W1005 14:39:24.836694  8719 backend.cpp:76] Failed to create 'aufs' backend: AufsBackend requires root privileges
W1005 14:39:24.836802  8719 backend.cpp:76] Failed to create 'bind' backend: BindBackend requires root privileges
I1005 14:39:24.836845  8719 provisioner.cpp:255] Using default backend 'copy'
I1005 14:39:24.838243  8719 cluster.cpp:448] Creating default 'local' authorizer
I1005 14:39:24.839884 30323 slave.cpp:254] Mesos agent started on (831)@172.17.0.2:46758
I1005 14:39:24.839902 30323 slave.cpp:255] Flags at startup: --acls="" --appc_simple_discovery_uri_prefix="http://" --appc_store_dir="/tmp/Endpoint_SlaveEndpointTest_NoAuthorizer_1_jay6JI/store/appc" --authenticate_http_executors="true" --authenticate_http_readonly="true" --authenticate_http_readwrite="true" --authenticatee="crammd5" --authentication_backoff_factor="1secs" --authorizer="local" --cgroups_cpu_enable_pids_and_tids_count="false" --cgroups_enable_cfs="false" --cgroups_hierarchy="/sys/fs/cgroup" --cgroups_limit_swap="false" --cgroups_root="mesos" --container_disk_watch_interval="15secs" --containerizers="mesos" --credential="/tmp/Endpoint_SlaveEndpointTest_NoAuthorizer_1_jay6JI/credential" --default_role="*" --disallow_sharing_agent_pid_namespace="false" --disk_watch_interval="1mins" --docker="docker" --docker_kill_orphans="true" --docker_registry="https://registry-1.docker.io" --docker_remove_delay="6hrs" --docker_socket="/var/run/docker.sock" --docker_stop_timeout="0ns" --docker_store_dir="/tmp/Endpoint_SlaveEndpointTest_NoAuthorizer_1_jay6JI/store/docker" --docker_volume_checkpoint_dir="/var/run/mesos/isolators/docker/volume" --enforce_container_disk_quota="false" --executor_registration_timeout="1mins" --executor_reregistration_timeout="2secs" --executor_secret_key="/tmp/Endpoint_SlaveEndpointTest_NoAuthorizer_1_jay6JI/executor_secret_key" --executor_shutdown_grace_period="5secs" --fetcher_cache_dir="/tmp/Endpoint_SlaveEndpointTest_NoAuthorizer_1_jay6JI/fetch" --fetcher_cache_size="2GB" --frameworks_home="" --gc_delay="1weeks" --gc_disk_headroom="0.1" --hadoop_home="" --help="false" --hostname_lookup="true" --http_command_executor="false" --http_credentials="/tmp/Endpoint_SlaveEndpointTest_NoAuthorizer_1_jay6JI/http_credentials" --http_heartbeat_interval="30secs" --initialize_driver_logging="true" --isolation="posix/cpu,posix/mem" --launcher="posix" --launcher_dir="/mesos/mesos-1.5.0/_build/src" --logbufsecs="0" --logging_level="INFO" --max_completed_executors_per_framework="150" --oversubscribed_resources_interval="15secs" --perf_duration="10secs" --perf_interval="1mins" --port="5051" --qos_correction_interval_min="0ns" --quiet="false" --recover="reconnect" --recovery_timeout="15mins" --registration_backoff_factor="10ms" --resources="cpus:2;gpus:0;mem:1024;disk:1024;ports:[31000-32000]" --revocable_cpu_low_priority="true" --runtime_dir="/tmp/Endpoint_SlaveEndpointTest_NoAuthorizer_1_jay6JI" --sandbox_directory="/mnt/mesos/sandbox" --strict="true" --switch_user="true" --systemd_enable_support="true" --systemd_runtime_directory="/run/systemd/system" --version="false" --work_dir="/tmp/Endpoint_SlaveEndpointTest_NoAuthorizer_1_WEh4Sm" --zk_session_timeout="10secs"
I1005 14:39:24.840260 30323 credentials.hpp:86] Loading credential for authentication from '/tmp/Endpoint_SlaveEndpointTest_NoAuthorizer_1_jay6JI/credential'
I1005 14:39:24.840397 30323 slave.cpp:287] Agent using credential for: test-principal
I1005 14:39:24.840418 30323 credentials.hpp:37] Loading credentials for authentication from '/tmp/Endpoint_SlaveEndpointTest_NoAuthorizer_1_jay6JI/http_credentials'
I1005 14:39:24.840673 30323 http.cpp:1045] Creating default 'basic' HTTP authenticator for realm 'mesos-agent-executor'
I1005 14:39:24.840790 30323 http.cpp:1066] Creating default 'jwt' HTTP authenticator for realm 'mesos-agent-executor'
I1005 14:39:24.840983 30323 http.cpp:1045] Creating default 'basic' HTTP authenticator for realm 'mesos-agent-readonly'
I1005 14:39:24.841078 30323 http.cpp:1066] Creating default 'jwt' HTTP authenticator for realm 'mesos-agent-readonly'
I1005 14:39:24.841265 30323 http.cpp:1045] Creating default 'basic' HTTP authenticator for realm 'mesos-agent-readwrite'
I1005 14:39:24.841365 30323 http.cpp:1066] Creating default 'jwt' HTTP authenticator for realm 'mesos-agent-readwrite'
I1005 14:39:24.842610 30323 slave.cpp:585] Agent resources: [{"name":"cpus","scalar":{"value":2.0},"type":"SCALAR"},{"name":"mem","scalar":{"value":1024.0},"type":"SCALAR"},{"name":"disk","scalar":{"value":1024.0},"type":"SCALAR"},{"name":"ports","ranges":{"range":[{"begin":31000,"end":32000}]},"type":"RANGES"}]
I1005 14:39:24.842811 30323 slave.cpp:593] Agent attributes: [  ]
I1005 14:39:24.842836 30323 slave.cpp:602] Agent hostname: bfc101a8da67
I1005 14:39:24.842947 30319 status_update_manager.cpp:177] Pausing sending status updates
I1005 14:39:24.844162 30308 state.cpp:64] Recovering state from '/tmp/Endpoint_SlaveEndpointTest_NoAuthorizer_1_WEh4Sm/meta'
I1005 14:39:24.844370 30313 status_update_manager.cpp:203] Recovering status update manager
I1005 14:39:24.844528 30314 containerizer.cpp:648] Recovering containerizer
I1005 14:39:24.845598 30320 provisioner.cpp:416] Provisioner recovery complete
I1005 14:39:24.845855 30319 slave.cpp:6310] Finished recovery
I1005 14:39:24.846211 30319 slave.cpp:6492] Querying resource estimator for oversubscribable resources
I1005 14:39:24.846436 30324 slave.cpp:6506] Received oversubscribable resources {} from the resource estimator
I1005 14:39:24.847936 30321 process.cpp:3929] Handling HTTP event for process 'slave(831)' with path: '/slave(831)/monitor/statistics.json'
I1005 14:39:24.849280 30322 http.cpp:1185] HTTP GET for /slave(831)/monitor/statistics.json from 172.17.0.2:34466
I1005 14:39:24.849336 30322 http.cpp:976] Authorizing principal 'test-principal' to GET the '/monitor/statistics.json' endpoint
I1005 14:39:24.851339 30320 slave.cpp:869] Agent terminating
[       OK ] Endpoint/SlaveEndpointTest.NoAuthorizer/1 (24 ms)
[ RUN      ] Endpoint/SlaveEndpointTest.NoAuthorizer/2
I1005 14:39:24.860787  8719 containerizer.cpp:292] Using isolation { environment_secret, posix/cpu, posix/mem, filesystem/posix, network/cni }
W1005 14:39:24.861183  8719 backend.cpp:76] Failed to create 'aufs' backend: AufsBackend requires root privileges
W1005 14:39:24.861280  8719 backend.cpp:76] Failed to create 'bind' backend: BindBackend requires root privileges
I1005 14:39:24.861307  8719 provisioner.cpp:255] Using default backend 'copy'
I1005 14:39:24.862709  8719 cluster.cpp:448] Creating default 'local' authorizer
I1005 14:39:24.864320 30331 slave.cpp:254] Mesos agent started on (832)@172.17.0.2:46758
I1005 14:39:24.864337 30331 slave.cpp:255] Flags at startup: --acls="" --appc_simple_discovery_uri_prefix="http://" --appc_store_dir="/tmp/Endpoint_SlaveEndpointTest_NoAuthorizer_2_YB9Km8/store/appc" --authenticate_http_executors="true" --authenticate_http_readonly="true" --authenticate_http_readwrite="true" --authenticatee="crammd5" --authentication_backoff_factor="1secs" --authorizer="local" --cgroups_cpu_enable_pids_and_tids_count="false" --cgroups_enable_cfs="false" --cgroups_hierarchy="/sys/fs/cgroup" --cgroups_limit_swap="false" --cgroups_root="mesos" --container_disk_watch_interval="15secs" --containerizers="mesos" --credential="/tmp/Endpoint_SlaveEndpointTest_NoAuthorizer_2_YB9Km8/credential" --default_role="*" --disallow_sharing_agent_pid_namespace="false" --disk_watch_interval="1mins" --docker="docker" --docker_kill_orphans="true" --docker_registry="https://registry-1.docker.io" --docker_remove_delay="6hrs" --docker_socket="/var/run/docker.sock" --docker_stop_timeout="0ns" --docker_store_dir="/tmp/Endpoint_SlaveEndpointTest_NoAuthorizer_2_YB9Km8/store/docker" --docker_volume_checkpoint_dir="/var/run/mesos/isolators/docker/volume" --enforce_container_disk_quota="false" --executor_registration_timeout="1mins" --executor_reregistration_timeout="2secs" --executor_secret_key="/tmp/Endpoint_SlaveEndpointTest_NoAuthorizer_2_YB9Km8/executor_secret_key" --executor_shutdown_grace_period="5secs" --fetcher_cache_dir="/tmp/Endpoint_SlaveEndpointTest_NoAuthorizer_2_YB9Km8/fetch" --fetcher_cache_size="2GB" --frameworks_home="" --gc_delay="1weeks" --gc_disk_headroom="0.1" --hadoop_home="" --help="false" --hostname_lookup="true" --http_command_executor="false" --http_credentials="/tmp/Endpoint_SlaveEndpointTest_NoAuthorizer_2_YB9Km8/http_credentials" --http_heartbeat_interval="30secs" --initialize_driver_logging="true" --isolation="posix/cpu,posix/mem" --launcher="posix" --launcher_dir="/mesos/mesos-1.5.0/_build/src" --logbufsecs="0" --logging_level="INFO" --max_completed_executors_per_framework="150" --oversubscribed_resources_interval="15secs" --perf_duration="10secs" --perf_interval="1mins" --port="5051" --qos_correction_interval_min="0ns" --quiet="false" --recover="reconnect" --recovery_timeout="15mins" --registration_backoff_factor="10ms" --resources="cpus:2;gpus:0;mem:1024;disk:1024;ports:[31000-32000]" --revocable_cpu_low_priority="true" --runtime_dir="/tmp/Endpoint_SlaveEndpointTest_NoAuthorizer_2_YB9Km8" --sandbox_directory="/mnt/mesos/sandbox" --strict="true" --switch_user="true" --systemd_enable_support="true" --systemd_runtime_directory="/run/systemd/system" --version="false" --work_dir="/tmp/Endpoint_SlaveEndpointTest_NoAuthorizer_2_yBJ4rM" --zk_session_timeout="10secs"
I1005 14:39:24.864686 30331 credentials.hpp:86] Loading credential for authentication from '/tmp/Endpoint_SlaveEndpointTest_NoAuthorizer_2_YB9Km8/credential'
I1005 14:39:24.864816 30331 slave.cpp:287] Agent using credential for: test-principal
I1005 14:39:24.864835 30331 credentials.hpp:37] Loading credentials for authentication from '/tmp/Endpoint_SlaveEndpointTest_NoAuthorizer_2_YB9Km8/http_credentials'
I1005 14:39:24.865118 30331 http.cpp:1045] Creating default 'basic' HTTP authenticator for realm 'mesos-agent-executor'
I1005 14:39:24.865234 30331 http.cpp:1066] Creating default 'jwt' HTTP authenticator for realm 'mesos-agent-executor'
I1005 14:39:24.865428 30331 http.cpp:1045] Creating default 'basic' HTTP authenticator for realm 'mesos-agent-readonly'
I1005 14:39:24.865522 30331 http.cpp:1066] Creating default 'jwt' HTTP authenticator for realm 'mesos-agent-readonly'
I1005 14:39:24.865708 30331 http.cpp:1045] Creating default 'basic' HTTP authenticator for realm 'mesos-agent-readwrite'
I1005 14:39:24.865806 30331 http.cpp:1066] Creating default 'jwt' HTTP authenticator for realm 'mesos-agent-readwrite'
I1005 14:39:24.867065 30331 slave.cpp:585] Agent resources: [{"name":"cpus","scalar":{"value":2.0},"type":"SCALAR"},{"name":"mem","scalar":{"value":1024.0},"type":"SCALAR"},{"name":"disk","scalar":{"value":1024.0},"type":"SCALAR"},{"name":"ports","ranges":{"range":[{"begin":31000,"end":32000}]},"type":"RANGES"}]
I1005 14:39:24.867264 30331 slave.cpp:593] Agent attributes: [  ]
I1005 14:39:24.867278 30331 slave.cpp:602] Agent hostname: bfc101a8da67
I1005 14:39:24.867398 30317 status_update_manager.cpp:177] Pausing sending status updates
I1005 14:39:24.868657 30319 state.cpp:64] Recovering state from '/tmp/Endpoint_SlaveEndpointTest_NoAuthorizer_2_yBJ4rM/meta'
I1005 14:39:24.868857 30313 status_update_manager.cpp:203] Recovering status update manager
I1005 14:39:24.869007 30308 containerizer.cpp:648] Recovering containerizer
I1005 14:39:24.870000 30322 provisioner.cpp:416] Provisioner recovery complete
I1005 14:39:24.870235 30317 slave.cpp:6310] Finished recovery
I1005 14:39:24.870673 30317 slave.cpp:6492] Querying resource estimator for oversubscribable resources
I1005 14:39:24.870868 30311 slave.cpp:6506] Received oversubscribable resources {} from the resource estimator
I1005 14:39:24.872491 30318 process.cpp:3929] Handling HTTP event for process 'slave(832)' with path: '/slave(832)/containers'
I1005 14:39:24.873842 30322 http.cpp:1185] HTTP GET for /slave(832)/containers from 172.17.0.2:34468
I1005 14:39:24.873898 30322 http.cpp:976] Authorizing principal 'test-principal' to GET the '/containers' endpoint
I1005 14:39:24.876358 30331 slave.cpp:869] Agent terminating
[       OK ] Endpoint/SlaveEndpointTest.NoAuthorizer/2 (25 ms)
[----------] 9 tests from Endpoint/SlaveEndpointTest (234 ms total)

[----------] 2 tests from ContainerizerType/DefaultContainerDNSFlagTest
[ RUN      ] ContainerizerType/DefaultContainerDNSFlagTest.ValidateFlag/0
[       OK ] ContainerizerType/DefaultContainerDNSFlagTest.ValidateFlag/0 (9 ms)
[ RUN      ] ContainerizerType/DefaultContainerDNSFlagTest.ValidateFlag/1
[       OK ] ContainerizerType/DefaultContainerDNSFlagTest.ValidateFlag/1 (8 ms)
[----------] 2 tests from ContainerizerType/DefaultContainerDNSFlagTest (17 ms total)

[----------] Global test environment tear-down
[==========] 1693 tests from 186 test cases ran. (693203 ms total)
[  PASSED  ] 1692 tests.
[  FAILED  ] 1 test, listed below:
[  FAILED  ] ExamplesTest.PythonFramework

 1 FAILED TEST
  YOU HAVE 21 DISABLED TESTS

I1005 14:39:24.949039 30332 process.cpp:1068] Failed to accept socket: future discarded
make[4]: *** [check-local] Error 1
make[4]: Leaving directory `/mesos/mesos-1.5.0/_build/src'
make[3]: *** [check-am] Error 2
make[3]: Leaving directory `/mesos/mesos-1.5.0/_build/src'
make[2]: *** [check] Error 2
make[2]: Leaving directory `/mesos/mesos-1.5.0/_build/src'
make[1]: *** [check-recursive] Error 1
make[1]: Leaving directory `/mesos/mesos-1.5.0/_build'
make: *** [distcheck] Error 1
+ docker rmi mesos-1507210625-19208
Untagged: mesos-1507210625-19208:latest
Deleted: sha256:26d104abadf584bd22244d1b0bda2efeaea8ebdd8d02d9e786a6eb4393ff1c70
Deleted: sha256:7c6ad77a95d1dfbc87d29f86ecabfde898f4b5cf474fbf52fa25d0c8d4649a89
Deleted: sha256:533d7861cf529b41a975d5b800a710a9d201fc58a0a59d06f838afa0c626f234
Deleted: sha256:2e50f42210bd8c5ed6c95a65d63986e29374cb4cf96341800b5b6bf934de7210
Deleted: sha256:49f9716c5e1eb23de9c4defa1cd73f0d90fd9b3536f59efdacd25206d1676fc5
Deleted: sha256:f735e78d72b318a14e28c5eea6ed3f0e251ee426d4e6e9c5734e2b000625f082
Deleted: sha256:7cdeaa6d3f64fd0bcd897b06270cde55472d188520413f0e2d212a97601aeb34
Deleted: sha256:7d26fab8d77e7d99a27a7079ef40034569948bbe90ce6bcc52ab27eceb843651
Deleted: sha256:ed3ec48a1ff191726c97bcf2517c63120a433edbfab6ddda01033e0671313f6e
Deleted: sha256:5c4b316b1593357895db9da97db27a56698ed38c0ae969fe3165fad4c3b25ced
Deleted: sha256:cbf4a3daf443aaec14b36a8daf34271c3b250d8317f8248fd6fabf130958c16b
Deleted: sha256:4e4eda2ee1b11ba8f26c814cfea6dbff8b0e8184e45b0585dc588233db6d4857
Deleted: sha256:56be821f8bdf4af3367efb5e776525ff006cba7a636927bc95d6d4ce1b2f9768
Deleted: sha256:ad2a8c2f4251d724f5d0f58c4bf7f2854b48eb9c48f9bcff5bde81af2e282b25
Deleted: sha256:b92c2ae30867c7abcc01eb2174649d572be49d11b720be92caeb5933e6e685e8
Deleted: sha256:517103fd2ecfa7bffaa77c9dd256a602154a70249f0ba39c0a75d4ec559216b9
Deleted: sha256:99d396081b52ac91d30f67789a03c5b901a3e61169134b641210e9fcbc0f9702
Deleted: sha256:d102bb5103abca1b8881ec6ae7504866c0cef4472142faae07a43343caedd024
Deleted: sha256:0d0a6bd6bf6aa69e04923d7f6f35f46f08cb4114b86f32c692dc23f3ed898cf4
Deleted: sha256:93890ba599b3d9816198d3882fefdda7d8064c19d64dd3e65f60a58d8483ed91
Deleted: sha256:1b08d99bb1f635add87fb1457c24e2d94d1d5b649d2d59d6617e374916dd196d
Deleted: sha256:b7ed297aad93cff6d033c45ee732dc7e23bf35aa695179c49de0994145692037
Deleted: sha256:d427540282500ed403de030464271bb7d4469d5b0e7ffffeacc2d7a6765445c2
Deleted: sha256:ae1f442ba5b96fa25b293fcf0ba61d46d50d53b723958f48fbc92907cf1702e3
Deleted: sha256:e4f1982ee3fd749901f6a523a729c348c9ec419705d32afae60eba2d8a726926
Deleted: sha256:911c35554a530f2602d93111eed99ecda6cf3fc04b7b2de9e450395f55b46b83
Deleted: sha256:88525243c9a34147d3731f653b3084186321078f379fd2dbdbed7e33d1d1238d
Deleted: sha256:49976ac5fe43be7b795cb1422b808e9564164ab4be6e9d0f5e752f41da1e8fc0
Build step 'Execute shell' marked build as failure

Jenkins build is back to normal : Mesos-Buildbot » autotools,gcc,--verbose --disable-libtool-wrapper --enable-libevent --enable-ssl,GLOG_v=1 MESOS_VERBOSE=1,ubuntu:14.04,(ubuntu)&&(!ubuntu-us1)&&(!ubuntu-eu2)&&(!qnode3)&&(!H23) #4289

Posted by Apache Jenkins Server <je...@builds.apache.org>.
See <https://builds.apache.org/job/Mesos-Buildbot/BUILDTOOL=autotools,COMPILER=gcc,CONFIGURATION=--verbose%20--disable-libtool-wrapper%20--enable-libevent%20--enable-ssl,ENVIRONMENT=GLOG_v=1%20MESOS_VERBOSE=1,OS=ubuntu%3A14.04,label_exp=(ubuntu)&&(!ubuntu-us1)&&(!ubuntu-eu2)&&(!qnode3)&&(!H23)/4289/display/redirect>


Build failed in Jenkins: Mesos-Buildbot » autotools,gcc,--verbose --disable-libtool-wrapper --enable-libevent --enable-ssl,GLOG_v=1 MESOS_VERBOSE=1,ubuntu:14.04,(ubuntu)&&(!ubuntu-us1)&&(!ubuntu-eu2)&&(!qnode3)&&(!H23) #4288

Posted by Apache Jenkins Server <je...@builds.apache.org>.
See <https://builds.apache.org/job/Mesos-Buildbot/BUILDTOOL=autotools,COMPILER=gcc,CONFIGURATION=--verbose%20--disable-libtool-wrapper%20--enable-libevent%20--enable-ssl,ENVIRONMENT=GLOG_v=1%20MESOS_VERBOSE=1,OS=ubuntu%3A14.04,label_exp=(ubuntu)&&(!ubuntu-us1)&&(!ubuntu-eu2)&&(!qnode3)&&(!H23)/4288/display/redirect?page=changes>

Changes:

[klueska] Added support/ to the list of the linted directories.

[bbannier] Made 'UpdateSlaveMessage' a union of possible updates.

[bbannier] Rescinded offers possibly affected by updates to agent total resources.

[bbannier] Triggered 'UpdateSlaveMessage' when 'ResourceProviderManager' updates.

[bbannier] Implemented a registrar for resource provider manager state.

[bbannier] Added a master-registry backed resource provider manager registry.

[Kapil Arya] Updated website for 1.4.0.

[Kapil Arya] Added 1.4.0 blog post.

------------------------------------------
[...truncated 119.05 KB...]
W:4368, 0: Bad indentation. Found 4 spaces, expected 8 (bad-indentation)
W:4369, 0: Bad indentation. Found 4 spaces, expected 8 (bad-indentation)
W:4370, 0: Bad indentation. Found 6 spaces, expected 12 (bad-indentation)
W:4373, 0: Bad indentation. Found 6 spaces, expected 12 (bad-indentation)
W:4374, 0: Bad indentation. Found 2 spaces, expected 4 (bad-indentation)
W:4379, 0: Bad indentation. Found 2 spaces, expected 4 (bad-indentation)
W:4395, 0: Bad indentation. Found 2 spaces, expected 4 (bad-indentation)
W:4398, 0: Bad indentation. Found 2 spaces, expected 4 (bad-indentation)
W:4399, 0: Bad indentation. Found 4 spaces, expected 8 (bad-indentation)
W:4400, 0: Bad indentation. Found 4 spaces, expected 8 (bad-indentation)
W:4401, 0: Bad indentation. Found 6 spaces, expected 12 (bad-indentation)
W:4404, 0: Bad indentation. Found 4 spaces, expected 8 (bad-indentation)
W:4405, 0: Bad indentation. Found 4 spaces, expected 8 (bad-indentation)
W:4408, 0: Bad indentation. Found 6 spaces, expected 12 (bad-indentation)
W:4409, 0: Bad indentation. Found 6 spaces, expected 12 (bad-indentation)
W:4410, 0: Bad indentation. Found 8 spaces, expected 16 (bad-indentation)
W:4412, 0: Bad indentation. Found 4 spaces, expected 8 (bad-indentation)
W:4413, 0: Bad indentation. Found 6 spaces, expected 12 (bad-indentation)
W:4414, 0: Bad indentation. Found 8 spaces, expected 16 (bad-indentation)
W:4417, 0: Bad indentation. Found 4 spaces, expected 8 (bad-indentation)
W:4418, 0: Bad indentation. Found 6 spaces, expected 12 (bad-indentation)
W:4420, 0: Bad indentation. Found 4 spaces, expected 8 (bad-indentation)
W:4421, 0: Bad indentation. Found 6 spaces, expected 12 (bad-indentation)
W:4422, 0: Bad indentation. Found 8 spaces, expected 16 (bad-indentation)
W:4427, 0: Bad indentation. Found 2 spaces, expected 4 (bad-indentation)
W:4430, 0: Bad indentation. Found 2 spaces, expected 4 (bad-indentation)
W:4433, 0: Bad indentation. Found 2 spaces, expected 4 (bad-indentation)
W:4442, 0: Bad indentation. Found 2 spaces, expected 4 (bad-indentation)
W:4446, 0: Bad indentation. Found 2 spaces, expected 4 (bad-indentation)
W:4447, 0: Bad indentation. Found 2 spaces, expected 4 (bad-indentation)
W:4448, 0: Bad indentation. Found 4 spaces, expected 8 (bad-indentation)
W:4449, 0: Bad indentation. Found 4 spaces, expected 8 (bad-indentation)
W:4450, 0: Bad indentation. Found 4 spaces, expected 8 (bad-indentation)
W:4451, 0: Bad indentation. Found 6 spaces, expected 12 (bad-indentation)
W:4458, 0: Bad indentation. Found 2 spaces, expected 4 (bad-indentation)
W:4459, 0: Bad indentation. Found 4 spaces, expected 8 (bad-indentation)
W:4462, 0: Bad indentation. Found 2 spaces, expected 4 (bad-indentation)
W:4463, 0: Bad indentation. Found 4 spaces, expected 8 (bad-indentation)
W:4464, 0: Bad indentation. Found 4 spaces, expected 8 (bad-indentation)
W:4465, 0: Bad indentation. Found 6 spaces, expected 12 (bad-indentation)
W:4474, 0: Bad indentation. Found 2 spaces, expected 4 (bad-indentation)
W:4485, 0: Bad indentation. Found 2 spaces, expected 4 (bad-indentation)
W:4486, 0: Bad indentation. Found 2 spaces, expected 4 (bad-indentation)
W:4487, 0: Bad indentation. Found 2 spaces, expected 4 (bad-indentation)
W:4488, 0: Bad indentation. Found 4 spaces, expected 8 (bad-indentation)
W:4497, 0: Bad indentation. Found 2 spaces, expected 4 (bad-indentation)
W:4515, 0: Bad indentation. Found 2 spaces, expected 4 (bad-indentation)
W:4516, 0: Bad indentation. Found 2 spaces, expected 4 (bad-indentation)
W:4517, 0: Bad indentation. Found 2 spaces, expected 4 (bad-indentation)
W:4518, 0: Bad indentation. Found 2 spaces, expected 4 (bad-indentation)
W:4519, 0: Bad indentation. Found 4 spaces, expected 8 (bad-indentation)
W:4520, 0: Bad indentation. Found 2 spaces, expected 4 (bad-indentation)
W:4521, 0: Bad indentation. Found 2 spaces, expected 4 (bad-indentation)
W:4522, 0: Bad indentation. Found 2 spaces, expected 4 (bad-indentation)
W:4523, 0: Bad indentation. Found 2 spaces, expected 4 (bad-indentation)
W:4525, 0: Bad indentation. Found 2 spaces, expected 4 (bad-indentation)
W:4526, 0: Bad indentation. Found 2 spaces, expected 4 (bad-indentation)
W:4528, 0: Bad indentation. Found 2 spaces, expected 4 (bad-indentation)
W:4529, 0: Bad indentation. Found 2 spaces, expected 4 (bad-indentation)
W:4530, 0: Bad indentation. Found 2 spaces, expected 4 (bad-indentation)
W:4531, 0: Bad indentation. Found 2 spaces, expected 4 (bad-indentation)
W:4532, 0: Bad indentation. Found 2 spaces, expected 4 (bad-indentation)
W:4533, 0: Bad indentation. Found 4 spaces, expected 8 (bad-indentation)
W:4537, 0: Bad indentation. Found 2 spaces, expected 4 (bad-indentation)
W:4550, 0: Bad indentation. Found 2 spaces, expected 4 (bad-indentation)
W:4553, 0: Bad indentation. Found 2 spaces, expected 4 (bad-indentation)
W:4554, 0: Bad indentation. Found 2 spaces, expected 4 (bad-indentation)
W:4555, 0: Bad indentation. Found 2 spaces, expected 4 (bad-indentation)
W:4557, 0: Bad indentation. Found 2 spaces, expected 4 (bad-indentation)
W:4559, 0: Bad indentation. Found 2 spaces, expected 4 (bad-indentation)
W:4561, 0: Bad indentation. Found 2 spaces, expected 4 (bad-indentation)
C:4561, 0: Unnecessary parens after 'if' keyword (superfluous-parens)
W:4562, 0: Bad indentation. Found 4 spaces, expected 8 (bad-indentation)
W:4564, 0: Bad indentation. Found 2 spaces, expected 4 (bad-indentation)
W:4565, 0: Bad indentation. Found 2 spaces, expected 4 (bad-indentation)
W:4566, 0: Bad indentation. Found 2 spaces, expected 4 (bad-indentation)
W:4567, 0: Bad indentation. Found 4 spaces, expected 8 (bad-indentation)
W:4570, 0: Bad indentation. Found 2 spaces, expected 4 (bad-indentation)
W:4572, 0: Bad indentation. Found 2 spaces, expected 4 (bad-indentation)
W:4576, 0: Bad indentation. Found 2 spaces, expected 4 (bad-indentation)
W:4578, 0: Bad indentation. Found 2 spaces, expected 4 (bad-indentation)
W:4581, 0: Bad indentation. Found 2 spaces, expected 4 (bad-indentation)
W:4594, 0: Bad indentation. Found 2 spaces, expected 4 (bad-indentation)
W:4596, 0: Bad indentation. Found 2 spaces, expected 4 (bad-indentation)
W:4607, 0: Bad indentation. Found 4 spaces, expected 8 (bad-indentation)
W:4608, 0: Bad indentation. Found 6 spaces, expected 12 (bad-indentation)
W:4612, 0: Bad indentation. Found 4 spaces, expected 8 (bad-indentation)
W:4613, 0: Bad indentation. Found 6 spaces, expected 12 (bad-indentation)
W:4615, 0: Bad indentation. Found 4 spaces, expected 8 (bad-indentation)
W:4617, 0: Bad indentation. Found 4 spaces, expected 8 (bad-indentation)
W:4618, 0: Bad indentation. Found 6 spaces, expected 12 (bad-indentation)
W:4619, 0: Bad indentation. Found 8 spaces, expected 16 (bad-indentation)
W:4620, 0: Bad indentation. Found 8 spaces, expected 16 (bad-indentation)
W:4622, 0: Bad indentation. Found 2 spaces, expected 4 (bad-indentation)
W:4623, 0: Bad indentation. Found 4 spaces, expected 8 (bad-indentation)
W:4625, 0: Bad indentation. Found 4 spaces, expected 8 (bad-indentation)
W:4628, 0: Bad indentation. Found 2 spaces, expected 4 (bad-indentation)
W:4632, 0: Bad indentation. Found 2 spaces, expected 4 (bad-indentation)
W:4633, 0: Bad indentation. Found 4 spaces, expected 8 (bad-indentation)
W:4635, 0: Bad indentation. Found 2 spaces, expected 4 (bad-indentation)
W:4636, 0: Bad indentation. Found 4 spaces, expected 8 (bad-indentation)
W:4638, 0: Bad indentation. Found 4 spaces, expected 8 (bad-indentation)
W:4641, 0: Bad indentation. Found 6 spaces, expected 12 (bad-indentation)
W:4645, 0: Bad indentation. Found 2 spaces, expected 4 (bad-indentation)
W:4649, 0: Bad indentation. Found 2 spaces, expected 4 (bad-indentation)
W:4654, 0: Bad indentation. Found 2 spaces, expected 4 (bad-indentation)
W:4655, 0: Bad indentation. Found 2 spaces, expected 4 (bad-indentation)
W:4656, 0: Bad indentation. Found 4 spaces, expected 8 (bad-indentation)
W:4657, 0: Bad indentation. Found 2 spaces, expected 4 (bad-indentation)
W:4658, 0: Bad indentation. Found 4 spaces, expected 8 (bad-indentation)
W:4662, 0: Bad indentation. Found 2 spaces, expected 4 (bad-indentation)
W:4666, 0: Bad indentation. Found 2 spaces, expected 4 (bad-indentation)
W:4667, 0: Bad indentation. Found 2 spaces, expected 4 (bad-indentation)
W:4671, 0: Bad indentation. Found 2 spaces, expected 4 (bad-indentation)
W:4681, 0: Bad indentation. Found 2 spaces, expected 4 (bad-indentation)
W:4682, 0: Bad indentation. Found 4 spaces, expected 8 (bad-indentation)
W:4688, 0: Bad indentation. Found 2 spaces, expected 4 (bad-indentation)
W:4689, 0: Bad indentation. Found 4 spaces, expected 8 (bad-indentation)
W:4691, 0: Bad indentation. Found 2 spaces, expected 4 (bad-indentation)
W:4692, 0: Bad indentation. Found 2 spaces, expected 4 (bad-indentation)
W:4693, 0: Bad indentation. Found 2 spaces, expected 4 (bad-indentation)
W:4694, 0: Bad indentation. Found 2 spaces, expected 4 (bad-indentation)
W:4696, 0: Bad indentation. Found 2 spaces, expected 4 (bad-indentation)
W:4697, 0: Bad indentation. Found 4 spaces, expected 8 (bad-indentation)
W:4698, 0: Bad indentation. Found 6 spaces, expected 12 (bad-indentation)
W:4699, 0: Bad indentation. Found 4 spaces, expected 8 (bad-indentation)
W:4700, 0: Bad indentation. Found 6 spaces, expected 12 (bad-indentation)
C:4701, 0: Line too long (81/80) (line-too-long)
W:4701, 0: Bad indentation. Found 8 spaces, expected 16 (bad-indentation)
W:4702, 0: Bad indentation. Found 6 spaces, expected 12 (bad-indentation)
W:4703, 0: Bad indentation. Found 4 spaces, expected 8 (bad-indentation)
W:4704, 0: Bad indentation. Found 6 spaces, expected 12 (bad-indentation)
W:4705, 0: Bad indentation. Found 4 spaces, expected 8 (bad-indentation)
W:4706, 0: Bad indentation. Found 6 spaces, expected 12 (bad-indentation)
W:4707, 0: Bad indentation. Found 6 spaces, expected 12 (bad-indentation)
W:4708, 0: Bad indentation. Found 8 spaces, expected 16 (bad-indentation)
W:4709, 0: Bad indentation. Found 4 spaces, expected 8 (bad-indentation)
W:4710, 0: Bad indentation. Found 6 spaces, expected 12 (bad-indentation)
W:4711, 0: Bad indentation. Found 8 spaces, expected 16 (bad-indentation)
W:4712, 0: Bad indentation. Found 6 spaces, expected 12 (bad-indentation)
W:4713, 0: Bad indentation. Found 4 spaces, expected 8 (bad-indentation)
W:4714, 0: Bad indentation. Found 6 spaces, expected 12 (bad-indentation)
W:4715, 0: Bad indentation. Found 6 spaces, expected 12 (bad-indentation)
W:4716, 0: Bad indentation. Found 4 spaces, expected 8 (bad-indentation)
W:4717, 0: Bad indentation. Found 6 spaces, expected 12 (bad-indentation)
W:4718, 0: Bad indentation. Found 6 spaces, expected 12 (bad-indentation)
W:4719, 0: Bad indentation. Found 10 spaces, expected 16 (bad-indentation)
W:4720, 0: Bad indentation. Found 6 spaces, expected 12 (bad-indentation)
W:4721, 0: Bad indentation. Found 10 spaces, expected 16 (bad-indentation)
W:4722, 0: Bad indentation. Found 4 spaces, expected 8 (bad-indentation)
W:4723, 0: Bad indentation. Found 6 spaces, expected 12 (bad-indentation)
W:4724, 0: Bad indentation. Found 6 spaces, expected 12 (bad-indentation)
W:4725, 0: Bad indentation. Found 10 spaces, expected 16 (bad-indentation)
W:4726, 0: Bad indentation. Found 6 spaces, expected 12 (bad-indentation)
W:4727, 0: Bad indentation. Found 10 spaces, expected 16 (bad-indentation)
W:4729, 0: Bad indentation. Found 2 spaces, expected 4 (bad-indentation)
W:4730, 0: Bad indentation. Found 4 spaces, expected 8 (bad-indentation)
W:4732, 0: Bad indentation. Found 2 spaces, expected 4 (bad-indentation)
W:4733, 0: Bad indentation. Found 2 spaces, expected 4 (bad-indentation)
W:4734, 0: Bad indentation. Found 2 spaces, expected 4 (bad-indentation)
W:4735, 0: Bad indentation. Found 2 spaces, expected 4 (bad-indentation)
W:4737, 0: Bad indentation. Found 2 spaces, expected 4 (bad-indentation)
W:4741, 0: Bad indentation. Found 2 spaces, expected 4 (bad-indentation)
W:4745, 0: Bad indentation. Found 2 spaces, expected 4 (bad-indentation)
W:4750, 0: Bad indentation. Found 2 spaces, expected 4 (bad-indentation)
W:4751, 0: Bad indentation. Found 2 spaces, expected 4 (bad-indentation)
W:4752, 0: Bad indentation. Found 4 spaces, expected 8 (bad-indentation)
W:4753, 0: Bad indentation. Found 2 spaces, expected 4 (bad-indentation)
W:4755, 0: Bad indentation. Found 2 spaces, expected 4 (bad-indentation)
W:4759, 0: Bad indentation. Found 2 spaces, expected 4 (bad-indentation)
C:  1, 0: Too many lines in module (4759/1000) (too-many-lines)
W:881, 0: Anomalous backslash in string: '\D'. String constant might be missing an r prefix. (anomalous-backslash-in-string)
W:881, 0: Anomalous backslash in string: '\.'. String constant might be missing an r prefix. (anomalous-backslash-in-string)
W:2673, 0: Anomalous backslash in string: '\('. String constant might be missing an r prefix. (anomalous-backslash-in-string)
W:2875, 0: Anomalous backslash in string: '\('. String constant might be missing an r prefix. (anomalous-backslash-in-string)
W:2876, 0: Anomalous backslash in string: '\('. String constant might be missing an r prefix. (anomalous-backslash-in-string)
C:583, 2: Missing method docstring (missing-docstring)
C:589, 2: Missing method docstring (missing-docstring)
W:650, 8: Attribute '_section' defined outside __init__ (attribute-defined-outside-init)
W:656, 8: Attribute '_section' defined outside __init__ (attribute-defined-outside-init)
W:662, 8: Attribute '_section' defined outside __init__ (attribute-defined-outside-init)
W:664, 8: Attribute '_section' defined outside __init__ (attribute-defined-outside-init)
W:667, 8: Attribute '_section' defined outside __init__ (attribute-defined-outside-init)
W:671, 8: Attribute '_section' defined outside __init__ (attribute-defined-outside-init)
W:674, 6: Attribute '_section' defined outside __init__ (attribute-defined-outside-init)
W:590, 4: Attribute '_last_header' defined outside __init__ (attribute-defined-outside-init)
W:652, 8: Attribute '_last_header' defined outside __init__ (attribute-defined-outside-init)
W:658, 8: Attribute '_last_header' defined outside __init__ (attribute-defined-outside-init)
W:677, 6: Attribute '_last_header' defined outside __init__ (attribute-defined-outside-init)
C:866, 0: Old-style class defined. (old-style-class)
C:1271,23: More than one statement on a single line (multiple-statements)
C:1272,23: More than one statement on a single line (multiple-statements)
C:1273,23: More than one statement on a single line (multiple-statements)
C:1274,23: More than one statement on a single line (multiple-statements)
C:1343,21: More than one statement on a single line (multiple-statements)
C:1344,21: More than one statement on a single line (multiple-statements)
C:1345,21: More than one statement on a single line (multiple-statements)
C:1346,21: More than one statement on a single line (multiple-statements)
C:1373,51: More than one statement on a single line (multiple-statements)
R:1899, 2: Too many local variables (18/15) (too-many-locals)
R:1899, 2: Too many branches (25/20) (too-many-branches)
R:1899, 2: Too many statements (62/50) (too-many-statements)
R:2277, 0: Too many local variables (19/15) (too-many-locals)
W:2303, 2: Unused variable 'raw_line' (unused-variable)
R:2536, 0: Too many local variables (23/15) (too-many-locals)
R:2536, 0: Too many branches (39/20) (too-many-branches)
R:2536, 0: Too many statements (95/50) (too-many-statements)
R:2959, 0: Too many local variables (16/15) (too-many-locals)
R:3168, 0: Too many local variables (21/15) (too-many-locals)
R:3168, 0: Too many branches (21/20) (too-many-branches)
R:3168, 0: Too many statements (56/50) (too-many-statements)
R:3349, 0: Too many arguments (6/5) (too-many-arguments)
R:3506, 2: The if statement can be replaced with 'return bool(test)' (simplifiable-if-statement)
R:3728, 0: Too many arguments (7/5) (too-many-arguments)
R:3728, 0: Too many local variables (21/15) (too-many-locals)
C:3973,39: More than one statement on a single line (multiple-statements)
C:3974,43: More than one statement on a single line (multiple-statements)
C:3978,18: More than one statement on a single line (multiple-statements)
C:3979,29: More than one statement on a single line (multiple-statements)
C:3980,43: More than one statement on a single line (multiple-statements)
C:3981,38: More than one statement on a single line (multiple-statements)
C:3982,45: More than one statement on a single line (multiple-statements)
C:3983,48: More than one statement on a single line (multiple-statements)
W:3847, 4: Unused variable 'extended_line' (unused-variable)
W:3729,33: Unused argument 'nesting_state' (unused-argument)
W:3762, 2: Unused variable 'fullname' (unused-variable)
R:3728, 0: Too many branches (43/20) (too-many-branches)
R:3728, 0: Too many statements (106/50) (too-many-statements)
R:4028, 0: Too many local variables (16/15) (too-many-locals)
R:4141, 0: Too many arguments (7/5) (too-many-arguments)
R:4377, 0: Too many local variables (20/15) (too-many-locals)
W:4494, 0: Dangerous default value [] as argument (dangerous-default-value)
R:4494, 0: Too many arguments (9/5) (too-many-arguments)
W:4535, 0: Dangerous default value [] as argument (dangerous-default-value)
W:4580, 0: Dangerous default value [] as argument (dangerous-default-value)
C:4617, 4: Consider using enumerate instead of iterating with range and len (consider-using-enumerate)
W:4714, 6: Using the global statement (global-statement)
W:4717, 6: Using the global statement (global-statement)
W:4723, 6: Using the global statement (global-statement)
C:4740, 0: Missing function docstring (missing-docstring)
************* Module apply-reviews
E:169,14: Module 'ssl' has no 'SSLContext' member (no-member)
E:189,19: Unexpected keyword argument 'context' in function call (unexpected-keyword-arg)
Total errors found: 2013
Checking 1210 C++ files
Virtualenv not detected... building
Rebuilding virtualenv...
Checking 39 Python files
Build step 'Execute shell' marked build as failure