You are viewing a plain text version of this content. The canonical link for it is here.
Posted to commits@flex.apache.org by fl...@gmail.com on 2017/03/31 00:23:26 UTC
Build failed in Jenkins: flex-asjs #2141
See <http://apacheflexbuild.cloudapp.net:8080/job/flex-asjs/2141/>
------------------------------------------
[...truncated 2041 lines...]
[java] Compiling file: org.apache.flex.core.Application
[java] Writing file: js\out\org\apache\flex\core\Application.js
[java] Compiling file: org.apache.flex.html.beads.models.PanelModel
[java] Writing file: js\out\org\apache\flex\html\beads\models\PanelModel.js
[java] Compiling file: org.apache.flex.html.beads.DecrementButtonView
[java] Writing file: js\out\org\apache\flex\html\beads\DecrementButtonView.js
[java] Compiling file: org.apache.flex.html.supportClasses.DateChooserList
[java] Writing file: js\out\org\apache\flex\html\supportClasses\DateChooserList.js
[java] Compiling file: org.apache.flex.html.Tree
[java] Writing file: js\out\org\apache\flex\html\Tree.js
[java] Compiling file: org.apache.flex.html.beads.models.ViewportModel
[java] Writing file: js\out\org\apache\flex\html\beads\models\ViewportModel.js
[java] Compiling file: org.apache.flex.html.supportClasses.RadioButtonIcon
[java] Writing file: js\out\org\apache\flex\html\supportClasses\RadioButtonIcon.js
[java] Compiling file: org.apache.flex.core.View
[java] Writing file: js\out\org\apache\flex\core\View.js
[java] Compiling file: org.apache.flex.html.beads.TextItemRendererFactoryForStringVectorData
[java] Writing file: js\out\org\apache\flex\html\beads\TextItemRendererFactoryForStringVectorData.js
[java] Compiling file: org.apache.flex.events.ItemRemovedEvent
[java] Writing file: js\out\org\apache\flex\events\ItemRemovedEvent.js
[java] Compiling file: org.apache.flex.html.beads.UnselectableElementBead
[java] Writing file: js\out\org\apache\flex\html\beads\UnselectableElementBead.js
[java] Compiling file: org.apache.flex.html.supportClasses.TreeListData
[java] Found ignorable: goog.events.Event
[java] Writing file: js\out\org\apache\flex\html\supportClasses\TreeListData.js
[java] Compiling file: org.apache.flex.html.beads.DataGridView
[java] Writing file: js\out\org\apache\flex\html\beads\DataGridView.js
[java] Compiling file: org.apache.flex.html.beads.IncrementButtonView
[java] Writing file: js\out\org\apache\flex\html\beads\IncrementButtonView.js
[java] Compiling file: org.apache.flex.svg.Text
[java] Found ignorable: SVGLocatable
[java] Writing file: js\out\org\apache\flex\svg\Text.js
[java] Compiling file: org.apache.flex.html.beads.layouts.HorizontalFlexLayout
[java] Writing file: js\out\org\apache\flex\html\beads\layouts\HorizontalFlexLayout.js
[java] Compiling file: org.apache.flex.html.beads.DataItemRendererFactoryForArrayData
[java] Writing file: js\out\org\apache\flex\html\beads\DataItemRendererFactoryForArrayData.js
[java] Compiling file: org.apache.flex.html.ToolTip
[java] Writing file: js\out\org\apache\flex\html\ToolTip.js
[java] Compiling file: org.apache.flex.html.beads.models.ImageAndTextModel
[java] Writing file: js\out\org\apache\flex\html\beads\models\ImageAndTextModel.js
[java] Compiling file: org.apache.flex.html.beads.ButtonBarView
[java] Writing file: js\out\org\apache\flex\html\beads\ButtonBarView.js
[java] Compiling file: org.apache.flex.html.TitleBar
[java] Writing file: js\out\org\apache\flex\html\TitleBar.js
[java] Compiling file: org.apache.flex.html.Form
[java] Writing file: js\out\org\apache\flex\html\Form.js
[java] Compiling file: org.apache.flex.html.beads.layouts.OneFlexibleChildHorizontalLayout
[java] Writing file: js\out\org\apache\flex\html\beads\layouts\OneFlexibleChildHorizontalLayout.js
[java] Compiling file: org.apache.flex.core.FilledRectangle
[java] Writing file: js\out\org\apache\flex\core\FilledRectangle.js
[java] Compiling file: org.apache.flex.html.beads.layouts.DataGridPercentageLayout
[java] Writing file: js\out\org\apache\flex\html\beads\layouts\DataGridPercentageLayout.js
[java] Compiling file: org.apache.flex.html.supportClasses.AccordionItemRenderer
[java] Writing file: js\out\org\apache\flex\html\supportClasses\AccordionItemRenderer.js
[java] Compiling file: org.apache.flex.html.beads.TitleBarView
[java] org.apache.flex.html.beads.TitleBarView as: [org.apache.flex.html.beads.TitleBarView, org.apache.flex.events.Event, org.apache.flex.core.UIBase, org.apache.flex.core.ITitleBarModel]
[java] org.apache.flex.html.beads.TitleBarView mxml: [org.apache.flex.binding.MXMLBeadViewDataBinding, org.apache.flex.html.beads.layouts.LayoutChangeNotifier, org.apache.flex.html.Label, org.apache.flex.core.SimpleCSSStyles, org.apache.flex.html.CloseButton, org.apache.flex.html.beads.TitleBarView, org.apache.flex.html.MXMLBeadView, org.apache.flex.events.MouseEvent]
[java] Writing file: js\out\org\apache\flex\html\beads\TitleBarView.js
[java] Compiling file: org.apache.flex.html.A
[java] Writing file: js\out\org\apache\flex\html\A.js
[java] Compiling file: org.apache.flex.html.I
[java] Writing file: js\out\org\apache\flex\html\I.js
[java] Compiling file: org.apache.flex.html.P
[java] Writing file: js\out\org\apache\flex\html\P.js
[java] Compiling file: org.apache.flex.html.beads.models.ComboBoxModel
[java] Writing file: js\out\org\apache\flex\html\beads\models\ComboBoxModel.js
[java] Compiling file: org.apache.flex.html.beads.layouts.LayoutChangeNotifier
[java] Writing file: js\out\org\apache\flex\html\beads\layouts\LayoutChangeNotifier.js
[java] Compiling file: org.apache.flex.html.beads.models.ButtonBarModel
[java] Writing file: js\out\org\apache\flex\html\beads\models\ButtonBarModel.js
[java] Compiling file: org.apache.flex.html.beads.models.AlertModel
[java] Writing file: js\out\org\apache\flex\html\beads\models\AlertModel.js
[java] Compiling file: org.apache.flex.html.supportClasses.DataGroup
[java] Writing file: js\out\org\apache\flex\html\supportClasses\DataGroup.js
[java] Compiling file: org.apache.flex.html.beads.controllers.SpinnerMouseController
[java] Writing file: js\out\org\apache\flex\html\beads\controllers\SpinnerMouseController.js
[java] Compiling file: org.apache.flex.html.RadioButton
[java] Writing file: js\out\org\apache\flex\html\RadioButton.js
[java] Compiling file: org.apache.flex.html.Div
[java] Writing file: js\out\org\apache\flex\html\Div.js
[java] Compiling file: org.apache.flex.html.CheckBox
[java] Writing file: js\out\org\apache\flex\html\CheckBox.js
[java] Compiling file: org.apache.flex.html.DateField
[java] Writing file: js\out\org\apache\flex\html\DateField.js
[java] Compiling file: org.apache.flex.html.ToggleTextButton
[java] Writing file: js\out\org\apache\flex\html\ToggleTextButton.js
[java] Compiling file: org.apache.flex.events.ItemAddedEvent
[java] Writing file: js\out\org\apache\flex\events\ItemAddedEvent.js
[java] Picked up JAVA_TOOL_OPTIONS: -Dfile.encoding=UTF8
[java] 62.1828157 seconds
main:
copy-swc:
[copy] Copying 1 file to <http://apacheflexbuild.cloudapp.net:8080/job/flex-asjs/ws/frameworks/libs>
check-for-tests:
test:
[available] DEPRECATED - <available> used to override an existing property.
[available] Build file should not reuse the same property name for different values.
clean:
compile:
[echo] Compiling FlexUnitFlexJSApplication.swf
[echo] FLEX_HOME: <http://apacheflexbuild.cloudapp.net:8080/job/flex-asjs/ws/>
[echo] FALCON_HOME: <http://apacheflexbuild.cloudapp.net:8080/job/flex-asjs/ws/../flex-falcon/compiler>
[echo] FLEXUNIT_HOME: C:\jenkins\workspace\flex-flexunit
[echo] playerglobal.version: 11.7
[mxmlc] Loading configuration: <http://apacheflexbuild.cloudapp.net:8080/job/flex-asjs/ws/frameworks/flex-config.xml>
[mxmlc]
[mxmlc] C:\jenkins\workspace\flex-flexunit\FlexUnit4\target\flexunit-4.3.0-20140410-as3_4.12.0.swc Warning: The definition mx.utils.StringUtil depended on by flexunit.framework.AsyncTestHelper in the SWC C:\jenkins\workspace\flex-flexunit\FlexUnit4\target\flexunit-4.3.0-20140410-as3_4.12.0.swc could not be found
[mxmlc]
[mxmlc]
[mxmlc] C:\jenkins\workspace\flex-flexunit\FlexUnit4\target\flexunit-4.3.0-20140410-as3_4.12.0.swc Warning: The definition mx.utils.ObjectUtil depended on by flexunit.framework.Assert in the SWC C:\jenkins\workspace\flex-flexunit\FlexUnit4\target\flexunit-4.3.0-20140410-as3_4.12.0.swc could not be found
[mxmlc]
[mxmlc]
[mxmlc] C:\jenkins\workspace\flex-flexunit\FlexUnit4\target\flexunit-4.3.0-20140410-as3_4.12.0.swc Warning: The definition mx.utils.StringUtil depended on by flexunit.framework.Assert in the SWC C:\jenkins\workspace\flex-flexunit\FlexUnit4\target\flexunit-4.3.0-20140410-as3_4.12.0.swc could not be found
[mxmlc]
[mxmlc]
[mxmlc] C:\jenkins\workspace\flex-flexunit\FlexUnit4\target\flexunit-4.3.0-20140410-as3_4.12.0.swc Warning: The definition mx.utils.ObjectUtil depended on by org.flexunit.runner.Description in the SWC C:\jenkins\workspace\flex-flexunit\FlexUnit4\target\flexunit-4.3.0-20140410-as3_4.12.0.swc could not be found
[mxmlc]
[mxmlc]
[mxmlc] Picked up JAVA_TOOL_OPTIONS: -Dfile.encoding=UTF8
[mxmlc] 134033 bytes written to C:\Jenkins\workspace\flex-asjs\frameworks\projects\HTML\src\test\flex\FlexUnitFlexJSApplication.swf in 24.517 seconds
test:
[mkdir] Created dir: <http://apacheflexbuild.cloudapp.net:8080/job/flex-asjs/ws/frameworks/projects/HTML/src/test/flex/out>
[flexunit] Validating task attributes ...
[flexunit] Generating default values ...
[flexunit] Using the following settings for the test run:
[flexunit] FLEX_HOME: [<http://apacheflexbuild.cloudapp.net:8080/job/flex-asjs/ws/]>
[flexunit] haltonfailure: [false]
[flexunit] headless: [false]
[flexunit] display: [99]
[flexunit] localTrusted: [true]
[flexunit] player: [flash]
[flexunit] port: [1024]
[flexunit] swf: [<http://apacheflexbuild.cloudapp.net:8080/job/flex-asjs/ws/frameworks/projects/HTML/src/test/flex/FlexUnitFlexJSApplication.swf]>
[flexunit] timeout: [90000ms]
[flexunit] toDir: [<http://apacheflexbuild.cloudapp.net:8080/job/flex-asjs/ws/frameworks/projects/HTML/src/test/flex/out]>
[flexunit] Setting up server process ...
[flexunit] Entry [<http://apacheflexbuild.cloudapp.net:8080/job/flex-asjs/ws/frameworks/projects/HTML/src/test/flex]> already available in local trust file at [C:\Users\apacheflexbuild\AppData\Roaming\Macromedia\Flash Player\#Security\FlashPlayerTrust\flexUnit.cfg].
[flexunit] Executing 'rundll32' with arguments:
[flexunit] 'url.dll,FileProtocolHandler'
[flexunit] '<http://apacheflexbuild.cloudapp.net:8080/job/flex-asjs/ws/frameworks/projects/HTML/src/test/flex/FlexUnitFlexJSApplication.swf'>
[flexunit]
[flexunit] The ' characters around the executable and arguments are
[flexunit] not part of the command.
[flexunit]
[flexunit] Starting server ...
[flexunit] Opening server socket on port [1024].
[flexunit] Waiting for client connection ...
[flexunit] Client connected.
[flexunit] Setting inbound buffer size to [262144] bytes.
[flexunit] Receiving data ...
[flexunit] Sending acknowledgement to player to start sending test data ...
[flexunit]
[flexunit]
[flexunit] Stopping server ...
[flexunit] End of test data reached, sending acknowledgement to player ...
BUILD FAILED
<http://apacheflexbuild.cloudapp.net:8080/job/flex-asjs/ws/build.xml>:499: The following error occurred while executing this line:
<http://apacheflexbuild.cloudapp.net:8080/job/flex-asjs/ws/frameworks/build.xml>:84: The following error occurred while executing this line:
<http://apacheflexbuild.cloudapp.net:8080/job/flex-asjs/ws/frameworks/build.xml>:234: The following error occurred while executing this line:
<http://apacheflexbuild.cloudapp.net:8080/job/flex-asjs/ws/frameworks/projects/HTML/build.xml>:52: The following error occurred while executing this line:
<http://apacheflexbuild.cloudapp.net:8080/job/flex-asjs/ws/frameworks/projects/HTML/src/test/flex/build.xml>:153: java.util.concurrent.ExecutionException: could not close client/server socket
at java.util.concurrent.FutureTask.report(FutureTask.java:122)
at java.util.concurrent.FutureTask.get(FutureTask.java:188)
at org.flexunit.ant.tasks.TestRun.run(Unknown Source)
at org.flexunit.ant.tasks.FlexUnitTask.execute(Unknown Source)
at org.apache.tools.ant.UnknownElement.execute(UnknownElement.java:292)
at sun.reflect.GeneratedMethodAccessor4.invoke(Unknown Source)
at sun.reflect.DelegatingMethodAccessorImpl.invoke(DelegatingMethodAccessorImpl.java:43)
at java.lang.reflect.Method.invoke(Method.java:606)
at org.apache.tools.ant.dispatch.DispatchUtils.execute(DispatchUtils.java:106)
at org.apache.tools.ant.Task.perform(Task.java:348)
at org.apache.tools.ant.Target.execute(Target.java:435)
at org.apache.tools.ant.Target.performTasks(Target.java:456)
at org.apache.tools.ant.Project.executeSortedTargets(Project.java:1393)
at org.apache.tools.ant.helper.SingleCheckExecutor.executeTargets(SingleCheckExecutor.java:38)
at org.apache.tools.ant.Project.executeTargets(Project.java:1248)
at org.apache.tools.ant.taskdefs.Ant.execute(Ant.java:440)
at org.apache.tools.ant.UnknownElement.execute(UnknownElement.java:292)
at sun.reflect.GeneratedMethodAccessor4.invoke(Unknown Source)
at sun.reflect.DelegatingMethodAccessorImpl.invoke(DelegatingMethodAccessorImpl.java:43)
at java.lang.reflect.Method.invoke(Method.java:606)
at org.apache.tools.ant.dispatch.DispatchUtils.execute(DispatchUtils.java:106)
at org.apache.tools.ant.Task.perform(Task.java:348)
at org.apache.tools.ant.Target.execute(Target.java:435)
at org.apache.tools.ant.Target.performTasks(Target.java:456)
at org.apache.tools.ant.Project.executeSortedTargets(Project.java:1393)
at org.apache.tools.ant.helper.SingleCheckExecutor.executeTargets(SingleCheckExecutor.java:38)
at org.apache.tools.ant.Project.executeTargets(Project.java:1248)
at org.apache.tools.ant.taskdefs.Ant.execute(Ant.java:440)
at org.apache.tools.ant.UnknownElement.execute(UnknownElement.java:292)
at sun.reflect.GeneratedMethodAccessor4.invoke(Unknown Source)
at sun.reflect.DelegatingMethodAccessorImpl.invoke(DelegatingMethodAccessorImpl.java:43)
at java.lang.reflect.Method.invoke(Method.java:606)
at org.apache.tools.ant.dispatch.DispatchUtils.execute(DispatchUtils.java:106)
at org.apache.tools.ant.Task.perform(Task.java:348)
at org.apache.tools.ant.Target.execute(Target.java:435)
at org.apache.tools.ant.Target.performTasks(Target.java:456)
at org.apache.tools.ant.Project.executeSortedTargets(Project.java:1393)
at org.apache.tools.ant.helper.SingleCheckExecutor.executeTargets(SingleCheckExecutor.java:38)
at org.apache.tools.ant.Project.executeTargets(Project.java:1248)
at org.apache.tools.ant.taskdefs.Ant.execute(Ant.java:440)
at org.apache.tools.ant.taskdefs.CallTarget.execute(CallTarget.java:105)
at org.apache.tools.ant.UnknownElement.execute(UnknownElement.java:292)
at sun.reflect.GeneratedMethodAccessor4.invoke(Unknown Source)
at sun.reflect.DelegatingMethodAccessorImpl.invoke(DelegatingMethodAccessorImpl.java:43)
at java.lang.reflect.Method.invoke(Method.java:606)
at org.apache.tools.ant.dispatch.DispatchUtils.execute(DispatchUtils.java:106)
at org.apache.tools.ant.Task.perform(Task.java:348)
at org.apache.tools.ant.Target.execute(Target.java:435)
at org.apache.tools.ant.Target.performTasks(Target.java:456)
at org.apache.tools.ant.Project.executeSortedTargets(Project.java:1393)
at org.apache.tools.ant.helper.SingleCheckExecutor.executeTargets(SingleCheckExecutor.java:38)
at org.apache.tools.ant.Project.executeTargets(Project.java:1248)
at org.apache.tools.ant.taskdefs.Ant.execute(Ant.java:440)
at org.apache.tools.ant.UnknownElement.execute(UnknownElement.java:292)
at sun.reflect.GeneratedMethodAccessor4.invoke(Unknown Source)
at sun.reflect.DelegatingMethodAccessorImpl.invoke(DelegatingMethodAccessorImpl.java:43)
at java.lang.reflect.Method.invoke(Method.java:606)
at org.apache.tools.ant.dispatch.DispatchUtils.execute(DispatchUtils.java:106)
at org.apache.tools.ant.Task.perform(Task.java:348)
at org.apache.tools.ant.Target.execute(Target.java:435)
at org.apache.tools.ant.Target.performTasks(Target.java:456)
at org.apache.tools.ant.Project.executeSortedTargets(Project.java:1393)
at org.apache.tools.ant.Project.executeTarget(Project.java:1364)
at org.apache.tools.ant.helper.DefaultExecutor.executeTargets(DefaultExecutor.java:41)
at org.apache.tools.ant.Project.executeTargets(Project.java:1248)
at org.apache.tools.ant.Main.runBuild(Main.java:851)
at org.apache.tools.ant.Main.startAnt(Main.java:235)
at org.apache.tools.ant.launch.Launcher.run(Launcher.java:280)
at org.apache.tools.ant.launch.Launcher.main(Launcher.java:109)
Caused by: could not close client/server socket
at org.flexunit.ant.FlexUnitSocketThread.call(Unknown Source)
at java.util.concurrent.FutureTask.run(FutureTask.java:262)
at java.util.concurrent.ThreadPoolExecutor.runWorker(ThreadPoolExecutor.java:1145)
at java.util.concurrent.ThreadPoolExecutor$Worker.run(ThreadPoolExecutor.java:615)
at java.lang.Thread.run(Thread.java:745)
Total time: 19 minutes 22 seconds
Picked up JAVA_TOOL_OPTIONS: -Dfile.encoding=UTF8
Build step 'Invoke Ant' marked build as failure
Skipped archiving because build is not successful
Jenkins build is back to normal : flex-asjs #2143
Posted by fl...@gmail.com.
See <http://apacheflexbuild.cloudapp.net:8080/job/flex-asjs/2143/>
Build failed in Jenkins: flex-asjs #2142
Posted by fl...@gmail.com.
See <http://apacheflexbuild.cloudapp.net:8080/job/flex-asjs/2142/>
------------------------------------------
[...truncated 4265 lines...]
[java] BasicTests mxml: [org.apache.flex.states.State, halo.views.ButtonTests, org.apache.flex.states.AddItems, halo.views.CheckBoxTests, BasicTests, org.apache.flex.core.View]
[java] Compiling file: <http://apacheflexbuild.cloudapp.net:8080/job/flex-asjs/ws/mustella/tests/basicTests/bin/js-debug/shim/VBox.js>
[java] Compiling file: <http://apacheflexbuild.cloudapp.net:8080/job/flex-asjs/ws/mustella/tests/basicTests/bin/js-debug/halo/views/ButtonTests.js>
[java] halo.views.ButtonTests as: []
[java] halo.views.ButtonTests mxml: [org.apache.flex.html.TextButton, org.apache.flex.html.Label, halo.views.ButtonTests, shim.VBox, org.apache.flex.events.MouseEvent]
[java] Compiling file: <http://apacheflexbuild.cloudapp.net:8080/job/flex-asjs/ws/mustella/tests/basicTests/bin/js-debug/halo/views/CheckBoxTests.js>
[java] halo.views.CheckBoxTests as: []
[java] halo.views.CheckBoxTests mxml: [org.apache.flex.html.CheckBox, halo.views.CheckBoxTests, shim.VBox]
[java] originalPath: goog/array/array.js
[java] originalPath: goog/asserts/asserts.js
[java] originalPath: goog/base.js
[java] originalPath: goog/bootstrap/nodejs.js
[java] originalPath: goog/debug/entrypointregistry.js
[java] originalPath: goog/debug/error.js
[java] originalPath: goog/deps.js
[java] originalPath: goog/disposable/disposable.js
[java] originalPath: goog/disposable/idisposable.js
[java] originalPath: goog/dom/nodetype.js
[java] originalPath: goog/events/browserevent.js
[java] originalPath: goog/events/browserfeature.js
[java] originalPath: goog/events/event.js
[java] originalPath: goog/events/eventid.js
[java] originalPath: goog/events/events.js
[java] originalPath: goog/events/eventtarget.js
[java] originalPath: goog/events/eventtype.js
[java] originalPath: goog/events/listenable.js
[java] originalPath: goog/events/listener.js
[java] originalPath: goog/events/listenermap.js
[java] originalPath: goog/labs/useragent/browser.js
[java] originalPath: goog/labs/useragent/engine.js
[java] originalPath: goog/labs/useragent/platform.js
[java] originalPath: goog/labs/useragent/util.js
[java] originalPath: goog/object/object.js
[java] originalPath: goog/reflect/reflect.js
[java] originalPath: goog/string/string.js
[java] originalPath: goog/useragent/useragent.js
[java] sorted filename: bootstrap/nodejs.js
[java] sorted filename: base.js
[java] sorted filename: deps.js
[java] sorted filename: object/object.js
[java] sorted filename: object/object.js
[java] sorted filename: events/eventid.js
[java] sorted filename: events/listenable.js
[java] sorted filename: events/listener.js
[java] sorted filename: string/string.js
[java] sorted filename: dom/nodetype.js
[java] sorted filename: debug/error.js
[java] sorted filename: asserts/asserts.js
[java] sorted filename: array/array.js
[java] sorted filename: events/listenermap.js
[java] sorted filename: events/eventid.js
[java] sorted filename: events/listenable.js
[java] sorted filename: events/eventid.js
[java] sorted filename: disposable/idisposable.js
[java] sorted filename: disposable/disposable.js
[java] sorted filename: events/event.js
[java] sorted filename: object/object.js
[java] sorted filename: events/eventid.js
[java] sorted filename: events/listenable.js
[java] sorted filename: events/listener.js
[java] sorted filename: string/string.js
[java] sorted filename: dom/nodetype.js
[java] sorted filename: debug/error.js
[java] sorted filename: asserts/asserts.js
[java] sorted filename: array/array.js
[java] sorted filename: events/listenermap.js
[java] sorted filename: events/eventid.js
[java] sorted filename: events/listenable.js
[java] sorted filename: string/string.js
[java] sorted filename: reflect/reflect.js
[java] sorted filename: string/string.js
[java] sorted filename: labs/useragent/util.js
[java] sorted filename: string/string.js
[java] sorted filename: string/string.js
[java] sorted filename: labs/useragent/util.js
[java] sorted filename: labs/useragent/platform.js
[java] sorted filename: string/string.js
[java] sorted filename: string/string.js
[java] sorted filename: labs/useragent/util.js
[java] sorted filename: string/string.js
[java] sorted filename: dom/nodetype.js
[java] sorted filename: debug/error.js
[java] sorted filename: asserts/asserts.js
[java] sorted filename: array/array.js
[java] sorted filename: labs/useragent/engine.js
[java] sorted filename: string/string.js
[java] sorted filename: object/object.js
[java] sorted filename: string/string.js
[java] sorted filename: labs/useragent/util.js
[java] sorted filename: string/string.js
[java] sorted filename: dom/nodetype.js
[java] sorted filename: debug/error.js
[java] sorted filename: asserts/asserts.js
[java] sorted filename: array/array.js
[java] sorted filename: labs/useragent/browser.js
[java] sorted filename: useragent/useragent.js
[java] sorted filename: events/browserfeature.js
[java] sorted filename: string/string.js
[java] sorted filename: reflect/reflect.js
[java] sorted filename: string/string.js
[java] sorted filename: labs/useragent/util.js
[java] sorted filename: string/string.js
[java] sorted filename: string/string.js
[java] sorted filename: labs/useragent/util.js
[java] sorted filename: labs/useragent/platform.js
[java] sorted filename: string/string.js
[java] sorted filename: string/string.js
[java] sorted filename: labs/useragent/util.js
[java] sorted filename: string/string.js
[java] sorted filename: dom/nodetype.js
[java] sorted filename: debug/error.js
[java] sorted filename: asserts/asserts.js
[java] sorted filename: array/array.js
[java] sorted filename: labs/useragent/engine.js
[java] sorted filename: string/string.js
[java] sorted filename: object/object.js
[java] sorted filename: string/string.js
[java] sorted filename: labs/useragent/util.js
[java] sorted filename: string/string.js
[java] sorted filename: dom/nodetype.js
[java] sorted filename: debug/error.js
[java] sorted filename: asserts/asserts.js
[java] sorted filename: array/array.js
[java] sorted filename: labs/useragent/browser.js
[java] sorted filename: useragent/useragent.js
[java] sorted filename: reflect/reflect.js
[java] sorted filename: string/string.js
[java] sorted filename: reflect/reflect.js
[java] sorted filename: string/string.js
[java] sorted filename: labs/useragent/util.js
[java] sorted filename: string/string.js
[java] sorted filename: string/string.js
[java] sorted filename: labs/useragent/util.js
[java] sorted filename: labs/useragent/platform.js
[java] sorted filename: string/string.js
[java] sorted filename: string/string.js
[java] sorted filename: labs/useragent/util.js
[java] sorted filename: string/string.js
[java] sorted filename: dom/nodetype.js
[java] sorted filename: debug/error.js
[java] sorted filename: asserts/asserts.js
[java] sorted filename: array/array.js
[java] sorted filename: labs/useragent/engine.js
[java] sorted filename: string/string.js
[java] sorted filename: object/object.js
[java] sorted filename: string/string.js
[java] sorted filename: labs/useragent/util.js
[java] sorted filename: string/string.js
[java] sorted filename: dom/nodetype.js
[java] sorted filename: debug/error.js
[java] sorted filename: asserts/asserts.js
[java] sorted filename: array/array.js
[java] sorted filename: labs/useragent/browser.js
[java] sorted filename: useragent/useragent.js
[java] sorted filename: events/eventtype.js
[java] sorted filename: events/eventid.js
[java] sorted filename: disposable/idisposable.js
[java] sorted filename: disposable/disposable.js
[java] sorted filename: events/event.js
[java] sorted filename: string/string.js
[java] sorted filename: reflect/reflect.js
[java] sorted filename: string/string.js
[java] sorted filename: labs/useragent/util.js
[java] sorted filename: string/string.js
[java] sorted filename: string/string.js
[java] sorted filename: labs/useragent/util.js
[java] sorted filename: labs/useragent/platform.js
[java] sorted filename: string/string.js
[java] sorted filename: string/string.js
[java] sorted filename: labs/useragent/util.js
[java] sorted filename: string/string.js
[java] sorted filename: dom/nodetype.js
[java] sorted filename: debug/error.js
[java] sorted filename: asserts/asserts.js
[java] sorted filename: array/array.js
[java] sorted filename: labs/useragent/engine.js
[java] sorted filename: string/string.js
[java] sorted filename: object/object.js
[java] sorted filename: string/string.js
[java] sorted filename: labs/useragent/util.js
[java] sorted filename: string/string.js
[java] sorted filename: dom/nodetype.js
[java] sorted filename: debug/error.js
[java] sorted filename: asserts/asserts.js
[java] sorted filename: array/array.js
[java] sorted filename: labs/useragent/browser.js
[java] sorted filename: useragent/useragent.js
[java] sorted filename: events/browserfeature.js
[java] sorted filename: events/browserevent.js
[java] sorted filename: string/string.js
[java] sorted filename: dom/nodetype.js
[java] sorted filename: debug/error.js
[java] sorted filename: asserts/asserts.js
[java] sorted filename: debug/entrypointregistry.js
[java] sorted filename: string/string.js
[java] sorted filename: dom/nodetype.js
[java] sorted filename: debug/error.js
[java] sorted filename: asserts/asserts.js
[java] sorted filename: events/events.js
[java] sorted filename: string/string.js
[java] sorted filename: dom/nodetype.js
[java] sorted filename: debug/error.js
[java] sorted filename: asserts/asserts.js
[java] sorted filename: disposable/idisposable.js
[java] sorted filename: disposable/disposable.js
[java] sorted filename: events/eventtarget.js
[java] using SWC: c:\Adobe\flashPlayer\11.7\playerglobal.swc
[java] using SWC: <http://apacheflexbuild.cloudapp.net:8080/job/flex-asjs/ws/frameworks/libs/Binding.swc>
[java] using SWC: <http://apacheflexbuild.cloudapp.net:8080/job/flex-asjs/ws/frameworks/libs/Charts.swc>
[java] using SWC: <http://apacheflexbuild.cloudapp.net:8080/job/flex-asjs/ws/frameworks/libs/Collections.swc>
[java] using SWC: <http://apacheflexbuild.cloudapp.net:8080/job/flex-asjs/ws/frameworks/libs/Core.swc>
[java] using SWC: <http://apacheflexbuild.cloudapp.net:8080/job/flex-asjs/ws/frameworks/libs/CreateJS.swc>
[java] using SWC: <http://apacheflexbuild.cloudapp.net:8080/job/flex-asjs/ws/frameworks/libs/DragDrop.swc>
[java] using SWC: <http://apacheflexbuild.cloudapp.net:8080/job/flex-asjs/ws/frameworks/libs/Effects.swc>
[java] using SWC: <http://apacheflexbuild.cloudapp.net:8080/job/flex-asjs/ws/frameworks/libs/Express.swc>
[java] using SWC: <http://apacheflexbuild.cloudapp.net:8080/job/flex-asjs/ws/frameworks/libs/Flat.swc>
[java] using SWC: <http://apacheflexbuild.cloudapp.net:8080/job/flex-asjs/ws/frameworks/libs/FontAwesome.swc>
[java] using SWC: <http://apacheflexbuild.cloudapp.net:8080/job/flex-asjs/ws/frameworks/libs/Formatters.swc>
[java] using SWC: <http://apacheflexbuild.cloudapp.net:8080/job/flex-asjs/ws/frameworks/libs/GoogleMaps.swc>
[java] using SWC: <http://apacheflexbuild.cloudapp.net:8080/job/flex-asjs/ws/frameworks/libs/Graphics.swc>
[java] using SWC: <http://apacheflexbuild.cloudapp.net:8080/job/flex-asjs/ws/frameworks/libs/HTML.swc>
[java] using SWC: <http://apacheflexbuild.cloudapp.net:8080/job/flex-asjs/ws/frameworks/libs/HTML5.swc>
[java] using SWC: <http://apacheflexbuild.cloudapp.net:8080/job/flex-asjs/ws/frameworks/libs/jQuery.swc>
[java] using SWC: <http://apacheflexbuild.cloudapp.net:8080/job/flex-asjs/ws/frameworks/libs/Language.swc>
[java] using SWC: <http://apacheflexbuild.cloudapp.net:8080/job/flex-asjs/ws/frameworks/libs/MaterialDesignLite.swc>
[java] using SWC: <http://apacheflexbuild.cloudapp.net:8080/job/flex-asjs/ws/frameworks/libs/Mobile.swc>
[java] using SWC: <http://apacheflexbuild.cloudapp.net:8080/job/flex-asjs/ws/frameworks/libs/Network.swc>
[java] using SWC: <http://apacheflexbuild.cloudapp.net:8080/job/flex-asjs/ws/frameworks/libs/Reflection.swc>
[java] using SWC: <http://apacheflexbuild.cloudapp.net:8080/job/flex-asjs/ws/frameworks/libs/Storage.swc>
[java] using SWC: <http://apacheflexbuild.cloudapp.net:8080/job/flex-asjs/ws/frameworks/libs/XML.swc>
[java] using SWC: c:\Jenkins\workspace\flex-sdk\mustella\mustella.swc
[java] Could not find file for class: org.apache.flex.core.UIHTMLElementWrapper
[java] 81.2102465 seconds
[java] File not found: org.apache.flex.core.UIHTMLElementWrapper
[java]
[java]
[java] org.apache.flex.compiler.internal.graph.GoogDepsWriter.addDeps(GoogDepsWriter.java:357)org.apache.flex.compiler.internal.graph.GoogDepsWriter.addDeps(GoogDepsWriter.java:373)org.apache.flex.compiler.internal.graph.GoogDepsWriter.addDeps(GoogDepsWriter.java:373)org.apache.flex.compiler.internal.graph.GoogDepsWriter.addDeps(GoogDepsWriter.java:373)org.apache.flex.compiler.internal.graph.GoogDepsWriter.buildDB(GoogDepsWriter.java:198)org.apache.flex.compiler.internal.graph.GoogDepsWriter.getListOfFiles(GoogDepsWriter.java:96)org.apache.flex.compiler.internal.codegen.mxml.flexjs.MXMLFlexJSPublisher.publish(MXMLFlexJSPublisher.java:311)org.apache.flex.compiler.clients.MXMLJSC.compile(MXMLJSC.java:455)org.apache.flex.compiler.clients.MXMLJSC._mainNoExit(MXMLJSC.java:313)org.apache.flex.compiler.clients.MXMLJSC.mainNoExit(MXMLJSC.java:270)org.apache.flex.compiler.clients.MXMLJSC.staticMainNoExit(MXMLJSC.java:232)org.apache.flex.compiler.clients.MXMLJSC.main(MXMLJSC.java:176)
[java]
[java]
[java] Picked up JAVA_TOOL_OPTIONS: -Dfile.encoding=UTF8
[java] Java Result: 3
BUILD FAILED
<http://apacheflexbuild.cloudapp.net:8080/job/flex-asjs/ws/build.xml>:1265: condition satisfied
Total time: 35 minutes 17 seconds
Picked up JAVA_TOOL_OPTIONS: -Dfile.encoding=UTF8
Build step 'Invoke Ant' marked build as failure
Skipped archiving because build is not successful