You are viewing a plain text version of this content. The canonical link for it is here.
Posted to mapreduce-dev@hadoop.apache.org by Apache Jenkins Server <je...@builds.apache.org> on 2016/05/16 04:08:39 UTC

Hadoop-Mapreduce-trunk - Build # 3321 - Still Failing

See https://builds.apache.org/job/Hadoop-Mapreduce-trunk/3321/

###################################################################################
########################## LAST 60 LINES OF THE CONSOLE ###########################
[...truncated 32684 lines...]
[INFO] --- maven-antrun-plugin:1.7:run (create-testdirs) @ hadoop-mapreduce ---
[INFO] Executing tasks

main:
[INFO] Executed tasks
[INFO] 
[INFO] --- maven-antrun-plugin:1.7:run (tar) @ hadoop-mapreduce ---
[INFO] Executing tasks

main:
[INFO] Executed tasks
[INFO] 
[INFO] --- maven-site-plugin:3.5:attach-descriptor (attach-descriptor) @ hadoop-mapreduce ---
[INFO] 
[INFO] --- maven-enforcer-plugin:1.3.1:enforce (depcheck) @ hadoop-mapreduce ---
[INFO] 
[INFO] --- maven-install-plugin:2.5.1:install (default-install) @ hadoop-mapreduce ---
[INFO] Installing /home/jenkins/jenkins-slave/workspace/Hadoop-Mapreduce-trunk/hadoop-mapreduce-project/pom.xml to /home/jenkins/.m2/repository/org/apache/hadoop/hadoop-mapreduce/3.0.0-alpha1-SNAPSHOT/hadoop-mapreduce-3.0.0-alpha1-SNAPSHOT.pom
[INFO] ------------------------------------------------------------------------
[INFO] Reactor Summary:
[INFO] 
[INFO] Apache Hadoop MapReduce Client .................... SUCCESS [  2.864 s]
[INFO] Apache Hadoop MapReduce Core ...................... SUCCESS [01:50 min]
[INFO] Apache Hadoop MapReduce Common .................... SUCCESS [ 27.981 s]
[INFO] Apache Hadoop MapReduce Shuffle ................... SUCCESS [  5.057 s]
[INFO] Apache Hadoop MapReduce App ....................... SUCCESS [08:27 min]
[INFO] Apache Hadoop MapReduce HistoryServer ............. SUCCESS [05:49 min]
[INFO] Apache Hadoop MapReduce JobClient ................. FAILURE [  01:44 h]
[INFO] Apache Hadoop MapReduce HistoryServer Plugins ..... SUCCESS [  1.424 s]
[INFO] Apache Hadoop MapReduce NativeTask ................ SUCCESS [09:33 min]
[INFO] Apache Hadoop MapReduce Examples .................. SKIPPED
[INFO] Apache Hadoop MapReduce ........................... SUCCESS [  0.316 s]
[INFO] ------------------------------------------------------------------------
[INFO] BUILD FAILURE
[INFO] ------------------------------------------------------------------------
[INFO] Total time: 02:11 h
[INFO] Finished at: 2016-05-16T04:08:23+00:00
[INFO] Final Memory: 35M/598M
[INFO] ------------------------------------------------------------------------
[WARNING] The requested profile "parallel-tests" could not be activated because it does not exist.
[ERROR] Failed to execute goal org.apache.maven.plugins:maven-surefire-plugin:2.17:test (default-test) on project hadoop-mapreduce-client-jobclient: There are test failures.
[ERROR] 
[ERROR] Please refer to /home/jenkins/jenkins-slave/workspace/Hadoop-Mapreduce-trunk/hadoop-mapreduce-project/hadoop-mapreduce-client/hadoop-mapreduce-client-jobclient/target/surefire-reports for the individual test results.
[ERROR] -> [Help 1]
[ERROR] 
[ERROR] To see the full stack trace of the errors, re-run Maven with the -e switch.
[ERROR] Re-run Maven using the -X switch to enable full debug logging.
[ERROR] 
[ERROR] For more information about the errors and possible solutions, please read the following articles:
[ERROR] [Help 1] http://cwiki.apache.org/confluence/display/MAVEN/MojoFailureException
[ERROR] 
[ERROR] After correcting the problems, you can resume the build with the command
[ERROR]   mvn <goals> -rf :hadoop-mapreduce-client-jobclient
Build step 'Execute shell' marked build as failure
[FINDBUGS] Skipping publisher since build result is FAILURE
Archiving artifacts
Recording test results
Email was triggered for: Failure - Any
Sending email for trigger: Failure - Any



###################################################################################
############################## FAILED TESTS (if any) ##############################
2 tests failed.
FAILED:  org.apache.hadoop.mapred.TestMiniMRChildTask.testTaskEnv

Error Message:
The environment checker job failed.

Stack Trace:
java.lang.AssertionError: The environment checker job failed.
	at org.junit.Assert.fail(Assert.java:88)
	at org.junit.Assert.assertTrue(Assert.java:41)
	at org.apache.hadoop.mapred.TestMiniMRChildTask.runTestTaskEnv(TestMiniMRChildTask.java:550)
	at org.apache.hadoop.mapred.TestMiniMRChildTask.testTaskEnv(TestMiniMRChildTask.java:472)


FAILED:  org.apache.hadoop.mapred.TestMiniMRChildTask.testTaskOldEnv

Error Message:
The environment checker job failed.

Stack Trace:
java.lang.AssertionError: The environment checker job failed.
	at org.junit.Assert.fail(Assert.java:88)
	at org.junit.Assert.assertTrue(Assert.java:41)
	at org.apache.hadoop.mapred.TestMiniMRChildTask.runTestTaskEnv(TestMiniMRChildTask.java:550)
	at org.apache.hadoop.mapred.TestMiniMRChildTask.testTaskOldEnv(TestMiniMRChildTask.java:496)




Hadoop-Mapreduce-trunk - Build # 3328 - Still Failing

Posted by Apache Jenkins Server <je...@builds.apache.org>.
See https://builds.apache.org/job/Hadoop-Mapreduce-trunk/3328/

###################################################################################
########################## LAST 60 LINES OF THE CONSOLE ###########################
[...truncated 315 lines...]
[INFO] ------------------------------------------------------------------------
[INFO] Building Apache Hadoop MapReduce 3.0.0-alpha1-SNAPSHOT
[INFO] ------------------------------------------------------------------------
[INFO] 
[INFO] --- maven-antrun-plugin:1.7:run (create-testdirs) @ hadoop-mapreduce ---
[INFO] Executing tasks

main:
    [mkdir] Created dir: /home/jenkins/jenkins-slave/workspace/Hadoop-Mapreduce-trunk/hadoop-mapreduce-project/target/test-dir
[INFO] Executed tasks
[INFO] 
[INFO] --- maven-antrun-plugin:1.7:run (tar) @ hadoop-mapreduce ---
[INFO] Executing tasks

main:
[INFO] Executed tasks
[INFO] 
[INFO] --- maven-site-plugin:3.5:attach-descriptor (attach-descriptor) @ hadoop-mapreduce ---
[INFO] 
[INFO] --- maven-enforcer-plugin:1.3.1:enforce (depcheck) @ hadoop-mapreduce ---
[INFO] 
[INFO] --- maven-install-plugin:2.5.1:install (default-install) @ hadoop-mapreduce ---
[INFO] Installing /home/jenkins/jenkins-slave/workspace/Hadoop-Mapreduce-trunk/hadoop-mapreduce-project/pom.xml to /home/jenkins/.m2/repository/org/apache/hadoop/hadoop-mapreduce/3.0.0-alpha1-SNAPSHOT/hadoop-mapreduce-3.0.0-alpha1-SNAPSHOT.pom
[INFO] ------------------------------------------------------------------------
[INFO] Reactor Summary:
[INFO] 
[INFO] Apache Hadoop MapReduce Client .................... FAILURE [  2.955 s]
[INFO] Apache Hadoop MapReduce Core ...................... SKIPPED
[INFO] Apache Hadoop MapReduce Common .................... SKIPPED
[INFO] Apache Hadoop MapReduce Shuffle ................... SKIPPED
[INFO] Apache Hadoop MapReduce App ....................... SKIPPED
[INFO] Apache Hadoop MapReduce HistoryServer ............. SKIPPED
[INFO] Apache Hadoop MapReduce JobClient ................. SKIPPED
[INFO] Apache Hadoop MapReduce HistoryServer Plugins ..... SKIPPED
[INFO] Apache Hadoop MapReduce NativeTask ................ SKIPPED
[INFO] Apache Hadoop MapReduce Examples .................. SKIPPED
[INFO] Apache Hadoop MapReduce ........................... SUCCESS [  0.522 s]
[INFO] ------------------------------------------------------------------------
[INFO] BUILD FAILURE
[INFO] ------------------------------------------------------------------------
[INFO] Total time: 4.921 s
[INFO] Finished at: 2016-05-17T01:30:54+00:00
[INFO] Final Memory: 23M/723M
[INFO] ------------------------------------------------------------------------
[WARNING] The requested profile "parallel-tests" could not be activated because it does not exist.
[ERROR] Failed to execute goal org.apache.maven.plugins:maven-enforcer-plugin:1.3.1:enforce (depcheck) on project hadoop-mapreduce-client: Some Enforcer rules have failed. Look above for specific messages explaining why the rule failed. -> [Help 1]
[ERROR] 
[ERROR] To see the full stack trace of the errors, re-run Maven with the -e switch.
[ERROR] Re-run Maven using the -X switch to enable full debug logging.
[ERROR] 
[ERROR] For more information about the errors and possible solutions, please read the following articles:
[ERROR] [Help 1] http://cwiki.apache.org/confluence/display/MAVEN/MojoExecutionException
Build step 'Execute shell' marked build as failure
[FINDBUGS] Skipping publisher since build result is FAILURE
Archiving artifacts
Recording test results
ERROR: Step ?Publish JUnit test result report? failed: No test report files were found. Configuration error?
Email was triggered for: Failure - Any
Sending email for trigger: Failure - Any



###################################################################################
############################## FAILED TESTS (if any) ##############################
No tests ran.

Hadoop-Mapreduce-trunk - Build # 3327 - Still Failing

Posted by Apache Jenkins Server <je...@builds.apache.org>.
See https://builds.apache.org/job/Hadoop-Mapreduce-trunk/3327/

###################################################################################
########################## LAST 60 LINES OF THE CONSOLE ###########################
[...truncated 6054 lines...]
and
+-org.apache.hadoop:hadoop-mapreduce:3.0.0-alpha1-SNAPSHOT
  +-org.apache.hadoop:hadoop-annotations:3.0.0-alpha1-20160516.224859-15
and
+-org.apache.hadoop:hadoop-mapreduce:3.0.0-alpha1-SNAPSHOT
  +-org.apache.hadoop:hadoop-common:3.0.0-alpha1-20160516.224934-10
    +-org.apache.hadoop:hadoop-annotations:3.0.0-alpha1-SNAPSHOT

[WARNING] Rule 0: org.apache.maven.plugins.enforcer.DependencyConvergence failed with message:
Failed while enforcing releasability the error(s) are [
Dependency convergence error for org.apache.hadoop:hadoop-annotations:3.0.0-alpha1-SNAPSHOT paths to dependency are:
+-org.apache.hadoop:hadoop-mapreduce:3.0.0-alpha1-SNAPSHOT
  +-org.apache.hadoop:hadoop-common:3.0.0-alpha1-20160516.224934-10
    +-org.apache.hadoop:hadoop-annotations:3.0.0-alpha1-SNAPSHOT
and
+-org.apache.hadoop:hadoop-mapreduce:3.0.0-alpha1-SNAPSHOT
  +-org.apache.hadoop:hadoop-annotations:3.0.0-alpha1-20160516.224859-15
and
+-org.apache.hadoop:hadoop-mapreduce:3.0.0-alpha1-SNAPSHOT
  +-org.apache.hadoop:hadoop-common:3.0.0-alpha1-20160516.224934-10
    +-org.apache.hadoop:hadoop-annotations:3.0.0-alpha1-SNAPSHOT
]
[INFO] ------------------------------------------------------------------------
[INFO] Reactor Summary:
[INFO] 
[INFO] Apache Hadoop MapReduce Client .................... FAILURE [  8.146 s]
[INFO] Apache Hadoop MapReduce Core ...................... SKIPPED
[INFO] Apache Hadoop MapReduce Common .................... SKIPPED
[INFO] Apache Hadoop MapReduce Shuffle ................... SKIPPED
[INFO] Apache Hadoop MapReduce App ....................... SKIPPED
[INFO] Apache Hadoop MapReduce HistoryServer ............. SKIPPED
[INFO] Apache Hadoop MapReduce JobClient ................. SKIPPED
[INFO] Apache Hadoop MapReduce HistoryServer Plugins ..... SKIPPED
[INFO] Apache Hadoop MapReduce NativeTask ................ SKIPPED
[INFO] Apache Hadoop MapReduce Examples .................. SKIPPED
[INFO] Apache Hadoop MapReduce ........................... FAILURE [  0.516 s]
[INFO] ------------------------------------------------------------------------
[INFO] BUILD FAILURE
[INFO] ------------------------------------------------------------------------
[INFO] Total time: 10.439 s
[INFO] Finished at: 2016-05-17T00:33:29+00:00
[INFO] Final Memory: 29M/913M
[INFO] ------------------------------------------------------------------------
[WARNING] The requested profile "parallel-tests" could not be activated because it does not exist.
[ERROR] Failed to execute goal org.apache.maven.plugins:maven-enforcer-plugin:1.3.1:enforce (depcheck) on project hadoop-mapreduce-client: Some Enforcer rules have failed. Look above for specific messages explaining why the rule failed. -> [Help 1]
[ERROR] Failed to execute goal org.apache.maven.plugins:maven-enforcer-plugin:1.3.1:enforce (depcheck) on project hadoop-mapreduce: Some Enforcer rules have failed. Look above for specific messages explaining why the rule failed. -> [Help 1]
[ERROR] 
[ERROR] To see the full stack trace of the errors, re-run Maven with the -e switch.
[ERROR] Re-run Maven using the -X switch to enable full debug logging.
[ERROR] 
[ERROR] For more information about the errors and possible solutions, please read the following articles:
[ERROR] [Help 1] http://cwiki.apache.org/confluence/display/MAVEN/MojoExecutionException
Build step 'Execute shell' marked build as failure
[FINDBUGS] Skipping publisher since build result is FAILURE
Archiving artifacts
Recording test results
ERROR: Step ?Publish JUnit test result report? failed: No test report files were found. Configuration error?
Email was triggered for: Failure - Any
Sending email for trigger: Failure - Any



###################################################################################
############################## FAILED TESTS (if any) ##############################
No tests ran.

Hadoop-Mapreduce-trunk - Build # 3326 - Still Failing

Posted by Apache Jenkins Server <je...@builds.apache.org>.
See https://builds.apache.org/job/Hadoop-Mapreduce-trunk/3326/

###################################################################################
########################## LAST 60 LINES OF THE CONSOLE ###########################
[...truncated 316 lines...]
[INFO] ------------------------------------------------------------------------
[INFO] Building Apache Hadoop MapReduce 3.0.0-alpha1-SNAPSHOT
[INFO] ------------------------------------------------------------------------
[INFO] 
[INFO] --- maven-antrun-plugin:1.7:run (create-testdirs) @ hadoop-mapreduce ---
[INFO] Executing tasks

main:
    [mkdir] Created dir: /home/jenkins/jenkins-slave/workspace/Hadoop-Mapreduce-trunk/hadoop-mapreduce-project/target/test-dir
[INFO] Executed tasks
[INFO] 
[INFO] --- maven-antrun-plugin:1.7:run (tar) @ hadoop-mapreduce ---
[INFO] Executing tasks

main:
[INFO] Executed tasks
[INFO] 
[INFO] --- maven-site-plugin:3.5:attach-descriptor (attach-descriptor) @ hadoop-mapreduce ---
[INFO] 
[INFO] --- maven-enforcer-plugin:1.3.1:enforce (depcheck) @ hadoop-mapreduce ---
[INFO] 
[INFO] --- maven-install-plugin:2.5.1:install (default-install) @ hadoop-mapreduce ---
[INFO] Installing /home/jenkins/jenkins-slave/workspace/Hadoop-Mapreduce-trunk/hadoop-mapreduce-project/pom.xml to /home/jenkins/.m2/repository/org/apache/hadoop/hadoop-mapreduce/3.0.0-alpha1-SNAPSHOT/hadoop-mapreduce-3.0.0-alpha1-SNAPSHOT.pom
[INFO] ------------------------------------------------------------------------
[INFO] Reactor Summary:
[INFO] 
[INFO] Apache Hadoop MapReduce Client .................... FAILURE [  3.147 s]
[INFO] Apache Hadoop MapReduce Core ...................... SKIPPED
[INFO] Apache Hadoop MapReduce Common .................... SKIPPED
[INFO] Apache Hadoop MapReduce Shuffle ................... SKIPPED
[INFO] Apache Hadoop MapReduce App ....................... SKIPPED
[INFO] Apache Hadoop MapReduce HistoryServer ............. SKIPPED
[INFO] Apache Hadoop MapReduce JobClient ................. SKIPPED
[INFO] Apache Hadoop MapReduce HistoryServer Plugins ..... SKIPPED
[INFO] Apache Hadoop MapReduce NativeTask ................ SKIPPED
[INFO] Apache Hadoop MapReduce Examples .................. SKIPPED
[INFO] Apache Hadoop MapReduce ........................... SUCCESS [  0.486 s]
[INFO] ------------------------------------------------------------------------
[INFO] BUILD FAILURE
[INFO] ------------------------------------------------------------------------
[INFO] Total time: 5.196 s
[INFO] Finished at: 2016-05-16T23:06:31+00:00
[INFO] Final Memory: 23M/723M
[INFO] ------------------------------------------------------------------------
[WARNING] The requested profile "parallel-tests" could not be activated because it does not exist.
[ERROR] Failed to execute goal org.apache.maven.plugins:maven-enforcer-plugin:1.3.1:enforce (depcheck) on project hadoop-mapreduce-client: Some Enforcer rules have failed. Look above for specific messages explaining why the rule failed. -> [Help 1]
[ERROR] 
[ERROR] To see the full stack trace of the errors, re-run Maven with the -e switch.
[ERROR] Re-run Maven using the -X switch to enable full debug logging.
[ERROR] 
[ERROR] For more information about the errors and possible solutions, please read the following articles:
[ERROR] [Help 1] http://cwiki.apache.org/confluence/display/MAVEN/MojoExecutionException
Build step 'Execute shell' marked build as failure
[FINDBUGS] Skipping publisher since build result is FAILURE
Archiving artifacts
Recording test results
ERROR: Step ?Publish JUnit test result report? failed: No test report files were found. Configuration error?
Email was triggered for: Failure - Any
Sending email for trigger: Failure - Any



###################################################################################
############################## FAILED TESTS (if any) ##############################
No tests ran.

Hadoop-Mapreduce-trunk - Build # 3325 - Still Failing

Posted by Apache Jenkins Server <je...@builds.apache.org>.
See https://builds.apache.org/job/Hadoop-Mapreduce-trunk/3325/

###################################################################################
########################## LAST 60 LINES OF THE CONSOLE ###########################
[...truncated 32703 lines...]
[INFO] --- maven-antrun-plugin:1.7:run (create-testdirs) @ hadoop-mapreduce ---
[INFO] Executing tasks

main:
[INFO] Executed tasks
[INFO] 
[INFO] --- maven-antrun-plugin:1.7:run (tar) @ hadoop-mapreduce ---
[INFO] Executing tasks

main:
[INFO] Executed tasks
[INFO] 
[INFO] --- maven-site-plugin:3.5:attach-descriptor (attach-descriptor) @ hadoop-mapreduce ---
[INFO] 
[INFO] --- maven-enforcer-plugin:1.3.1:enforce (depcheck) @ hadoop-mapreduce ---
[INFO] 
[INFO] --- maven-install-plugin:2.5.1:install (default-install) @ hadoop-mapreduce ---
[INFO] Installing /home/jenkins/jenkins-slave/workspace/Hadoop-Mapreduce-trunk/hadoop-mapreduce-project/pom.xml to /home/jenkins/.m2/repository/org/apache/hadoop/hadoop-mapreduce/3.0.0-alpha1-SNAPSHOT/hadoop-mapreduce-3.0.0-alpha1-SNAPSHOT.pom
[INFO] ------------------------------------------------------------------------
[INFO] Reactor Summary:
[INFO] 
[INFO] Apache Hadoop MapReduce Client .................... SUCCESS [  3.458 s]
[INFO] Apache Hadoop MapReduce Core ...................... SUCCESS [02:09 min]
[INFO] Apache Hadoop MapReduce Common .................... SUCCESS [ 31.947 s]
[INFO] Apache Hadoop MapReduce Shuffle ................... SUCCESS [  6.675 s]
[INFO] Apache Hadoop MapReduce App ....................... SUCCESS [08:45 min]
[INFO] Apache Hadoop MapReduce HistoryServer ............. SUCCESS [06:04 min]
[INFO] Apache Hadoop MapReduce JobClient ................. FAILURE [  01:48 h]
[INFO] Apache Hadoop MapReduce HistoryServer Plugins ..... SUCCESS [  1.653 s]
[INFO] Apache Hadoop MapReduce NativeTask ................ SUCCESS [12:08 min]
[INFO] Apache Hadoop MapReduce Examples .................. SKIPPED
[INFO] Apache Hadoop MapReduce ........................... SUCCESS [  0.302 s]
[INFO] ------------------------------------------------------------------------
[INFO] BUILD FAILURE
[INFO] ------------------------------------------------------------------------
[INFO] Total time: 02:18 h
[INFO] Finished at: 2016-05-16T22:40:51+00:00
[INFO] Final Memory: 35M/599M
[INFO] ------------------------------------------------------------------------
[WARNING] The requested profile "parallel-tests" could not be activated because it does not exist.
[ERROR] Failed to execute goal org.apache.maven.plugins:maven-surefire-plugin:2.17:test (default-test) on project hadoop-mapreduce-client-jobclient: There are test failures.
[ERROR] 
[ERROR] Please refer to /home/jenkins/jenkins-slave/workspace/Hadoop-Mapreduce-trunk/hadoop-mapreduce-project/hadoop-mapreduce-client/hadoop-mapreduce-client-jobclient/target/surefire-reports for the individual test results.
[ERROR] -> [Help 1]
[ERROR] 
[ERROR] To see the full stack trace of the errors, re-run Maven with the -e switch.
[ERROR] Re-run Maven using the -X switch to enable full debug logging.
[ERROR] 
[ERROR] For more information about the errors and possible solutions, please read the following articles:
[ERROR] [Help 1] http://cwiki.apache.org/confluence/display/MAVEN/MojoFailureException
[ERROR] 
[ERROR] After correcting the problems, you can resume the build with the command
[ERROR]   mvn <goals> -rf :hadoop-mapreduce-client-jobclient
Build step 'Execute shell' marked build as failure
[FINDBUGS] Skipping publisher since build result is FAILURE
Archiving artifacts
Recording test results
Email was triggered for: Failure - Any
Sending email for trigger: Failure - Any



###################################################################################
############################## FAILED TESTS (if any) ##############################
3 tests failed.
FAILED:  org.apache.hadoop.mapred.TestMRCJCFileOutputCommitter.testAbort

Error Message:
Output directory not empty expected:<0> but was:<4>

Stack Trace:
java.lang.AssertionError: Output directory not empty expected:<0> but was:<4>
	at org.junit.Assert.fail(Assert.java:88)
	at org.junit.Assert.failNotEquals(Assert.java:743)
	at org.junit.Assert.assertEquals(Assert.java:118)
	at org.junit.Assert.assertEquals(Assert.java:555)
	at org.apache.hadoop.mapred.TestMRCJCFileOutputCommitter.testAbort(TestMRCJCFileOutputCommitter.java:153)


FAILED:  org.apache.hadoop.mapred.TestMiniMRChildTask.testTaskEnv

Error Message:
The environment checker job failed.

Stack Trace:
java.lang.AssertionError: The environment checker job failed.
	at org.junit.Assert.fail(Assert.java:88)
	at org.junit.Assert.assertTrue(Assert.java:41)
	at org.apache.hadoop.mapred.TestMiniMRChildTask.runTestTaskEnv(TestMiniMRChildTask.java:550)
	at org.apache.hadoop.mapred.TestMiniMRChildTask.testTaskEnv(TestMiniMRChildTask.java:472)


FAILED:  org.apache.hadoop.mapred.TestMiniMRChildTask.testTaskOldEnv

Error Message:
The environment checker job failed.

Stack Trace:
java.lang.AssertionError: The environment checker job failed.
	at org.junit.Assert.fail(Assert.java:88)
	at org.junit.Assert.assertTrue(Assert.java:41)
	at org.apache.hadoop.mapred.TestMiniMRChildTask.runTestTaskEnv(TestMiniMRChildTask.java:550)
	at org.apache.hadoop.mapred.TestMiniMRChildTask.testTaskOldEnv(TestMiniMRChildTask.java:496)




Hadoop-Mapreduce-trunk - Build # 3324 - Still Failing

Posted by Apache Jenkins Server <je...@builds.apache.org>.
See https://builds.apache.org/job/Hadoop-Mapreduce-trunk/3324/

###################################################################################
########################## LAST 60 LINES OF THE CONSOLE ###########################
[...truncated 32686 lines...]
[INFO] --- maven-antrun-plugin:1.7:run (create-testdirs) @ hadoop-mapreduce ---
[INFO] Executing tasks

main:
[INFO] Executed tasks
[INFO] 
[INFO] --- maven-antrun-plugin:1.7:run (tar) @ hadoop-mapreduce ---
[INFO] Executing tasks

main:
[INFO] Executed tasks
[INFO] 
[INFO] --- maven-site-plugin:3.5:attach-descriptor (attach-descriptor) @ hadoop-mapreduce ---
[INFO] 
[INFO] --- maven-enforcer-plugin:1.3.1:enforce (depcheck) @ hadoop-mapreduce ---
[INFO] 
[INFO] --- maven-install-plugin:2.5.1:install (default-install) @ hadoop-mapreduce ---
[INFO] Installing /home/jenkins/jenkins-slave/workspace/Hadoop-Mapreduce-trunk/hadoop-mapreduce-project/pom.xml to /home/jenkins/.m2/repository/org/apache/hadoop/hadoop-mapreduce/3.0.0-alpha1-SNAPSHOT/hadoop-mapreduce-3.0.0-alpha1-SNAPSHOT.pom
[INFO] ------------------------------------------------------------------------
[INFO] Reactor Summary:
[INFO] 
[INFO] Apache Hadoop MapReduce Client .................... SUCCESS [  2.861 s]
[INFO] Apache Hadoop MapReduce Core ...................... SUCCESS [01:51 min]
[INFO] Apache Hadoop MapReduce Common .................... SUCCESS [ 28.769 s]
[INFO] Apache Hadoop MapReduce Shuffle ................... SUCCESS [  5.031 s]
[INFO] Apache Hadoop MapReduce App ....................... SUCCESS [08:32 min]
[INFO] Apache Hadoop MapReduce HistoryServer ............. SUCCESS [05:51 min]
[INFO] Apache Hadoop MapReduce JobClient ................. FAILURE [  01:42 h]
[INFO] Apache Hadoop MapReduce HistoryServer Plugins ..... SUCCESS [  1.461 s]
[INFO] Apache Hadoop MapReduce NativeTask ................ SUCCESS [08:48 min]
[INFO] Apache Hadoop MapReduce Examples .................. SKIPPED
[INFO] Apache Hadoop MapReduce ........................... SUCCESS [  0.244 s]
[INFO] ------------------------------------------------------------------------
[INFO] BUILD FAILURE
[INFO] ------------------------------------------------------------------------
[INFO] Total time: 02:08 h
[INFO] Finished at: 2016-05-16T19:05:38+00:00
[INFO] Final Memory: 36M/603M
[INFO] ------------------------------------------------------------------------
[WARNING] The requested profile "parallel-tests" could not be activated because it does not exist.
[ERROR] Failed to execute goal org.apache.maven.plugins:maven-surefire-plugin:2.17:test (default-test) on project hadoop-mapreduce-client-jobclient: There are test failures.
[ERROR] 
[ERROR] Please refer to /home/jenkins/jenkins-slave/workspace/Hadoop-Mapreduce-trunk/hadoop-mapreduce-project/hadoop-mapreduce-client/hadoop-mapreduce-client-jobclient/target/surefire-reports for the individual test results.
[ERROR] -> [Help 1]
[ERROR] 
[ERROR] To see the full stack trace of the errors, re-run Maven with the -e switch.
[ERROR] Re-run Maven using the -X switch to enable full debug logging.
[ERROR] 
[ERROR] For more information about the errors and possible solutions, please read the following articles:
[ERROR] [Help 1] http://cwiki.apache.org/confluence/display/MAVEN/MojoFailureException
[ERROR] 
[ERROR] After correcting the problems, you can resume the build with the command
[ERROR]   mvn <goals> -rf :hadoop-mapreduce-client-jobclient
Build step 'Execute shell' marked build as failure
[FINDBUGS] Skipping publisher since build result is FAILURE
Archiving artifacts
Recording test results
Email was triggered for: Failure - Any
Sending email for trigger: Failure - Any



###################################################################################
############################## FAILED TESTS (if any) ##############################
2 tests failed.
FAILED:  org.apache.hadoop.mapred.TestMiniMRChildTask.testTaskEnv

Error Message:
The environment checker job failed.

Stack Trace:
java.lang.AssertionError: The environment checker job failed.
	at org.junit.Assert.fail(Assert.java:88)
	at org.junit.Assert.assertTrue(Assert.java:41)
	at org.apache.hadoop.mapred.TestMiniMRChildTask.runTestTaskEnv(TestMiniMRChildTask.java:550)
	at org.apache.hadoop.mapred.TestMiniMRChildTask.testTaskEnv(TestMiniMRChildTask.java:472)


FAILED:  org.apache.hadoop.mapred.TestMiniMRChildTask.testTaskOldEnv

Error Message:
The environment checker job failed.

Stack Trace:
java.lang.AssertionError: The environment checker job failed.
	at org.junit.Assert.fail(Assert.java:88)
	at org.junit.Assert.assertTrue(Assert.java:41)
	at org.apache.hadoop.mapred.TestMiniMRChildTask.runTestTaskEnv(TestMiniMRChildTask.java:550)
	at org.apache.hadoop.mapred.TestMiniMRChildTask.testTaskOldEnv(TestMiniMRChildTask.java:496)




Hadoop-Mapreduce-trunk - Build # 3323 - Still Failing

Posted by Apache Jenkins Server <je...@builds.apache.org>.
See https://builds.apache.org/job/Hadoop-Mapreduce-trunk/3323/

###################################################################################
########################## LAST 60 LINES OF THE CONSOLE ###########################
[...truncated 32691 lines...]
[INFO] --- maven-antrun-plugin:1.7:run (create-testdirs) @ hadoop-mapreduce ---
[INFO] Executing tasks

main:
[INFO] Executed tasks
[INFO] 
[INFO] --- maven-antrun-plugin:1.7:run (tar) @ hadoop-mapreduce ---
[INFO] Executing tasks

main:
[INFO] Executed tasks
[INFO] 
[INFO] --- maven-site-plugin:3.5:attach-descriptor (attach-descriptor) @ hadoop-mapreduce ---
[INFO] 
[INFO] --- maven-enforcer-plugin:1.3.1:enforce (depcheck) @ hadoop-mapreduce ---
[INFO] 
[INFO] --- maven-install-plugin:2.5.1:install (default-install) @ hadoop-mapreduce ---
[INFO] Installing /home/jenkins/jenkins-slave/workspace/Hadoop-Mapreduce-trunk/hadoop-mapreduce-project/pom.xml to /home/jenkins/.m2/repository/org/apache/hadoop/hadoop-mapreduce/3.0.0-alpha1-SNAPSHOT/hadoop-mapreduce-3.0.0-alpha1-SNAPSHOT.pom
[INFO] ------------------------------------------------------------------------
[INFO] Reactor Summary:
[INFO] 
[INFO] Apache Hadoop MapReduce Client .................... SUCCESS [  2.902 s]
[INFO] Apache Hadoop MapReduce Core ...................... SUCCESS [01:58 min]
[INFO] Apache Hadoop MapReduce Common .................... SUCCESS [ 30.022 s]
[INFO] Apache Hadoop MapReduce Shuffle ................... SUCCESS [  5.271 s]
[INFO] Apache Hadoop MapReduce App ....................... SUCCESS [08:49 min]
[INFO] Apache Hadoop MapReduce HistoryServer ............. SUCCESS [05:59 min]
[INFO] Apache Hadoop MapReduce JobClient ................. FAILURE [  01:46 h]
[INFO] Apache Hadoop MapReduce HistoryServer Plugins ..... SUCCESS [  1.398 s]
[INFO] Apache Hadoop MapReduce NativeTask ................ SUCCESS [08:48 min]
[INFO] Apache Hadoop MapReduce Examples .................. SKIPPED
[INFO] Apache Hadoop MapReduce ........................... SUCCESS [  0.245 s]
[INFO] ------------------------------------------------------------------------
[INFO] BUILD FAILURE
[INFO] ------------------------------------------------------------------------
[INFO] Total time: 02:12 h
[INFO] Finished at: 2016-05-16T10:54:13+00:00
[INFO] Final Memory: 35M/592M
[INFO] ------------------------------------------------------------------------
[WARNING] The requested profile "parallel-tests" could not be activated because it does not exist.
[ERROR] Failed to execute goal org.apache.maven.plugins:maven-surefire-plugin:2.17:test (default-test) on project hadoop-mapreduce-client-jobclient: There are test failures.
[ERROR] 
[ERROR] Please refer to /home/jenkins/jenkins-slave/workspace/Hadoop-Mapreduce-trunk/hadoop-mapreduce-project/hadoop-mapreduce-client/hadoop-mapreduce-client-jobclient/target/surefire-reports for the individual test results.
[ERROR] -> [Help 1]
[ERROR] 
[ERROR] To see the full stack trace of the errors, re-run Maven with the -e switch.
[ERROR] Re-run Maven using the -X switch to enable full debug logging.
[ERROR] 
[ERROR] For more information about the errors and possible solutions, please read the following articles:
[ERROR] [Help 1] http://cwiki.apache.org/confluence/display/MAVEN/MojoFailureException
[ERROR] 
[ERROR] After correcting the problems, you can resume the build with the command
[ERROR]   mvn <goals> -rf :hadoop-mapreduce-client-jobclient
Build step 'Execute shell' marked build as failure
[FINDBUGS] Skipping publisher since build result is FAILURE
Archiving artifacts
Recording test results
Email was triggered for: Failure - Any
Sending email for trigger: Failure - Any



###################################################################################
############################## FAILED TESTS (if any) ##############################
2 tests failed.
FAILED:  org.apache.hadoop.mapred.TestMiniMRChildTask.testTaskEnv

Error Message:
The environment checker job failed.

Stack Trace:
java.lang.AssertionError: The environment checker job failed.
	at org.junit.Assert.fail(Assert.java:88)
	at org.junit.Assert.assertTrue(Assert.java:41)
	at org.apache.hadoop.mapred.TestMiniMRChildTask.runTestTaskEnv(TestMiniMRChildTask.java:550)
	at org.apache.hadoop.mapred.TestMiniMRChildTask.testTaskEnv(TestMiniMRChildTask.java:472)


FAILED:  org.apache.hadoop.mapred.TestMiniMRChildTask.testTaskOldEnv

Error Message:
The environment checker job failed.

Stack Trace:
java.lang.AssertionError: The environment checker job failed.
	at org.junit.Assert.fail(Assert.java:88)
	at org.junit.Assert.assertTrue(Assert.java:41)
	at org.apache.hadoop.mapred.TestMiniMRChildTask.runTestTaskEnv(TestMiniMRChildTask.java:550)
	at org.apache.hadoop.mapred.TestMiniMRChildTask.testTaskOldEnv(TestMiniMRChildTask.java:496)




Hadoop-Mapreduce-trunk - Build # 3322 - Still Failing

Posted by Apache Jenkins Server <je...@builds.apache.org>.
See https://builds.apache.org/job/Hadoop-Mapreduce-trunk/3322/

###################################################################################
########################## LAST 60 LINES OF THE CONSOLE ###########################
[...truncated 32687 lines...]
[INFO] --- maven-antrun-plugin:1.7:run (create-testdirs) @ hadoop-mapreduce ---
[INFO] Executing tasks

main:
[INFO] Executed tasks
[INFO] 
[INFO] --- maven-antrun-plugin:1.7:run (tar) @ hadoop-mapreduce ---
[INFO] Executing tasks

main:
[INFO] Executed tasks
[INFO] 
[INFO] --- maven-site-plugin:3.5:attach-descriptor (attach-descriptor) @ hadoop-mapreduce ---
[INFO] 
[INFO] --- maven-enforcer-plugin:1.3.1:enforce (depcheck) @ hadoop-mapreduce ---
[INFO] 
[INFO] --- maven-install-plugin:2.5.1:install (default-install) @ hadoop-mapreduce ---
[INFO] Installing /home/jenkins/jenkins-slave/workspace/Hadoop-Mapreduce-trunk/hadoop-mapreduce-project/pom.xml to /home/jenkins/.m2/repository/org/apache/hadoop/hadoop-mapreduce/3.0.0-alpha1-SNAPSHOT/hadoop-mapreduce-3.0.0-alpha1-SNAPSHOT.pom
[INFO] ------------------------------------------------------------------------
[INFO] Reactor Summary:
[INFO] 
[INFO] Apache Hadoop MapReduce Client .................... SUCCESS [  3.245 s]
[INFO] Apache Hadoop MapReduce Core ...................... SUCCESS [02:03 min]
[INFO] Apache Hadoop MapReduce Common .................... SUCCESS [ 30.970 s]
[INFO] Apache Hadoop MapReduce Shuffle ................... SUCCESS [  5.216 s]
[INFO] Apache Hadoop MapReduce App ....................... SUCCESS [08:34 min]
[INFO] Apache Hadoop MapReduce HistoryServer ............. SUCCESS [05:48 min]
[INFO] Apache Hadoop MapReduce JobClient ................. FAILURE [  01:46 h]
[INFO] Apache Hadoop MapReduce HistoryServer Plugins ..... SUCCESS [  1.430 s]
[INFO] Apache Hadoop MapReduce NativeTask ................ SUCCESS [09:14 min]
[INFO] Apache Hadoop MapReduce Examples .................. SKIPPED
[INFO] Apache Hadoop MapReduce ........................... SUCCESS [  0.247 s]
[INFO] ------------------------------------------------------------------------
[INFO] BUILD FAILURE
[INFO] ------------------------------------------------------------------------
[INFO] Total time: 02:13 h
[INFO] Finished at: 2016-05-16T08:13:12+00:00
[INFO] Final Memory: 36M/595M
[INFO] ------------------------------------------------------------------------
[WARNING] The requested profile "parallel-tests" could not be activated because it does not exist.
[ERROR] Failed to execute goal org.apache.maven.plugins:maven-surefire-plugin:2.17:test (default-test) on project hadoop-mapreduce-client-jobclient: There are test failures.
[ERROR] 
[ERROR] Please refer to /home/jenkins/jenkins-slave/workspace/Hadoop-Mapreduce-trunk/hadoop-mapreduce-project/hadoop-mapreduce-client/hadoop-mapreduce-client-jobclient/target/surefire-reports for the individual test results.
[ERROR] -> [Help 1]
[ERROR] 
[ERROR] To see the full stack trace of the errors, re-run Maven with the -e switch.
[ERROR] Re-run Maven using the -X switch to enable full debug logging.
[ERROR] 
[ERROR] For more information about the errors and possible solutions, please read the following articles:
[ERROR] [Help 1] http://cwiki.apache.org/confluence/display/MAVEN/MojoFailureException
[ERROR] 
[ERROR] After correcting the problems, you can resume the build with the command
[ERROR]   mvn <goals> -rf :hadoop-mapreduce-client-jobclient
Build step 'Execute shell' marked build as failure
[FINDBUGS] Skipping publisher since build result is FAILURE
Archiving artifacts
Recording test results
Email was triggered for: Failure - Any
Sending email for trigger: Failure - Any



###################################################################################
############################## FAILED TESTS (if any) ##############################
2 tests failed.
FAILED:  org.apache.hadoop.mapred.TestMiniMRChildTask.testTaskEnv

Error Message:
The environment checker job failed.

Stack Trace:
java.lang.AssertionError: The environment checker job failed.
	at org.junit.Assert.fail(Assert.java:88)
	at org.junit.Assert.assertTrue(Assert.java:41)
	at org.apache.hadoop.mapred.TestMiniMRChildTask.runTestTaskEnv(TestMiniMRChildTask.java:550)
	at org.apache.hadoop.mapred.TestMiniMRChildTask.testTaskEnv(TestMiniMRChildTask.java:472)


FAILED:  org.apache.hadoop.mapred.TestMiniMRChildTask.testTaskOldEnv

Error Message:
The environment checker job failed.

Stack Trace:
java.lang.AssertionError: The environment checker job failed.
	at org.junit.Assert.fail(Assert.java:88)
	at org.junit.Assert.assertTrue(Assert.java:41)
	at org.apache.hadoop.mapred.TestMiniMRChildTask.runTestTaskEnv(TestMiniMRChildTask.java:550)
	at org.apache.hadoop.mapred.TestMiniMRChildTask.testTaskOldEnv(TestMiniMRChildTask.java:496)