You are viewing a plain text version of this content. The canonical link for it is here.
Posted to builds@lucene.apache.org by Apache Jenkins Server <je...@builds.apache.org> on 2024/01/13 06:43:59 UTC

[JENKINS] Lucene » Lucene-NightlyTests-9.9 - Build # 46 - Unstable!

Build: https://ci-builds.apache.org/job/Lucene/job/Lucene-NightlyTests-9.9/46/

2 tests failed.
FAILED:  org.apache.lucene.store.TestStressLockFactories.testNativeFSLockFactory

Error Message:
java.net.SocketTimeoutException: Accept timed out

Stack Trace:
java.net.SocketTimeoutException: Accept timed out
	at __randomizedtesting.SeedInfo.seed([34E16259617743A7:28308D4BF88DFFD4]:0)
	at java.base/java.net.PlainSocketImpl.socketAccept(Native Method)
	at java.base/java.net.AbstractPlainSocketImpl.accept(AbstractPlainSocketImpl.java:474)
	at java.base/java.net.ServerSocket.implAccept(ServerSocket.java:565)
	at java.base/java.net.ServerSocket.accept(ServerSocket.java:533)
	at org.apache.lucene.store.LockVerifyServer.run(LockVerifyServer.java:62)
	at org.apache.lucene.store.TestStressLockFactories.runImpl(TestStressLockFactories.java:53)
	at org.apache.lucene.store.TestStressLockFactories.testNativeFSLockFactory(TestStressLockFactories.java:100)
	at java.base/jdk.internal.reflect.NativeMethodAccessorImpl.invoke0(Native Method)
	at java.base/jdk.internal.reflect.NativeMethodAccessorImpl.invoke(NativeMethodAccessorImpl.java:62)
	at java.base/jdk.internal.reflect.DelegatingMethodAccessorImpl.invoke(DelegatingMethodAccessorImpl.java:43)
	at java.base/java.lang.reflect.Method.invoke(Method.java:566)
	at com.carrotsearch.randomizedtesting.RandomizedRunner.invoke(RandomizedRunner.java:1758)
	at com.carrotsearch.randomizedtesting.RandomizedRunner$8.evaluate(RandomizedRunner.java:946)
	at com.carrotsearch.randomizedtesting.RandomizedRunner$9.evaluate(RandomizedRunner.java:982)
	at com.carrotsearch.randomizedtesting.RandomizedRunner$10.evaluate(RandomizedRunner.java:996)
	at org.apache.lucene.tests.util.TestRuleSetupTeardownChained$1.evaluate(TestRuleSetupTeardownChained.java:48)
	at org.apache.lucene.tests.util.AbstractBeforeAfterRule$1.evaluate(AbstractBeforeAfterRule.java:43)
	at org.apache.lucene.tests.util.TestRuleThreadAndTestName$1.evaluate(TestRuleThreadAndTestName.java:45)
	at org.apache.lucene.tests.util.TestRuleIgnoreAfterMaxFailures$1.evaluate(TestRuleIgnoreAfterMaxFailures.java:60)
	at org.apache.lucene.tests.util.TestRuleMarkFailure$1.evaluate(TestRuleMarkFailure.java:44)
	at org.junit.rules.RunRules.evaluate(RunRules.java:20)
	at com.carrotsearch.randomizedtesting.rules.StatementAdapter.evaluate(StatementAdapter.java:36)
	at com.carrotsearch.randomizedtesting.ThreadLeakControl$StatementRunner.run(ThreadLeakControl.java:390)
	at com.carrotsearch.randomizedtesting.ThreadLeakControl.forkTimeoutingTask(ThreadLeakControl.java:843)
	at com.carrotsearch.randomizedtesting.ThreadLeakControl$3.evaluate(ThreadLeakControl.java:490)
	at com.carrotsearch.randomizedtesting.RandomizedRunner.runSingleTest(RandomizedRunner.java:955)
	at com.carrotsearch.randomizedtesting.RandomizedRunner$5.evaluate(RandomizedRunner.java:840)
	at com.carrotsearch.randomizedtesting.RandomizedRunner$6.evaluate(RandomizedRunner.java:891)
	at com.carrotsearch.randomizedtesting.RandomizedRunner$7.evaluate(RandomizedRunner.java:902)
	at org.apache.lucene.tests.util.AbstractBeforeAfterRule$1.evaluate(AbstractBeforeAfterRule.java:43)
	at com.carrotsearch.randomizedtesting.rules.StatementAdapter.evaluate(StatementAdapter.java:36)
	at org.apache.lucene.tests.util.TestRuleStoreClassName$1.evaluate(TestRuleStoreClassName.java:38)
	at com.carrotsearch.randomizedtesting.rules.NoShadowingOrOverridesOnMethodsRule$1.evaluate(NoShadowingOrOverridesOnMethodsRule.java:40)
	at com.carrotsearch.randomizedtesting.rules.NoShadowingOrOverridesOnMethodsRule$1.evaluate(NoShadowingOrOverridesOnMethodsRule.java:40)
	at com.carrotsearch.randomizedtesting.rules.StatementAdapter.evaluate(StatementAdapter.java:36)
	at com.carrotsearch.randomizedtesting.rules.StatementAdapter.evaluate(StatementAdapter.java:36)
	at org.apache.lucene.tests.util.TestRuleAssertionsRequired$1.evaluate(TestRuleAssertionsRequired.java:53)
	at org.apache.lucene.tests.util.AbstractBeforeAfterRule$1.evaluate(AbstractBeforeAfterRule.java:43)
	at org.apache.lucene.tests.util.TestRuleMarkFailure$1.evaluate(TestRuleMarkFailure.java:44)
	at org.apache.lucene.tests.util.TestRuleIgnoreAfterMaxFailures$1.evaluate(TestRuleIgnoreAfterMaxFailures.java:60)
	at org.apache.lucene.tests.util.TestRuleIgnoreTestSuites$1.evaluate(TestRuleIgnoreTestSuites.java:47)
	at org.junit.rules.RunRules.evaluate(RunRules.java:20)
	at com.carrotsearch.randomizedtesting.rules.StatementAdapter.evaluate(StatementAdapter.java:36)
	at com.carrotsearch.randomizedtesting.ThreadLeakControl$StatementRunner.run(ThreadLeakControl.java:390)
	at com.carrotsearch.randomizedtesting.ThreadLeakControl.lambda$forkTimeoutingTask$0(ThreadLeakControl.java:850)
	at java.base/java.lang.Thread.run(Thread.java:829)


FAILED:  org.apache.lucene.store.TestStressLockFactories.classMethod

Error Message:
com.carrotsearch.randomizedtesting.ThreadLeakError: 4 threads leaked from SUITE scope at org.apache.lucene.store.TestStressLockFactories: 
   1) Thread[id=5271, name=Thread-2523, state=WAITING, group=TGRP-TestStressLockFactories]
        at java.base@11.0.16.1/jdk.internal.misc.Unsafe.park(Native Method)
        at java.base@11.0.16.1/java.util.concurrent.locks.LockSupport.park(LockSupport.java:194)
        at java.base@11.0.16.1/java.util.concurrent.locks.AbstractQueuedSynchronizer.parkAndCheckInterrupt(AbstractQueuedSynchronizer.java:885)
        at java.base@11.0.16.1/java.util.concurrent.locks.AbstractQueuedSynchronizer.doAcquireSharedInterruptibly(AbstractQueuedSynchronizer.java:1039)
        at java.base@11.0.16.1/java.util.concurrent.locks.AbstractQueuedSynchronizer.acquireSharedInterruptibly(AbstractQueuedSynchronizer.java:1345)
        at java.base@11.0.16.1/java.util.concurrent.CountDownLatch.await(CountDownLatch.java:232)
        at app//org.apache.lucene.store.LockVerifyServer$1.run(LockVerifyServer.java:74)
   2) Thread[id=5273, name=Thread-2525, state=WAITING, group=TGRP-TestStressLockFactories]
        at java.base@11.0.16.1/jdk.internal.misc.Unsafe.park(Native Method)
        at java.base@11.0.16.1/java.util.concurrent.locks.LockSupport.park(LockSupport.java:194)
        at java.base@11.0.16.1/java.util.concurrent.locks.AbstractQueuedSynchronizer.parkAndCheckInterrupt(AbstractQueuedSynchronizer.java:885)
        at java.base@11.0.16.1/java.util.concurrent.locks.AbstractQueuedSynchronizer.doAcquireSharedInterruptibly(AbstractQueuedSynchronizer.java:1039)
        at java.base@11.0.16.1/java.util.concurrent.locks.AbstractQueuedSynchronizer.acquireSharedInterruptibly(AbstractQueuedSynchronizer.java:1345)
        at java.base@11.0.16.1/java.util.concurrent.CountDownLatch.await(CountDownLatch.java:232)
        at app//org.apache.lucene.store.LockVerifyServer$1.run(LockVerifyServer.java:74)
   3) Thread[id=5270, name=Thread-2522, state=WAITING, group=TGRP-TestStressLockFactories]
        at java.base@11.0.16.1/jdk.internal.misc.Unsafe.park(Native Method)
        at java.base@11.0.16.1/java.util.concurrent.locks.LockSupport.park(LockSupport.java:194)
        at java.base@11.0.16.1/java.util.concurrent.locks.AbstractQueuedSynchronizer.parkAndCheckInterrupt(AbstractQueuedSynchronizer.java:885)
        at java.base@11.0.16.1/java.util.concurrent.locks.AbstractQueuedSynchronizer.doAcquireSharedInterruptibly(AbstractQueuedSynchronizer.java:1039)
        at java.base@11.0.16.1/java.util.concurrent.locks.AbstractQueuedSynchronizer.acquireSharedInterruptibly(AbstractQueuedSynchronizer.java:1345)
        at java.base@11.0.16.1/java.util.concurrent.CountDownLatch.await(CountDownLatch.java:232)
        at app//org.apache.lucene.store.LockVerifyServer$1.run(LockVerifyServer.java:74)
   4) Thread[id=5272, name=Thread-2524, state=WAITING, group=TGRP-TestStressLockFactories]
        at java.base@11.0.16.1/jdk.internal.misc.Unsafe.park(Native Method)
        at java.base@11.0.16.1/java.util.concurrent.locks.LockSupport.park(LockSupport.java:194)
        at java.base@11.0.16.1/java.util.concurrent.locks.AbstractQueuedSynchronizer.parkAndCheckInterrupt(AbstractQueuedSynchronizer.java:885)
        at java.base@11.0.16.1/java.util.concurrent.locks.AbstractQueuedSynchronizer.doAcquireSharedInterruptibly(AbstractQueuedSynchronizer.java:1039)
        at java.base@11.0.16.1/java.util.concurrent.locks.AbstractQueuedSynchronizer.acquireSharedInterruptibly(AbstractQueuedSynchronizer.java:1345)
        at java.base@11.0.16.1/java.util.concurrent.CountDownLatch.await(CountDownLatch.java:232)
        at app//org.apache.lucene.store.LockVerifyServer$1.run(LockVerifyServer.java:74)

Stack Trace:
com.carrotsearch.randomizedtesting.ThreadLeakError: 4 threads leaked from SUITE scope at org.apache.lucene.store.TestStressLockFactories: 
   1) Thread[id=5271, name=Thread-2523, state=WAITING, group=TGRP-TestStressLockFactories]
        at java.base@11.0.16.1/jdk.internal.misc.Unsafe.park(Native Method)
        at java.base@11.0.16.1/java.util.concurrent.locks.LockSupport.park(LockSupport.java:194)
        at java.base@11.0.16.1/java.util.concurrent.locks.AbstractQueuedSynchronizer.parkAndCheckInterrupt(AbstractQueuedSynchronizer.java:885)
        at java.base@11.0.16.1/java.util.concurrent.locks.AbstractQueuedSynchronizer.doAcquireSharedInterruptibly(AbstractQueuedSynchronizer.java:1039)
        at java.base@11.0.16.1/java.util.concurrent.locks.AbstractQueuedSynchronizer.acquireSharedInterruptibly(AbstractQueuedSynchronizer.java:1345)
        at java.base@11.0.16.1/java.util.concurrent.CountDownLatch.await(CountDownLatch.java:232)
        at app//org.apache.lucene.store.LockVerifyServer$1.run(LockVerifyServer.java:74)
   2) Thread[id=5273, name=Thread-2525, state=WAITING, group=TGRP-TestStressLockFactories]
        at java.base@11.0.16.1/jdk.internal.misc.Unsafe.park(Native Method)
        at java.base@11.0.16.1/java.util.concurrent.locks.LockSupport.park(LockSupport.java:194)
        at java.base@11.0.16.1/java.util.concurrent.locks.AbstractQueuedSynchronizer.parkAndCheckInterrupt(AbstractQueuedSynchronizer.java:885)
        at java.base@11.0.16.1/java.util.concurrent.locks.AbstractQueuedSynchronizer.doAcquireSharedInterruptibly(AbstractQueuedSynchronizer.java:1039)
        at java.base@11.0.16.1/java.util.concurrent.locks.AbstractQueuedSynchronizer.acquireSharedInterruptibly(AbstractQueuedSynchronizer.java:1345)
        at java.base@11.0.16.1/java.util.concurrent.CountDownLatch.await(CountDownLatch.java:232)
        at app//org.apache.lucene.store.LockVerifyServer$1.run(LockVerifyServer.java:74)
   3) Thread[id=5270, name=Thread-2522, state=WAITING, group=TGRP-TestStressLockFactories]
        at java.base@11.0.16.1/jdk.internal.misc.Unsafe.park(Native Method)
        at java.base@11.0.16.1/java.util.concurrent.locks.LockSupport.park(LockSupport.java:194)
        at java.base@11.0.16.1/java.util.concurrent.locks.AbstractQueuedSynchronizer.parkAndCheckInterrupt(AbstractQueuedSynchronizer.java:885)
        at java.base@11.0.16.1/java.util.concurrent.locks.AbstractQueuedSynchronizer.doAcquireSharedInterruptibly(AbstractQueuedSynchronizer.java:1039)
        at java.base@11.0.16.1/java.util.concurrent.locks.AbstractQueuedSynchronizer.acquireSharedInterruptibly(AbstractQueuedSynchronizer.java:1345)
        at java.base@11.0.16.1/java.util.concurrent.CountDownLatch.await(CountDownLatch.java:232)
        at app//org.apache.lucene.store.LockVerifyServer$1.run(LockVerifyServer.java:74)
   4) Thread[id=5272, name=Thread-2524, state=WAITING, group=TGRP-TestStressLockFactories]
        at java.base@11.0.16.1/jdk.internal.misc.Unsafe.park(Native Method)
        at java.base@11.0.16.1/java.util.concurrent.locks.LockSupport.park(LockSupport.java:194)
        at java.base@11.0.16.1/java.util.concurrent.locks.AbstractQueuedSynchronizer.parkAndCheckInterrupt(AbstractQueuedSynchronizer.java:885)
        at java.base@11.0.16.1/java.util.concurrent.locks.AbstractQueuedSynchronizer.doAcquireSharedInterruptibly(AbstractQueuedSynchronizer.java:1039)
        at java.base@11.0.16.1/java.util.concurrent.locks.AbstractQueuedSynchronizer.acquireSharedInterruptibly(AbstractQueuedSynchronizer.java:1345)
        at java.base@11.0.16.1/java.util.concurrent.CountDownLatch.await(CountDownLatch.java:232)
        at app//org.apache.lucene.store.LockVerifyServer$1.run(LockVerifyServer.java:74)
	at __randomizedtesting.SeedInfo.seed([34E16259617743A7]:0)




Build Log:
[...truncated 664 lines...]
ERROR: The following test(s) have failed:
  - org.apache.lucene.store.TestStressLockFactories.testNativeFSLockFactory (:lucene:core)
    Test output: /home/jenkins/jenkins-slave/workspace/Lucene/Lucene-NightlyTests-9.9/checkout/lucene/core/build/test-results/test/outputs/OUTPUT-org.apache.lucene.store.TestStressLockFactories.txt
    Reproduce with: gradlew :lucene:core:test --tests "org.apache.lucene.store.TestStressLockFactories.testNativeFSLockFactory" -Ptests.jvms=4 -Ptests.jvmargs= -Ptests.seed=34E16259617743A7 -Ptests.multiplier=2 -Ptests.nightly=true -Ptests.badapples=false -Ptests.gui=true -Ptests.file.encoding=ISO-8859-1 -Ptests.linedocsfile=/home/jenkins/jenkins-slave/workspace/Lucene/Lucene-NightlyTests-9.9/test-data/enwiki.random.lines.txt -Ptests.vectorsize=256

  - org.apache.lucene.store.TestStressLockFactories.classMethod (:lucene:core)
    Test output: /home/jenkins/jenkins-slave/workspace/Lucene/Lucene-NightlyTests-9.9/checkout/lucene/core/build/test-results/test/outputs/OUTPUT-org.apache.lucene.store.TestStressLockFactories.txt
    Reproduce with: gradlew :lucene:core:test --tests "org.apache.lucene.store.TestStressLockFactories.classMethod" -Ptests.jvms=4 -Ptests.jvmargs= -Ptests.seed=34E16259617743A7 -Ptests.multiplier=2 -Ptests.nightly=true -Ptests.badapples=false -Ptests.gui=true -Ptests.file.encoding=ISO-8859-1 -Ptests.linedocsfile=/home/jenkins/jenkins-slave/workspace/Lucene/Lucene-NightlyTests-9.9/test-data/enwiki.random.lines.txt -Ptests.vectorsize=256


Deprecated Gradle features were used in this build, making it incompatible with Gradle 9.0.

You can use '--warning-mode all' to show the individual deprecation warnings and determine if they come from your own scripts or plugins.

For more on this, please refer to https://docs.gradle.org/8.4/userguide/command_line_interface.html#sec:command_line_warnings in the Gradle documentation.

BUILD SUCCESSFUL in 2h 5m 20s
243 actionable tasks: 76 executed, 167 up-to-date

Publishing build scan...
https://ge.apache.org/s/fogstuzl4zkq4

Build step 'Invoke Gradle script' changed build result to SUCCESS
Archiving artifacts
‘**/*.events’ doesn’t match anything: ‘**’ exists but not ‘**/*.events’
No artifacts found that match the file pattern "**/*.events,heapdumps/**,**/hs_err_pid*". Configuration error?
Recording test results
[Checks API] No suitable checks publisher found.
Build step 'Publish JUnit test result report' changed build result to UNSTABLE
Email was triggered for: Unstable (Test Failures)
Sending email for trigger: Unstable (Test Failures)

[JENKINS] Lucene » Lucene-NightlyTests-9.9 - Build # 47 - Still Unstable!

Posted by Apache Jenkins Server <je...@builds.apache.org>.
Build: https://ci-builds.apache.org/job/Lucene/job/Lucene-NightlyTests-9.9/47/

4 tests failed.
FAILED:  org.apache.lucene.search.uhighlight.TestUnifiedHighlighterMTQ.testWildcardInBoolean {p0=stored,indexed,tokenized}

Error Message:
org.junit.ComparisonFailure: expected:<[This is a <b>test</b>].> but was:<[<b>Test</b> a one sentence document].>

Stack Trace:
org.junit.ComparisonFailure: expected:<[This is a <b>test</b>].> but was:<[<b>Test</b> a one sentence document].>
	at junit@4.13.1/org.junit.Assert.assertEquals(Assert.java:117)
	at junit@4.13.1/org.junit.Assert.assertEquals(Assert.java:146)
	at org.apache.lucene.search.uhighlight.TestUnifiedHighlighterMTQ.testWildcardInBoolean(TestUnifiedHighlighterMTQ.java:442)
	at java.base/jdk.internal.reflect.NativeMethodAccessorImpl.invoke0(Native Method)
	at java.base/jdk.internal.reflect.NativeMethodAccessorImpl.invoke(NativeMethodAccessorImpl.java:62)
	at java.base/jdk.internal.reflect.DelegatingMethodAccessorImpl.invoke(DelegatingMethodAccessorImpl.java:43)
	at java.base/java.lang.reflect.Method.invoke(Method.java:566)
	at randomizedtesting.runner@2.8.1/com.carrotsearch.randomizedtesting.RandomizedRunner.invoke(RandomizedRunner.java:1758)
	at randomizedtesting.runner@2.8.1/com.carrotsearch.randomizedtesting.RandomizedRunner$8.evaluate(RandomizedRunner.java:946)
	at randomizedtesting.runner@2.8.1/com.carrotsearch.randomizedtesting.RandomizedRunner$9.evaluate(RandomizedRunner.java:982)
	at randomizedtesting.runner@2.8.1/com.carrotsearch.randomizedtesting.RandomizedRunner$10.evaluate(RandomizedRunner.java:996)
	at org.apache.lucene.test_framework@9.9.2-SNAPSHOT/org.apache.lucene.tests.util.TestRuleSetupTeardownChained$1.evaluate(TestRuleSetupTeardownChained.java:48)
	at org.apache.lucene.test_framework@9.9.2-SNAPSHOT/org.apache.lucene.tests.util.AbstractBeforeAfterRule$1.evaluate(AbstractBeforeAfterRule.java:43)
	at org.apache.lucene.test_framework@9.9.2-SNAPSHOT/org.apache.lucene.tests.util.TestRuleThreadAndTestName$1.evaluate(TestRuleThreadAndTestName.java:45)
	at org.apache.lucene.test_framework@9.9.2-SNAPSHOT/org.apache.lucene.tests.util.TestRuleIgnoreAfterMaxFailures$1.evaluate(TestRuleIgnoreAfterMaxFailures.java:60)
	at org.apache.lucene.test_framework@9.9.2-SNAPSHOT/org.apache.lucene.tests.util.TestRuleMarkFailure$1.evaluate(TestRuleMarkFailure.java:44)
	at junit@4.13.1/org.junit.rules.RunRules.evaluate(RunRules.java:20)
	at randomizedtesting.runner@2.8.1/com.carrotsearch.randomizedtesting.rules.StatementAdapter.evaluate(StatementAdapter.java:36)
	at randomizedtesting.runner@2.8.1/com.carrotsearch.randomizedtesting.ThreadLeakControl$StatementRunner.run(ThreadLeakControl.java:390)
	at randomizedtesting.runner@2.8.1/com.carrotsearch.randomizedtesting.ThreadLeakControl.forkTimeoutingTask(ThreadLeakControl.java:843)
	at randomizedtesting.runner@2.8.1/com.carrotsearch.randomizedtesting.ThreadLeakControl$3.evaluate(ThreadLeakControl.java:490)
	at randomizedtesting.runner@2.8.1/com.carrotsearch.randomizedtesting.RandomizedRunner.runSingleTest(RandomizedRunner.java:955)
	at randomizedtesting.runner@2.8.1/com.carrotsearch.randomizedtesting.RandomizedRunner$5.evaluate(RandomizedRunner.java:840)
	at randomizedtesting.runner@2.8.1/com.carrotsearch.randomizedtesting.RandomizedRunner$6.evaluate(RandomizedRunner.java:891)
	at randomizedtesting.runner@2.8.1/com.carrotsearch.randomizedtesting.RandomizedRunner$7.evaluate(RandomizedRunner.java:902)
	at org.apache.lucene.test_framework@9.9.2-SNAPSHOT/org.apache.lucene.tests.util.AbstractBeforeAfterRule$1.evaluate(AbstractBeforeAfterRule.java:43)
	at randomizedtesting.runner@2.8.1/com.carrotsearch.randomizedtesting.rules.StatementAdapter.evaluate(StatementAdapter.java:36)
	at org.apache.lucene.test_framework@9.9.2-SNAPSHOT/org.apache.lucene.tests.util.TestRuleStoreClassName$1.evaluate(TestRuleStoreClassName.java:38)
	at randomizedtesting.runner@2.8.1/com.carrotsearch.randomizedtesting.rules.NoShadowingOrOverridesOnMethodsRule$1.evaluate(NoShadowingOrOverridesOnMethodsRule.java:40)
	at randomizedtesting.runner@2.8.1/com.carrotsearch.randomizedtesting.rules.NoShadowingOrOverridesOnMethodsRule$1.evaluate(NoShadowingOrOverridesOnMethodsRule.java:40)
	at randomizedtesting.runner@2.8.1/com.carrotsearch.randomizedtesting.rules.StatementAdapter.evaluate(StatementAdapter.java:36)
	at randomizedtesting.runner@2.8.1/com.carrotsearch.randomizedtesting.rules.StatementAdapter.evaluate(StatementAdapter.java:36)
	at org.apache.lucene.test_framework@9.9.2-SNAPSHOT/org.apache.lucene.tests.util.TestRuleAssertionsRequired$1.evaluate(TestRuleAssertionsRequired.java:53)
	at org.apache.lucene.test_framework@9.9.2-SNAPSHOT/org.apache.lucene.tests.util.AbstractBeforeAfterRule$1.evaluate(AbstractBeforeAfterRule.java:43)
	at org.apache.lucene.test_framework@9.9.2-SNAPSHOT/org.apache.lucene.tests.util.TestRuleMarkFailure$1.evaluate(TestRuleMarkFailure.java:44)
	at org.apache.lucene.test_framework@9.9.2-SNAPSHOT/org.apache.lucene.tests.util.TestRuleIgnoreAfterMaxFailures$1.evaluate(TestRuleIgnoreAfterMaxFailures.java:60)
	at org.apache.lucene.test_framework@9.9.2-SNAPSHOT/org.apache.lucene.tests.util.TestRuleIgnoreTestSuites$1.evaluate(TestRuleIgnoreTestSuites.java:47)
	at junit@4.13.1/org.junit.rules.RunRules.evaluate(RunRules.java:20)
	at randomizedtesting.runner@2.8.1/com.carrotsearch.randomizedtesting.rules.StatementAdapter.evaluate(StatementAdapter.java:36)
	at randomizedtesting.runner@2.8.1/com.carrotsearch.randomizedtesting.ThreadLeakControl$StatementRunner.run(ThreadLeakControl.java:390)
	at randomizedtesting.runner@2.8.1/com.carrotsearch.randomizedtesting.ThreadLeakControl.lambda$forkTimeoutingTask$0(ThreadLeakControl.java:850)
	at java.base/java.lang.Thread.run(Thread.java:829)


FAILED:  org.apache.lucene.search.uhighlight.TestUnifiedHighlighterMTQ.testWildcardInBoolean {p0=stored,indexed,tokenized,termVector,termVectorOffsets,termVectorPosition}

Error Message:
org.junit.ComparisonFailure: expected:<[This is a <b>test</b>].> but was:<[<b>Test</b> a one sentence document].>

Stack Trace:
org.junit.ComparisonFailure: expected:<[This is a <b>test</b>].> but was:<[<b>Test</b> a one sentence document].>
	at junit@4.13.1/org.junit.Assert.assertEquals(Assert.java:117)
	at junit@4.13.1/org.junit.Assert.assertEquals(Assert.java:146)
	at org.apache.lucene.search.uhighlight.TestUnifiedHighlighterMTQ.testWildcardInBoolean(TestUnifiedHighlighterMTQ.java:442)
	at java.base/jdk.internal.reflect.NativeMethodAccessorImpl.invoke0(Native Method)
	at java.base/jdk.internal.reflect.NativeMethodAccessorImpl.invoke(NativeMethodAccessorImpl.java:62)
	at java.base/jdk.internal.reflect.DelegatingMethodAccessorImpl.invoke(DelegatingMethodAccessorImpl.java:43)
	at java.base/java.lang.reflect.Method.invoke(Method.java:566)
	at randomizedtesting.runner@2.8.1/com.carrotsearch.randomizedtesting.RandomizedRunner.invoke(RandomizedRunner.java:1758)
	at randomizedtesting.runner@2.8.1/com.carrotsearch.randomizedtesting.RandomizedRunner$8.evaluate(RandomizedRunner.java:946)
	at randomizedtesting.runner@2.8.1/com.carrotsearch.randomizedtesting.RandomizedRunner$9.evaluate(RandomizedRunner.java:982)
	at randomizedtesting.runner@2.8.1/com.carrotsearch.randomizedtesting.RandomizedRunner$10.evaluate(RandomizedRunner.java:996)
	at org.apache.lucene.test_framework@9.9.2-SNAPSHOT/org.apache.lucene.tests.util.TestRuleSetupTeardownChained$1.evaluate(TestRuleSetupTeardownChained.java:48)
	at org.apache.lucene.test_framework@9.9.2-SNAPSHOT/org.apache.lucene.tests.util.AbstractBeforeAfterRule$1.evaluate(AbstractBeforeAfterRule.java:43)
	at org.apache.lucene.test_framework@9.9.2-SNAPSHOT/org.apache.lucene.tests.util.TestRuleThreadAndTestName$1.evaluate(TestRuleThreadAndTestName.java:45)
	at org.apache.lucene.test_framework@9.9.2-SNAPSHOT/org.apache.lucene.tests.util.TestRuleIgnoreAfterMaxFailures$1.evaluate(TestRuleIgnoreAfterMaxFailures.java:60)
	at org.apache.lucene.test_framework@9.9.2-SNAPSHOT/org.apache.lucene.tests.util.TestRuleMarkFailure$1.evaluate(TestRuleMarkFailure.java:44)
	at junit@4.13.1/org.junit.rules.RunRules.evaluate(RunRules.java:20)
	at randomizedtesting.runner@2.8.1/com.carrotsearch.randomizedtesting.rules.StatementAdapter.evaluate(StatementAdapter.java:36)
	at randomizedtesting.runner@2.8.1/com.carrotsearch.randomizedtesting.ThreadLeakControl$StatementRunner.run(ThreadLeakControl.java:390)
	at randomizedtesting.runner@2.8.1/com.carrotsearch.randomizedtesting.ThreadLeakControl.forkTimeoutingTask(ThreadLeakControl.java:843)
	at randomizedtesting.runner@2.8.1/com.carrotsearch.randomizedtesting.ThreadLeakControl$3.evaluate(ThreadLeakControl.java:490)
	at randomizedtesting.runner@2.8.1/com.carrotsearch.randomizedtesting.RandomizedRunner.runSingleTest(RandomizedRunner.java:955)
	at randomizedtesting.runner@2.8.1/com.carrotsearch.randomizedtesting.RandomizedRunner$5.evaluate(RandomizedRunner.java:840)
	at randomizedtesting.runner@2.8.1/com.carrotsearch.randomizedtesting.RandomizedRunner$6.evaluate(RandomizedRunner.java:891)
	at randomizedtesting.runner@2.8.1/com.carrotsearch.randomizedtesting.RandomizedRunner$7.evaluate(RandomizedRunner.java:902)
	at org.apache.lucene.test_framework@9.9.2-SNAPSHOT/org.apache.lucene.tests.util.AbstractBeforeAfterRule$1.evaluate(AbstractBeforeAfterRule.java:43)
	at randomizedtesting.runner@2.8.1/com.carrotsearch.randomizedtesting.rules.StatementAdapter.evaluate(StatementAdapter.java:36)
	at org.apache.lucene.test_framework@9.9.2-SNAPSHOT/org.apache.lucene.tests.util.TestRuleStoreClassName$1.evaluate(TestRuleStoreClassName.java:38)
	at randomizedtesting.runner@2.8.1/com.carrotsearch.randomizedtesting.rules.NoShadowingOrOverridesOnMethodsRule$1.evaluate(NoShadowingOrOverridesOnMethodsRule.java:40)
	at randomizedtesting.runner@2.8.1/com.carrotsearch.randomizedtesting.rules.NoShadowingOrOverridesOnMethodsRule$1.evaluate(NoShadowingOrOverridesOnMethodsRule.java:40)
	at randomizedtesting.runner@2.8.1/com.carrotsearch.randomizedtesting.rules.StatementAdapter.evaluate(StatementAdapter.java:36)
	at randomizedtesting.runner@2.8.1/com.carrotsearch.randomizedtesting.rules.StatementAdapter.evaluate(StatementAdapter.java:36)
	at org.apache.lucene.test_framework@9.9.2-SNAPSHOT/org.apache.lucene.tests.util.TestRuleAssertionsRequired$1.evaluate(TestRuleAssertionsRequired.java:53)
	at org.apache.lucene.test_framework@9.9.2-SNAPSHOT/org.apache.lucene.tests.util.AbstractBeforeAfterRule$1.evaluate(AbstractBeforeAfterRule.java:43)
	at org.apache.lucene.test_framework@9.9.2-SNAPSHOT/org.apache.lucene.tests.util.TestRuleMarkFailure$1.evaluate(TestRuleMarkFailure.java:44)
	at org.apache.lucene.test_framework@9.9.2-SNAPSHOT/org.apache.lucene.tests.util.TestRuleIgnoreAfterMaxFailures$1.evaluate(TestRuleIgnoreAfterMaxFailures.java:60)
	at org.apache.lucene.test_framework@9.9.2-SNAPSHOT/org.apache.lucene.tests.util.TestRuleIgnoreTestSuites$1.evaluate(TestRuleIgnoreTestSuites.java:47)
	at junit@4.13.1/org.junit.rules.RunRules.evaluate(RunRules.java:20)
	at randomizedtesting.runner@2.8.1/com.carrotsearch.randomizedtesting.rules.StatementAdapter.evaluate(StatementAdapter.java:36)
	at randomizedtesting.runner@2.8.1/com.carrotsearch.randomizedtesting.ThreadLeakControl$StatementRunner.run(ThreadLeakControl.java:390)
	at randomizedtesting.runner@2.8.1/com.carrotsearch.randomizedtesting.ThreadLeakControl.lambda$forkTimeoutingTask$0(ThreadLeakControl.java:850)
	at java.base/java.lang.Thread.run(Thread.java:829)


FAILED:  org.apache.lucene.search.uhighlight.TestUnifiedHighlighterMTQ.testWildcardInBoolean {p0=stored,indexed,tokenized,termVector,indexOptions=DOCS_AND_FREQS_AND_POSITIONS_AND_OFFSETS}

Error Message:
org.junit.ComparisonFailure: expected:<[This is a <b>test</b>].> but was:<[<b>Test</b> a one sentence document].>

Stack Trace:
org.junit.ComparisonFailure: expected:<[This is a <b>test</b>].> but was:<[<b>Test</b> a one sentence document].>
	at junit@4.13.1/org.junit.Assert.assertEquals(Assert.java:117)
	at junit@4.13.1/org.junit.Assert.assertEquals(Assert.java:146)
	at org.apache.lucene.search.uhighlight.TestUnifiedHighlighterMTQ.testWildcardInBoolean(TestUnifiedHighlighterMTQ.java:442)
	at java.base/jdk.internal.reflect.NativeMethodAccessorImpl.invoke0(Native Method)
	at java.base/jdk.internal.reflect.NativeMethodAccessorImpl.invoke(NativeMethodAccessorImpl.java:62)
	at java.base/jdk.internal.reflect.DelegatingMethodAccessorImpl.invoke(DelegatingMethodAccessorImpl.java:43)
	at java.base/java.lang.reflect.Method.invoke(Method.java:566)
	at randomizedtesting.runner@2.8.1/com.carrotsearch.randomizedtesting.RandomizedRunner.invoke(RandomizedRunner.java:1758)
	at randomizedtesting.runner@2.8.1/com.carrotsearch.randomizedtesting.RandomizedRunner$8.evaluate(RandomizedRunner.java:946)
	at randomizedtesting.runner@2.8.1/com.carrotsearch.randomizedtesting.RandomizedRunner$9.evaluate(RandomizedRunner.java:982)
	at randomizedtesting.runner@2.8.1/com.carrotsearch.randomizedtesting.RandomizedRunner$10.evaluate(RandomizedRunner.java:996)
	at org.apache.lucene.test_framework@9.9.2-SNAPSHOT/org.apache.lucene.tests.util.TestRuleSetupTeardownChained$1.evaluate(TestRuleSetupTeardownChained.java:48)
	at org.apache.lucene.test_framework@9.9.2-SNAPSHOT/org.apache.lucene.tests.util.AbstractBeforeAfterRule$1.evaluate(AbstractBeforeAfterRule.java:43)
	at org.apache.lucene.test_framework@9.9.2-SNAPSHOT/org.apache.lucene.tests.util.TestRuleThreadAndTestName$1.evaluate(TestRuleThreadAndTestName.java:45)
	at org.apache.lucene.test_framework@9.9.2-SNAPSHOT/org.apache.lucene.tests.util.TestRuleIgnoreAfterMaxFailures$1.evaluate(TestRuleIgnoreAfterMaxFailures.java:60)
	at org.apache.lucene.test_framework@9.9.2-SNAPSHOT/org.apache.lucene.tests.util.TestRuleMarkFailure$1.evaluate(TestRuleMarkFailure.java:44)
	at junit@4.13.1/org.junit.rules.RunRules.evaluate(RunRules.java:20)
	at randomizedtesting.runner@2.8.1/com.carrotsearch.randomizedtesting.rules.StatementAdapter.evaluate(StatementAdapter.java:36)
	at randomizedtesting.runner@2.8.1/com.carrotsearch.randomizedtesting.ThreadLeakControl$StatementRunner.run(ThreadLeakControl.java:390)
	at randomizedtesting.runner@2.8.1/com.carrotsearch.randomizedtesting.ThreadLeakControl.forkTimeoutingTask(ThreadLeakControl.java:843)
	at randomizedtesting.runner@2.8.1/com.carrotsearch.randomizedtesting.ThreadLeakControl$3.evaluate(ThreadLeakControl.java:490)
	at randomizedtesting.runner@2.8.1/com.carrotsearch.randomizedtesting.RandomizedRunner.runSingleTest(RandomizedRunner.java:955)
	at randomizedtesting.runner@2.8.1/com.carrotsearch.randomizedtesting.RandomizedRunner$5.evaluate(RandomizedRunner.java:840)
	at randomizedtesting.runner@2.8.1/com.carrotsearch.randomizedtesting.RandomizedRunner$6.evaluate(RandomizedRunner.java:891)
	at randomizedtesting.runner@2.8.1/com.carrotsearch.randomizedtesting.RandomizedRunner$7.evaluate(RandomizedRunner.java:902)
	at org.apache.lucene.test_framework@9.9.2-SNAPSHOT/org.apache.lucene.tests.util.AbstractBeforeAfterRule$1.evaluate(AbstractBeforeAfterRule.java:43)
	at randomizedtesting.runner@2.8.1/com.carrotsearch.randomizedtesting.rules.StatementAdapter.evaluate(StatementAdapter.java:36)
	at org.apache.lucene.test_framework@9.9.2-SNAPSHOT/org.apache.lucene.tests.util.TestRuleStoreClassName$1.evaluate(TestRuleStoreClassName.java:38)
	at randomizedtesting.runner@2.8.1/com.carrotsearch.randomizedtesting.rules.NoShadowingOrOverridesOnMethodsRule$1.evaluate(NoShadowingOrOverridesOnMethodsRule.java:40)
	at randomizedtesting.runner@2.8.1/com.carrotsearch.randomizedtesting.rules.NoShadowingOrOverridesOnMethodsRule$1.evaluate(NoShadowingOrOverridesOnMethodsRule.java:40)
	at randomizedtesting.runner@2.8.1/com.carrotsearch.randomizedtesting.rules.StatementAdapter.evaluate(StatementAdapter.java:36)
	at randomizedtesting.runner@2.8.1/com.carrotsearch.randomizedtesting.rules.StatementAdapter.evaluate(StatementAdapter.java:36)
	at org.apache.lucene.test_framework@9.9.2-SNAPSHOT/org.apache.lucene.tests.util.TestRuleAssertionsRequired$1.evaluate(TestRuleAssertionsRequired.java:53)
	at org.apache.lucene.test_framework@9.9.2-SNAPSHOT/org.apache.lucene.tests.util.AbstractBeforeAfterRule$1.evaluate(AbstractBeforeAfterRule.java:43)
	at org.apache.lucene.test_framework@9.9.2-SNAPSHOT/org.apache.lucene.tests.util.TestRuleMarkFailure$1.evaluate(TestRuleMarkFailure.java:44)
	at org.apache.lucene.test_framework@9.9.2-SNAPSHOT/org.apache.lucene.tests.util.TestRuleIgnoreAfterMaxFailures$1.evaluate(TestRuleIgnoreAfterMaxFailures.java:60)
	at org.apache.lucene.test_framework@9.9.2-SNAPSHOT/org.apache.lucene.tests.util.TestRuleIgnoreTestSuites$1.evaluate(TestRuleIgnoreTestSuites.java:47)
	at junit@4.13.1/org.junit.rules.RunRules.evaluate(RunRules.java:20)
	at randomizedtesting.runner@2.8.1/com.carrotsearch.randomizedtesting.rules.StatementAdapter.evaluate(StatementAdapter.java:36)
	at randomizedtesting.runner@2.8.1/com.carrotsearch.randomizedtesting.ThreadLeakControl$StatementRunner.run(ThreadLeakControl.java:390)
	at randomizedtesting.runner@2.8.1/com.carrotsearch.randomizedtesting.ThreadLeakControl.lambda$forkTimeoutingTask$0(ThreadLeakControl.java:850)
	at java.base/java.lang.Thread.run(Thread.java:829)


FAILED:  org.apache.lucene.search.uhighlight.TestUnifiedHighlighterMTQ.testWildcardInBoolean {p0=stored,indexed,tokenized,indexOptions=DOCS_AND_FREQS_AND_POSITIONS_AND_OFFSETS}

Error Message:
org.junit.ComparisonFailure: expected:<[This is a <b>test</b>].> but was:<[<b>Test</b> a one sentence document].>

Stack Trace:
org.junit.ComparisonFailure: expected:<[This is a <b>test</b>].> but was:<[<b>Test</b> a one sentence document].>
	at junit@4.13.1/org.junit.Assert.assertEquals(Assert.java:117)
	at junit@4.13.1/org.junit.Assert.assertEquals(Assert.java:146)
	at org.apache.lucene.search.uhighlight.TestUnifiedHighlighterMTQ.testWildcardInBoolean(TestUnifiedHighlighterMTQ.java:442)
	at java.base/jdk.internal.reflect.NativeMethodAccessorImpl.invoke0(Native Method)
	at java.base/jdk.internal.reflect.NativeMethodAccessorImpl.invoke(NativeMethodAccessorImpl.java:62)
	at java.base/jdk.internal.reflect.DelegatingMethodAccessorImpl.invoke(DelegatingMethodAccessorImpl.java:43)
	at java.base/java.lang.reflect.Method.invoke(Method.java:566)
	at randomizedtesting.runner@2.8.1/com.carrotsearch.randomizedtesting.RandomizedRunner.invoke(RandomizedRunner.java:1758)
	at randomizedtesting.runner@2.8.1/com.carrotsearch.randomizedtesting.RandomizedRunner$8.evaluate(RandomizedRunner.java:946)
	at randomizedtesting.runner@2.8.1/com.carrotsearch.randomizedtesting.RandomizedRunner$9.evaluate(RandomizedRunner.java:982)
	at randomizedtesting.runner@2.8.1/com.carrotsearch.randomizedtesting.RandomizedRunner$10.evaluate(RandomizedRunner.java:996)
	at org.apache.lucene.test_framework@9.9.2-SNAPSHOT/org.apache.lucene.tests.util.TestRuleSetupTeardownChained$1.evaluate(TestRuleSetupTeardownChained.java:48)
	at org.apache.lucene.test_framework@9.9.2-SNAPSHOT/org.apache.lucene.tests.util.AbstractBeforeAfterRule$1.evaluate(AbstractBeforeAfterRule.java:43)
	at org.apache.lucene.test_framework@9.9.2-SNAPSHOT/org.apache.lucene.tests.util.TestRuleThreadAndTestName$1.evaluate(TestRuleThreadAndTestName.java:45)
	at org.apache.lucene.test_framework@9.9.2-SNAPSHOT/org.apache.lucene.tests.util.TestRuleIgnoreAfterMaxFailures$1.evaluate(TestRuleIgnoreAfterMaxFailures.java:60)
	at org.apache.lucene.test_framework@9.9.2-SNAPSHOT/org.apache.lucene.tests.util.TestRuleMarkFailure$1.evaluate(TestRuleMarkFailure.java:44)
	at junit@4.13.1/org.junit.rules.RunRules.evaluate(RunRules.java:20)
	at randomizedtesting.runner@2.8.1/com.carrotsearch.randomizedtesting.rules.StatementAdapter.evaluate(StatementAdapter.java:36)
	at randomizedtesting.runner@2.8.1/com.carrotsearch.randomizedtesting.ThreadLeakControl$StatementRunner.run(ThreadLeakControl.java:390)
	at randomizedtesting.runner@2.8.1/com.carrotsearch.randomizedtesting.ThreadLeakControl.forkTimeoutingTask(ThreadLeakControl.java:843)
	at randomizedtesting.runner@2.8.1/com.carrotsearch.randomizedtesting.ThreadLeakControl$3.evaluate(ThreadLeakControl.java:490)
	at randomizedtesting.runner@2.8.1/com.carrotsearch.randomizedtesting.RandomizedRunner.runSingleTest(RandomizedRunner.java:955)
	at randomizedtesting.runner@2.8.1/com.carrotsearch.randomizedtesting.RandomizedRunner$5.evaluate(RandomizedRunner.java:840)
	at randomizedtesting.runner@2.8.1/com.carrotsearch.randomizedtesting.RandomizedRunner$6.evaluate(RandomizedRunner.java:891)
	at randomizedtesting.runner@2.8.1/com.carrotsearch.randomizedtesting.RandomizedRunner$7.evaluate(RandomizedRunner.java:902)
	at org.apache.lucene.test_framework@9.9.2-SNAPSHOT/org.apache.lucene.tests.util.AbstractBeforeAfterRule$1.evaluate(AbstractBeforeAfterRule.java:43)
	at randomizedtesting.runner@2.8.1/com.carrotsearch.randomizedtesting.rules.StatementAdapter.evaluate(StatementAdapter.java:36)
	at org.apache.lucene.test_framework@9.9.2-SNAPSHOT/org.apache.lucene.tests.util.TestRuleStoreClassName$1.evaluate(TestRuleStoreClassName.java:38)
	at randomizedtesting.runner@2.8.1/com.carrotsearch.randomizedtesting.rules.NoShadowingOrOverridesOnMethodsRule$1.evaluate(NoShadowingOrOverridesOnMethodsRule.java:40)
	at randomizedtesting.runner@2.8.1/com.carrotsearch.randomizedtesting.rules.NoShadowingOrOverridesOnMethodsRule$1.evaluate(NoShadowingOrOverridesOnMethodsRule.java:40)
	at randomizedtesting.runner@2.8.1/com.carrotsearch.randomizedtesting.rules.StatementAdapter.evaluate(StatementAdapter.java:36)
	at randomizedtesting.runner@2.8.1/com.carrotsearch.randomizedtesting.rules.StatementAdapter.evaluate(StatementAdapter.java:36)
	at org.apache.lucene.test_framework@9.9.2-SNAPSHOT/org.apache.lucene.tests.util.TestRuleAssertionsRequired$1.evaluate(TestRuleAssertionsRequired.java:53)
	at org.apache.lucene.test_framework@9.9.2-SNAPSHOT/org.apache.lucene.tests.util.AbstractBeforeAfterRule$1.evaluate(AbstractBeforeAfterRule.java:43)
	at org.apache.lucene.test_framework@9.9.2-SNAPSHOT/org.apache.lucene.tests.util.TestRuleMarkFailure$1.evaluate(TestRuleMarkFailure.java:44)
	at org.apache.lucene.test_framework@9.9.2-SNAPSHOT/org.apache.lucene.tests.util.TestRuleIgnoreAfterMaxFailures$1.evaluate(TestRuleIgnoreAfterMaxFailures.java:60)
	at org.apache.lucene.test_framework@9.9.2-SNAPSHOT/org.apache.lucene.tests.util.TestRuleIgnoreTestSuites$1.evaluate(TestRuleIgnoreTestSuites.java:47)
	at junit@4.13.1/org.junit.rules.RunRules.evaluate(RunRules.java:20)
	at randomizedtesting.runner@2.8.1/com.carrotsearch.randomizedtesting.rules.StatementAdapter.evaluate(StatementAdapter.java:36)
	at randomizedtesting.runner@2.8.1/com.carrotsearch.randomizedtesting.ThreadLeakControl$StatementRunner.run(ThreadLeakControl.java:390)
	at randomizedtesting.runner@2.8.1/com.carrotsearch.randomizedtesting.ThreadLeakControl.lambda$forkTimeoutingTask$0(ThreadLeakControl.java:850)
	at java.base/java.lang.Thread.run(Thread.java:829)




Build Log:
[...truncated 1333 lines...]
ERROR: The following test(s) have failed:
  - org.apache.lucene.search.uhighlight.TestUnifiedHighlighterMTQ.testWildcardInBoolean {p0=stored,indexed,tokenized} (:lucene:highlighter)
    Test output: /home/jenkins/jenkins-slave/workspace/Lucene/Lucene-NightlyTests-9.9/checkout/lucene/highlighter/build/test-results/test/outputs/OUTPUT-org.apache.lucene.search.uhighlight.TestUnifiedHighlighterMTQ.txt
    Reproduce with: gradlew :lucene:highlighter:test --tests "org.apache.lucene.search.uhighlight.TestUnifiedHighlighterMTQ.testWildcardInBoolean {p0=stored,indexed,tokenized}" -Ptests.jvms=4 -Ptests.jvmargs= -Ptests.seed=324B40A30718C803 -Ptests.multiplier=2 -Ptests.nightly=true -Ptests.badapples=false -Ptests.gui=true -Ptests.file.encoding=US-ASCII -Ptests.linedocsfile=/home/jenkins/jenkins-slave/workspace/Lucene/Lucene-NightlyTests-9.9/test-data/enwiki.random.lines.txt -Ptests.vectorsize=128

  - org.apache.lucene.search.uhighlight.TestUnifiedHighlighterMTQ.testWildcardInBoolean {p0=stored,indexed,tokenized,termVector,termVectorOffsets,termVectorPosition} (:lucene:highlighter)
    Test output: /home/jenkins/jenkins-slave/workspace/Lucene/Lucene-NightlyTests-9.9/checkout/lucene/highlighter/build/test-results/test/outputs/OUTPUT-org.apache.lucene.search.uhighlight.TestUnifiedHighlighterMTQ.txt
    Reproduce with: gradlew :lucene:highlighter:test --tests "org.apache.lucene.search.uhighlight.TestUnifiedHighlighterMTQ.testWildcardInBoolean {p0=stored,indexed,tokenized,termVector,termVectorOffsets,termVectorPosition}" -Ptests.jvms=4 -Ptests.jvmargs= -Ptests.seed=324B40A30718C803 -Ptests.multiplier=2 -Ptests.nightly=true -Ptests.badapples=false -Ptests.gui=true -Ptests.file.encoding=US-ASCII -Ptests.linedocsfile=/home/jenkins/jenkins-slave/workspace/Lucene/Lucene-NightlyTests-9.9/test-data/enwiki.random.lines.txt -Ptests.vectorsize=128

  - org.apache.lucene.search.uhighlight.TestUnifiedHighlighterMTQ.testWildcardInBoolean {p0=stored,indexed,tokenized,termVector,indexOptions=DOCS_AND_FREQS_AND_POSITIONS_AND_OFFSETS} (:lucene:highlighter)
    Test output: /home/jenkins/jenkins-slave/workspace/Lucene/Lucene-NightlyTests-9.9/checkout/lucene/highlighter/build/test-results/test/outputs/OUTPUT-org.apache.lucene.search.uhighlight.TestUnifiedHighlighterMTQ.txt
    Reproduce with: gradlew :lucene:highlighter:test --tests "org.apache.lucene.search.uhighlight.TestUnifiedHighlighterMTQ.testWildcardInBoolean {p0=stored,indexed,tokenized,termVector,indexOptions=DOCS_AND_FREQS_AND_POSITIONS_AND_OFFSETS}" -Ptests.jvms=4 -Ptests.jvmargs= -Ptests.seed=324B40A30718C803 -Ptests.multiplier=2 -Ptests.nightly=true -Ptests.badapples=false -Ptests.gui=true -Ptests.file.encoding=US-ASCII -Ptests.linedocsfile=/home/jenkins/jenkins-slave/workspace/Lucene/Lucene-NightlyTests-9.9/test-data/enwiki.random.lines.txt -Ptests.vectorsize=128

  - org.apache.lucene.search.uhighlight.TestUnifiedHighlighterMTQ.testWildcardInBoolean {p0=stored,indexed,tokenized,indexOptions=DOCS_AND_FREQS_AND_POSITIONS_AND_OFFSETS} (:lucene:highlighter)
    Test output: /home/jenkins/jenkins-slave/workspace/Lucene/Lucene-NightlyTests-9.9/checkout/lucene/highlighter/build/test-results/test/outputs/OUTPUT-org.apache.lucene.search.uhighlight.TestUnifiedHighlighterMTQ.txt
    Reproduce with: gradlew :lucene:highlighter:test --tests "org.apache.lucene.search.uhighlight.TestUnifiedHighlighterMTQ.testWildcardInBoolean {p0=stored,indexed,tokenized,indexOptions=DOCS_AND_FREQS_AND_POSITIONS_AND_OFFSETS}" -Ptests.jvms=4 -Ptests.jvmargs= -Ptests.seed=324B40A30718C803 -Ptests.multiplier=2 -Ptests.nightly=true -Ptests.badapples=false -Ptests.gui=true -Ptests.file.encoding=US-ASCII -Ptests.linedocsfile=/home/jenkins/jenkins-slave/workspace/Lucene/Lucene-NightlyTests-9.9/test-data/enwiki.random.lines.txt -Ptests.vectorsize=128


Deprecated Gradle features were used in this build, making it incompatible with Gradle 9.0.

You can use '--warning-mode all' to show the individual deprecation warnings and determine if they come from your own scripts or plugins.

For more on this, please refer to https://docs.gradle.org/8.4/userguide/command_line_interface.html#sec:command_line_warnings in the Gradle documentation.

BUILD SUCCESSFUL in 2h 11m 28s
243 actionable tasks: 76 executed, 167 up-to-date

Publishing build scan...
https://ge.apache.org/s/cu4v6fzc4zn5y

Build step 'Invoke Gradle script' changed build result to SUCCESS
Archiving artifacts
‘**/*.events’ doesn’t match anything: ‘**’ exists but not ‘**/*.events’
No artifacts found that match the file pattern "**/*.events,heapdumps/**,**/hs_err_pid*". Configuration error?
Recording test results
[Checks API] No suitable checks publisher found.
Build step 'Publish JUnit test result report' changed build result to UNSTABLE
Email was triggered for: Unstable (Test Failures)
Sending email for trigger: Unstable (Test Failures)