You are viewing a plain text version of this content. The canonical link for it is here.
Posted to builds@beam.apache.org by Apache Jenkins Server <je...@builds.apache.org> on 2020/08/07 00:18:15 UTC
Build failed in Jenkins: beam_PreCommit_SQL_Cron #1077
See <https://ci-beam.apache.org/job/beam_PreCommit_SQL_Cron/1077/display/redirect?page=changes>
Changes:
[piotr.szuberski] [BEAM-10135][BEAM-10136] Refactor jdbc external transform registrar
[douglas.damon] Add Additional Parameters lesson to Go SDK Katas
[douglas.damon] Edit lesson name and task description
[Rui Wang] [BEAM-10633] UdfImpl should be able to return java.util.List.
[piotr.szuberski] [BEAM-10543] Add new parameters to Kafka Read cross language
[piotr.szuberski] [BEAM-10543] Add new parameters to python wrapper of Kafka Read
[piotr.szuberski] [BEAM-10543] Modify Kafka python cross-language integration test to use
[piotr.szuberski] [BEAM-10543] Run Kafka cross-language integration test in python
[Robert Burke] [BEAM-9615] Add initial Schema to Go conversions.
[douglas.damon] Additional edits to task description
[douglas.damon] Update stepik course
[noreply] [BEAM-10240] Support ZetaSQL DATETIME functions in BeamSQL (#12348)
[Robert Burke] [BEAM-9615] Improve error handling on schema conv
[noreply] Updating changes.md (#12424)
[noreply] [BEAM-10645] Create context for allowing non-parallel dataframe
------------------------------------------
[...truncated 95.34 KB...]
> Task :sdks:java:extensions:sql:shell:classes UP-TO-DATE
> Task :sdks:java:extensions:sql:shell:jar
> Task :sdks:java:extensions:sql:shell:distTar
> Task :sdks:java:extensions:sql:jdbc:compileTestJava
Note: Some input files use or override a deprecated API.
Note: Recompile with -Xlint:deprecation for details.
Note: Some input files use unchecked or unsafe operations.
Note: Recompile with -Xlint:unchecked for details.
> Task :sdks:java:extensions:sql:jdbc:testClasses
> Task :sdks:java:extensions:sql:jdbc:packageTests
> Task :sdks:java:extensions:sql:jdbc:assemble
> Task :sdks:java:extensions:sql:jdbc:analyzeTestClassesDependencies SKIPPED
> Task :sdks:java:extensions:sql:jdbc:analyzeDependencies SKIPPED
> Task :sdks:java:extensions:sql:jdbc:checkstyleTest
> Task :sdks:java:extensions:sql:shell:distZip
> Task :sdks:java:extensions:sql:shell:assemble
> Task :sdks:java:extensions:sql:expansion-service:compileTestJava NO-SOURCE
> Task :sdks:java:extensions:sql:expansion-service:testClasses UP-TO-DATE
> Task :sdks:java:extensions:sql:expansion-service:packageTests
> Task :sdks:java:extensions:sql:expansion-service:assemble
> Task :sdks:java:extensions:sql:expansion-service:analyzeClassesDependencies SKIPPED
> Task :sdks:java:extensions:sql:expansion-service:analyzeTestClassesDependencies SKIPPED
> Task :sdks:java:extensions:sql:expansion-service:analyzeDependencies SKIPPED
> Task :sdks:java:extensions:sql:expansion-service:checkstyleMain
> Task :sdks:java:extensions:sql:expansion-service:checkstyleTest NO-SOURCE
> Task :sdks:java:extensions:sql:expansion-service:javadoc
> Task :runners:flink:1.8:job-server:distTar
> Task :runners:flink:1.9:job-server:distTar
> Task :runners:flink:1.10:job-server:distTar
> Task :sdks:java:extensions:sql:shell:analyzeClassesDependencies
> Task :sdks:java:extensions:sql:shell:compileTestJava NO-SOURCE
> Task :sdks:java:extensions:sql:shell:testClasses UP-TO-DATE
> Task :sdks:java:extensions:sql:shell:analyzeTestClassesDependencies
> Task :sdks:java:extensions:sql:shell:analyzeDependencies
> Task :sdks:java:extensions:sql:shell:test NO-SOURCE
> Task :sdks:java:extensions:sql:shell:check
> Task :sdks:java:extensions:sql:shell:build
> Task :sdks:java:extensions:sql:shell:buildDependents
[main] INFO org.gradle.internal.nativeintegration.services.NativeServices - Initialized native services in: /home/jenkins/.gradle/native
> Task :sdks:java:extensions:sql:expansion-service:spotbugsMain
SLF4J: Failed to load class "org.slf4j.impl.StaticLoggerBinder".
SLF4J: Defaulting to no-operation (NOP) logger implementation
SLF4J: See http://www.slf4j.org/codes.html#StaticLoggerBinder for further details.
> Task :sdks:java:extensions:sql:zetasql:test
> Task :sdks:java:extensions:sql:jdbc:shadowTestJar
> Task :sdks:java:extensions:sql:expansion-service:test NO-SOURCE
> Task :sdks:java:extensions:sql:expansion-service:check
> Task :sdks:java:extensions:sql:expansion-service:build
> Task :sdks:java:testing:nexmark:test
> Task :sdks:java:extensions:sql:spotbugsMain FAILED
> Task :runners:flink:1.8:job-server:distZip
> Task :runners:flink:1.9:job-server:distZip
> Task :runners:flink:1.10:job-server:distZip
> Task :sdks:java:extensions:sql:test
> Task :sdks:java:extensions:sql:jdbc:test
> Task :sdks:java:extensions:sql:jdbc:check
> Task :sdks:java:extensions:sql:jdbc:build
> Task :sdks:java:extensions:sql:jdbc:buildDependents
> Task :runners:flink:1.9:job-server:shadowJar
> Task :runners:flink:1.10:job-server:shadowJar
> Task :runners:flink:1.8:job-server:shadowJar
> Task :runners:flink:1.8:job-server:startShadowScripts
> Task :runners:flink:1.9:job-server:startShadowScripts
> Task :runners:flink:1.10:job-server:startShadowScripts
> Task :runners:flink:1.8:job-server:shadowDistTar
> Task :runners:flink:1.9:job-server:shadowDistTar
> Task :runners:flink:1.10:job-server:shadowDistTar
> Task :runners:flink:1.9:job-server:shadowDistZip
> Task :runners:flink:1.9:job-server:assemble
> Task :runners:flink:1.9:job-server:spotbugsMain NO-SOURCE
> Task :runners:flink:1.9:job-server:test NO-SOURCE
> Task :runners:flink:1.9:job-server:check UP-TO-DATE
> Task :runners:flink:1.9:job-server:build
> Task :runners:flink:1.9:job-server:buildDependents
> Task :runners:flink:1.8:job-server:shadowDistZip
> Task :runners:flink:1.8:job-server:assemble
> Task :runners:flink:1.8:job-server:spotbugsMain NO-SOURCE
> Task :runners:flink:1.8:job-server:test NO-SOURCE
> Task :runners:flink:1.8:job-server:check UP-TO-DATE
> Task :runners:flink:1.8:job-server:build
> Task :runners:flink:1.8:job-server:buildDependents
> Task :runners:flink:1.10:job-server:shadowDistZip
> Task :runners:flink:1.10:job-server:assemble
> Task :runners:flink:1.10:job-server:spotbugsMain NO-SOURCE
> Task :runners:flink:1.10:job-server:test NO-SOURCE
> Task :runners:flink:1.10:job-server:check UP-TO-DATE
> Task :runners:flink:1.10:job-server:build
> Task :runners:flink:1.10:job-server:buildDependents
> Task :sdks:java:extensions:sql:expansion-service:buildDependents
> Task :sdks:java:extensions:sql:zetasql:check
> Task :sdks:java:extensions:sql:zetasql:build
> Task :sdks:java:extensions:sql:testJar
> Task :sdks:java:extensions:sql:runBasicExample
SLF4J: Class path contains multiple SLF4J bindings.
SLF4J: Found binding in [jar:file:/home/jenkins/.gradle/caches/modules-2/files-2.1/org.slf4j/slf4j-jdk14/1.7.25/bccda40ebc8067491b32a88f49615a747d20082d/slf4j-jdk14-1.7.25.jar!/org/slf4j/impl/StaticLoggerBinder.class]
SLF4J: Found binding in [jar:file:/home/jenkins/.gradle/caches/modules-2/files-2.1/org.slf4j/slf4j-log4j12/1.7.25/110cefe2df103412849d72ef7a67e4e91e4266b4/slf4j-log4j12-1.7.25.jar!/org/slf4j/impl/StaticLoggerBinder.class]
SLF4J: See http://www.slf4j.org/codes.html#multiple_bindings for an explanation.
SLF4J: Actual binding is of type [org.slf4j.impl.JDK14LoggerFactory]
> Task :sdks:java:extensions:sql:perf-tests:compileTestJava
> Task :sdks:java:extensions:sql:perf-tests:testClasses
> Task :sdks:java:extensions:sql:perf-tests:analyzeTestClassesDependencies SKIPPED
> Task :sdks:java:extensions:sql:perf-tests:analyzeDependencies SKIPPED
> Task :sdks:java:extensions:sql:perf-tests:checkstyleTest
> Task :sdks:java:extensions:sql:perf-tests:test NO-SOURCE
> Task :sdks:java:extensions:sql:perf-tests:check
> Task :sdks:java:extensions:sql:perf-tests:build
> Task :sdks:java:extensions:sql:perf-tests:buildDependents
> Task :sdks:java:extensions:sql:runBasicExample
Aug 07, 2020 12:10:23 AM org.apache.beam.sdk.extensions.sql.impl.CalciteQueryPlanner convertToBeamRel
INFO: SQL:
SELECT `PCOLLECTION`.`c1`, `PCOLLECTION`.`c2`, `PCOLLECTION`.`c3`
FROM `beam`.`PCOLLECTION` AS `PCOLLECTION`
WHERE `PCOLLECTION`.`c1` > 1
Aug 07, 2020 12:10:24 AM org.apache.beam.sdk.extensions.sql.impl.CalciteQueryPlanner convertToBeamRel
INFO: SQLPlan>
LogicalProject(c1=[$0], c2=[$1], c3=[$2])
LogicalFilter(condition=[>($0, 1)])
BeamIOSourceRel(table=[[beam, PCOLLECTION]])
Aug 07, 2020 12:10:25 AM org.apache.beam.sdk.extensions.sql.impl.CalciteQueryPlanner convertToBeamRel
INFO: BEAMPlan>
BeamCalcRel(expr#0..2=[{inputs}], expr#3=[1], expr#4=[>($t0, $t3)], proj#0..2=[{exprs}], $condition=[$t4])
BeamIOSourceRel(table=[[beam, PCOLLECTION]])
Aug 07, 2020 12:10:28 AM org.apache.beam.sdk.extensions.sql.impl.CalciteQueryPlanner convertToBeamRel
INFO: SQL:
SELECT `CASE1_RESULT`.`c2`, SUM(`CASE1_RESULT`.`c3`)
FROM `beam`.`CASE1_RESULT` AS `CASE1_RESULT`
GROUP BY `CASE1_RESULT`.`c2`
Aug 07, 2020 12:10:28 AM org.apache.beam.sdk.extensions.sql.impl.CalciteQueryPlanner convertToBeamRel
INFO: SQLPlan>
LogicalAggregate(group=[{0}], EXPR$1=[SUM($1)])
LogicalProject(c2=[$1], c3=[$2])
BeamIOSourceRel(table=[[beam, CASE1_RESULT]])
Aug 07, 2020 12:10:29 AM org.apache.beam.sdk.extensions.sql.impl.CalciteQueryPlanner convertToBeamRel
INFO: BEAMPlan>
BeamAggregationRel(group=[{1}], EXPR$1=[SUM($2)])
BeamIOSourceRel(table=[[beam, CASE1_RESULT]])
Aug 07, 2020 12:10:30 AM org.apache.beam.sdk.Pipeline validate
WARNING: The following transforms do not have stable unique names: log_result, SqlTransform
PCOLLECTION: [2, row, 2.0]
PCOLLECTION: [3, row, 3.0]
CASE1_RESULT: [row, 5.0]
> Task :sdks:java:extensions:sql:runPojoExample
SLF4J: Class path contains multiple SLF4J bindings.
SLF4J: Found binding in [jar:file:/home/jenkins/.gradle/caches/modules-2/files-2.1/org.slf4j/slf4j-jdk14/1.7.25/bccda40ebc8067491b32a88f49615a747d20082d/slf4j-jdk14-1.7.25.jar!/org/slf4j/impl/StaticLoggerBinder.class]
SLF4J: Found binding in [jar:file:/home/jenkins/.gradle/caches/modules-2/files-2.1/org.slf4j/slf4j-log4j12/1.7.25/110cefe2df103412849d72ef7a67e4e91e4266b4/slf4j-log4j12-1.7.25.jar!/org/slf4j/impl/StaticLoggerBinder.class]
SLF4J: See http://www.slf4j.org/codes.html#multiple_bindings for an explanation.
SLF4J: Actual binding is of type [org.slf4j.impl.JDK14LoggerFactory]
Aug 07, 2020 12:10:48 AM org.apache.beam.sdk.extensions.sql.impl.CalciteQueryPlanner convertToBeamRel
INFO: SQL:
SELECT `PCOLLECTION`.`id`, `PCOLLECTION`.`name`
FROM `beam`.`PCOLLECTION` AS `PCOLLECTION`
WHERE `PCOLLECTION`.`countryOfResidence` = 'Wonderland'
Aug 07, 2020 12:10:48 AM org.apache.beam.sdk.extensions.sql.impl.CalciteQueryPlanner convertToBeamRel
INFO: SQLPlan>
LogicalProject(id=[$2], name=[$1])
LogicalFilter(condition=[=($0, 'Wonderland')])
BeamIOSourceRel(table=[[beam, PCOLLECTION]])
Aug 07, 2020 12:10:49 AM org.apache.beam.sdk.extensions.sql.impl.CalciteQueryPlanner convertToBeamRel
INFO: BEAMPlan>
BeamCalcRel(expr#0..2=[{inputs}], expr#3=['Wonderland':VARCHAR], expr#4=[=($t0, $t3)], id=[$t2], name=[$t1], $condition=[$t4])
BeamIOSourceRel(table=[[beam, PCOLLECTION]])
Aug 07, 2020 12:10:50 AM org.apache.beam.sdk.extensions.sql.impl.CalciteQueryPlanner convertToBeamRel
INFO: SQL:
SELECT COUNT(`PCOLLECTION`.`id`)
FROM `beam`.`PCOLLECTION` AS `PCOLLECTION`
Aug 07, 2020 12:10:51 AM org.apache.beam.sdk.extensions.sql.impl.CalciteQueryPlanner convertToBeamRel
INFO: SQLPlan>
LogicalAggregate(group=[{}], EXPR$0=[COUNT()])
LogicalProject(id=[$0])
BeamIOSourceRel(table=[[beam, PCOLLECTION]])
Aug 07, 2020 12:10:51 AM org.apache.beam.sdk.extensions.sql.impl.CalciteQueryPlanner convertToBeamRel
INFO: BEAMPlan>
BeamAggregationRel(group=[{}], EXPR$0=[COUNT()])
BeamIOSourceRel(table=[[beam, PCOLLECTION]])
Aug 07, 2020 12:10:51 AM org.apache.beam.sdk.extensions.sql.impl.CalciteQueryPlanner convertToBeamRel
INFO: SQL:
SELECT `customers`.`name`, 'order id:' || CAST(`orders`.`id` AS VARCHAR)
FROM `beam`.`orders` AS `orders`
INNER JOIN `beam`.`customers` AS `customers` ON `orders`.`customerId` = `customers`.`id`
WHERE `customers`.`name` = 'Grault'
Aug 07, 2020 12:10:51 AM org.apache.beam.sdk.extensions.sql.impl.CalciteQueryPlanner convertToBeamRel
INFO: SQLPlan>
LogicalProject(name=[$3], EXPR$1=[||('order id:', CAST($1):VARCHAR NOT NULL)])
LogicalFilter(condition=[=($3, 'Grault')])
LogicalJoin(condition=[=($0, $4)], joinType=[inner])
BeamIOSourceRel(table=[[beam, orders]])
BeamIOSourceRel(table=[[beam, customers]])
Aug 07, 2020 12:10:52 AM org.apache.beam.sdk.extensions.sql.impl.CalciteQueryPlanner convertToBeamRel
INFO: BEAMPlan>
BeamCalcRel(expr#0..4=[{inputs}], expr#5=['order id:'], expr#6=[CAST($t1):VARCHAR NOT NULL], expr#7=[||($t5, $t6)], name=[$t3], EXPR$1=[$t7])
BeamCoGBKJoinRel(condition=[=($0, $4)], joinType=[inner])
BeamIOSourceRel(table=[[beam, orders]])
BeamCalcRel(expr#0..2=[{inputs}], expr#3=['Grault':VARCHAR], expr#4=[=($t1, $t3)], proj#0..2=[{exprs}], $condition=[$t4])
BeamIOSourceRel(table=[[beam, customers]])
Aug 07, 2020 12:10:53 AM org.apache.beam.sdk.Pipeline validate
WARNING: The following transforms do not have stable unique names: Create.Values, MapElements, SqlTransform
[4, Grault]: is from Wonderland
[1, Foo]: is from Wonderland
[3, Baz]: is from Wonderland
[3]: total customers in Wonderland
[Grault, order id:7]: ordered by 'Grault'
[Grault, order id:8]: ordered by 'Grault'
> Task :sdks:java:testing:nexmark:check
> Task :sdks:java:testing:nexmark:build
> Task :sdks:java:testing:nexmark:buildDependents
> Task :sdks:java:extensions:sql:zetasql:buildDependents
FAILURE: Build failed with an exception.
* What went wrong:
Execution failed for task ':sdks:java:extensions:sql:spotbugsMain'.
> SpotBugs rule violations were found. See the report at: file://<https://ci-beam.apache.org/job/beam_PreCommit_SQL_Cron/ws/src/sdks/java/extensions/sql/build/reports/spotbugs/main.xml>
* Try:
Run with --stacktrace option to get the stack trace. Run with --info or --debug option to get more log output. Run with --scan to get full insights.
* Get more help at https://help.gradle.org
Deprecated Gradle features were used in this build, making it incompatible with Gradle 6.0.
Use '--warning-mode all' to show the individual deprecation warnings.
See https://docs.gradle.org/5.2.1/userguide/command_line_interface.html#sec:command_line_warnings
BUILD FAILED in 17m 2s
219 actionable tasks: 189 executed, 30 from cache
Publishing build scan...
https://gradle.com/s/f6cwzi7vbclsa
Build step 'Invoke Gradle script' changed build result to FAILURE
Build step 'Invoke Gradle script' marked build as failure
---------------------------------------------------------------------
To unsubscribe, e-mail: builds-unsubscribe@beam.apache.org
For additional commands, e-mail: builds-help@beam.apache.org
Jenkins build is back to normal : beam_PreCommit_SQL_Cron #1081
Posted by Apache Jenkins Server <je...@builds.apache.org>.
See <https://ci-beam.apache.org/job/beam_PreCommit_SQL_Cron/1081/display/redirect?page=changes>
---------------------------------------------------------------------
To unsubscribe, e-mail: builds-unsubscribe@beam.apache.org
For additional commands, e-mail: builds-help@beam.apache.org
Build failed in Jenkins: beam_PreCommit_SQL_Cron #1080
Posted by Apache Jenkins Server <je...@builds.apache.org>.
See <https://ci-beam.apache.org/job/beam_PreCommit_SQL_Cron/1080/display/redirect?page=changes>
Changes:
[kamil.galuszka] [BEAM-10647] Fixes get_query_location bug in BigQueryWrapper
[noreply] [BEAM-7390] Add top code snippets (#12482)
[noreply] GH-Actions workflow checks are GCP variables set [depends on BEAM-10599]
------------------------------------------
[...truncated 93.71 KB...]
> Task :sdks:java:extensions:sql:shell:classes UP-TO-DATE
> Task :sdks:java:extensions:sql:shell:jar
> Task :sdks:java:extensions:sql:shell:distTar
> Task :sdks:java:extensions:sql:jdbc:compileTestJava
Note: Some input files use or override a deprecated API.
Note: Recompile with -Xlint:deprecation for details.
Note: Some input files use unchecked or unsafe operations.
Note: Recompile with -Xlint:unchecked for details.
> Task :sdks:java:extensions:sql:jdbc:testClasses
> Task :sdks:java:extensions:sql:jdbc:packageTests
> Task :sdks:java:extensions:sql:jdbc:assemble
> Task :sdks:java:extensions:sql:jdbc:analyzeTestClassesDependencies SKIPPED
> Task :sdks:java:extensions:sql:jdbc:analyzeDependencies SKIPPED
> Task :sdks:java:extensions:sql:jdbc:checkstyleTest
> Task :sdks:java:extensions:sql:expansion-service:compileTestJava NO-SOURCE
> Task :sdks:java:extensions:sql:expansion-service:testClasses UP-TO-DATE
> Task :sdks:java:extensions:sql:expansion-service:packageTests
> Task :sdks:java:extensions:sql:expansion-service:assemble
> Task :sdks:java:extensions:sql:expansion-service:analyzeClassesDependencies SKIPPED
> Task :sdks:java:extensions:sql:expansion-service:analyzeTestClassesDependencies SKIPPED
> Task :sdks:java:extensions:sql:expansion-service:analyzeDependencies SKIPPED
> Task :sdks:java:extensions:sql:expansion-service:checkstyleMain
> Task :sdks:java:extensions:sql:expansion-service:checkstyleTest NO-SOURCE
> Task :runners:flink:1.10:job-server:distTar
> Task :runners:flink:1.8:job-server:distTar
> Task :sdks:java:extensions:sql:expansion-service:javadoc
> Task :runners:flink:1.9:job-server:distTar
[main] INFO org.gradle.internal.nativeintegration.services.NativeServices - Initialized native services in: /home/jenkins/.gradle/native
> Task :sdks:java:extensions:sql:expansion-service:spotbugsMain
SLF4J: Failed to load class "org.slf4j.impl.StaticLoggerBinder".
SLF4J: Defaulting to no-operation (NOP) logger implementation
SLF4J: See http://www.slf4j.org/codes.html#StaticLoggerBinder for further details.
> Task :sdks:java:extensions:sql:shell:distZip
> Task :sdks:java:extensions:sql:shell:assemble
> Task :sdks:java:extensions:sql:zetasql:test
> Task :sdks:java:extensions:sql:expansion-service:test NO-SOURCE
> Task :sdks:java:extensions:sql:expansion-service:check
> Task :sdks:java:extensions:sql:expansion-service:build
> Task :sdks:java:extensions:sql:shell:analyzeClassesDependencies
> Task :sdks:java:extensions:sql:shell:compileTestJava NO-SOURCE
> Task :sdks:java:extensions:sql:shell:testClasses UP-TO-DATE
> Task :sdks:java:extensions:sql:shell:analyzeTestClassesDependencies
> Task :sdks:java:extensions:sql:shell:analyzeDependencies
> Task :sdks:java:extensions:sql:shell:test NO-SOURCE
> Task :sdks:java:extensions:sql:shell:check
> Task :sdks:java:extensions:sql:shell:build
> Task :sdks:java:extensions:sql:shell:buildDependents
> Task :sdks:java:extensions:sql:jdbc:shadowTestJar
> Task :sdks:java:testing:nexmark:test
> Task :runners:flink:1.10:job-server:distZip
> Task :runners:flink:1.8:job-server:distZip
> Task :runners:flink:1.9:job-server:distZip
> Task :sdks:java:extensions:sql:spotbugsMain FAILED
> Task :sdks:java:extensions:sql:test
> Task :sdks:java:extensions:sql:jdbc:test
> Task :sdks:java:extensions:sql:jdbc:check
> Task :sdks:java:extensions:sql:jdbc:build
> Task :sdks:java:extensions:sql:jdbc:buildDependents
> Task :runners:flink:1.10:job-server:shadowJar
> Task :runners:flink:1.8:job-server:shadowJar
> Task :runners:flink:1.9:job-server:shadowJar
> Task :runners:flink:1.10:job-server:startShadowScripts
> Task :runners:flink:1.8:job-server:startShadowScripts
> Task :runners:flink:1.10:job-server:shadowDistTar
> Task :runners:flink:1.9:job-server:startShadowScripts
> Task :runners:flink:1.8:job-server:shadowDistTar
> Task :runners:flink:1.9:job-server:shadowDistTar
> Task :runners:flink:1.10:job-server:shadowDistZip
> Task :runners:flink:1.10:job-server:assemble
> Task :runners:flink:1.10:job-server:spotbugsMain NO-SOURCE
> Task :runners:flink:1.10:job-server:test NO-SOURCE
> Task :runners:flink:1.10:job-server:check UP-TO-DATE
> Task :runners:flink:1.10:job-server:build
> Task :runners:flink:1.10:job-server:buildDependents
> Task :runners:flink:1.8:job-server:shadowDistZip
> Task :runners:flink:1.8:job-server:assemble
> Task :runners:flink:1.8:job-server:spotbugsMain NO-SOURCE
> Task :runners:flink:1.8:job-server:test NO-SOURCE
> Task :runners:flink:1.8:job-server:check UP-TO-DATE
> Task :runners:flink:1.8:job-server:build
> Task :runners:flink:1.8:job-server:buildDependents
> Task :runners:flink:1.9:job-server:shadowDistZip
> Task :runners:flink:1.9:job-server:assemble
> Task :runners:flink:1.9:job-server:spotbugsMain NO-SOURCE
> Task :runners:flink:1.9:job-server:test NO-SOURCE
> Task :runners:flink:1.9:job-server:check UP-TO-DATE
> Task :runners:flink:1.9:job-server:build
> Task :runners:flink:1.9:job-server:buildDependents
> Task :sdks:java:extensions:sql:expansion-service:buildDependents
> Task :sdks:java:extensions:sql:zetasql:check
> Task :sdks:java:extensions:sql:zetasql:build
> Task :sdks:java:extensions:sql:testJar
> Task :sdks:java:extensions:sql:runBasicExample
SLF4J: Class path contains multiple SLF4J bindings.
SLF4J: Found binding in [jar:file:/home/jenkins/.gradle/caches/modules-2/files-2.1/org.slf4j/slf4j-jdk14/1.7.25/bccda40ebc8067491b32a88f49615a747d20082d/slf4j-jdk14-1.7.25.jar!/org/slf4j/impl/StaticLoggerBinder.class]
SLF4J: Found binding in [jar:file:/home/jenkins/.gradle/caches/modules-2/files-2.1/org.slf4j/slf4j-log4j12/1.7.25/110cefe2df103412849d72ef7a67e4e91e4266b4/slf4j-log4j12-1.7.25.jar!/org/slf4j/impl/StaticLoggerBinder.class]
SLF4J: See http://www.slf4j.org/codes.html#multiple_bindings for an explanation.
SLF4J: Actual binding is of type [org.slf4j.impl.JDK14LoggerFactory]
> Task :sdks:java:extensions:sql:perf-tests:compileTestJava
> Task :sdks:java:extensions:sql:perf-tests:testClasses
> Task :sdks:java:extensions:sql:perf-tests:analyzeTestClassesDependencies SKIPPED
> Task :sdks:java:extensions:sql:perf-tests:analyzeDependencies SKIPPED
> Task :sdks:java:extensions:sql:perf-tests:checkstyleTest
> Task :sdks:java:extensions:sql:perf-tests:test NO-SOURCE
> Task :sdks:java:extensions:sql:perf-tests:check
> Task :sdks:java:extensions:sql:perf-tests:build
> Task :sdks:java:extensions:sql:perf-tests:buildDependents
> Task :sdks:java:extensions:sql:runBasicExample
Aug 07, 2020 6:16:17 PM org.apache.beam.sdk.extensions.sql.impl.CalciteQueryPlanner convertToBeamRel
INFO: SQL:
SELECT `PCOLLECTION`.`c1`, `PCOLLECTION`.`c2`, `PCOLLECTION`.`c3`
FROM `beam`.`PCOLLECTION` AS `PCOLLECTION`
WHERE `PCOLLECTION`.`c1` > 1
Aug 07, 2020 6:16:18 PM org.apache.beam.sdk.extensions.sql.impl.CalciteQueryPlanner convertToBeamRel
INFO: SQLPlan>
LogicalProject(c1=[$0], c2=[$1], c3=[$2])
LogicalFilter(condition=[>($0, 1)])
BeamIOSourceRel(table=[[beam, PCOLLECTION]])
Aug 07, 2020 6:16:18 PM org.apache.beam.sdk.extensions.sql.impl.CalciteQueryPlanner convertToBeamRel
INFO: BEAMPlan>
BeamCalcRel(expr#0..2=[{inputs}], expr#3=[1], expr#4=[>($t0, $t3)], proj#0..2=[{exprs}], $condition=[$t4])
BeamIOSourceRel(table=[[beam, PCOLLECTION]])
Aug 07, 2020 6:16:19 PM org.apache.beam.sdk.extensions.sql.impl.CalciteQueryPlanner convertToBeamRel
INFO: SQL:
SELECT `CASE1_RESULT`.`c2`, SUM(`CASE1_RESULT`.`c3`)
FROM `beam`.`CASE1_RESULT` AS `CASE1_RESULT`
GROUP BY `CASE1_RESULT`.`c2`
Aug 07, 2020 6:16:19 PM org.apache.beam.sdk.extensions.sql.impl.CalciteQueryPlanner convertToBeamRel
INFO: SQLPlan>
LogicalAggregate(group=[{0}], EXPR$1=[SUM($1)])
LogicalProject(c2=[$1], c3=[$2])
BeamIOSourceRel(table=[[beam, CASE1_RESULT]])
Aug 07, 2020 6:16:19 PM org.apache.beam.sdk.extensions.sql.impl.CalciteQueryPlanner convertToBeamRel
INFO: BEAMPlan>
BeamAggregationRel(group=[{1}], EXPR$1=[SUM($2)])
BeamIOSourceRel(table=[[beam, CASE1_RESULT]])
Aug 07, 2020 6:16:20 PM org.apache.beam.sdk.Pipeline validate
WARNING: The following transforms do not have stable unique names: log_result, SqlTransform
PCOLLECTION: [3, row, 3.0]
PCOLLECTION: [2, row, 2.0]
CASE1_RESULT: [row, 5.0]
> Task :sdks:java:extensions:sql:runPojoExample
SLF4J: Class path contains multiple SLF4J bindings.
SLF4J: Found binding in [jar:file:/home/jenkins/.gradle/caches/modules-2/files-2.1/org.slf4j/slf4j-jdk14/1.7.25/bccda40ebc8067491b32a88f49615a747d20082d/slf4j-jdk14-1.7.25.jar!/org/slf4j/impl/StaticLoggerBinder.class]
SLF4J: Found binding in [jar:file:/home/jenkins/.gradle/caches/modules-2/files-2.1/org.slf4j/slf4j-log4j12/1.7.25/110cefe2df103412849d72ef7a67e4e91e4266b4/slf4j-log4j12-1.7.25.jar!/org/slf4j/impl/StaticLoggerBinder.class]
SLF4J: See http://www.slf4j.org/codes.html#multiple_bindings for an explanation.
SLF4J: Actual binding is of type [org.slf4j.impl.JDK14LoggerFactory]
Aug 07, 2020 6:16:34 PM org.apache.beam.sdk.extensions.sql.impl.CalciteQueryPlanner convertToBeamRel
INFO: SQL:
SELECT `PCOLLECTION`.`id`, `PCOLLECTION`.`name`
FROM `beam`.`PCOLLECTION` AS `PCOLLECTION`
WHERE `PCOLLECTION`.`countryOfResidence` = 'Wonderland'
Aug 07, 2020 6:16:34 PM org.apache.beam.sdk.extensions.sql.impl.CalciteQueryPlanner convertToBeamRel
INFO: SQLPlan>
LogicalProject(id=[$2], name=[$1])
LogicalFilter(condition=[=($0, 'Wonderland')])
BeamIOSourceRel(table=[[beam, PCOLLECTION]])
Aug 07, 2020 6:16:35 PM org.apache.beam.sdk.extensions.sql.impl.CalciteQueryPlanner convertToBeamRel
INFO: BEAMPlan>
BeamCalcRel(expr#0..2=[{inputs}], expr#3=['Wonderland':VARCHAR], expr#4=[=($t0, $t3)], id=[$t2], name=[$t1], $condition=[$t4])
BeamIOSourceRel(table=[[beam, PCOLLECTION]])
Aug 07, 2020 6:16:36 PM org.apache.beam.sdk.extensions.sql.impl.CalciteQueryPlanner convertToBeamRel
INFO: SQL:
SELECT COUNT(`PCOLLECTION`.`id`)
FROM `beam`.`PCOLLECTION` AS `PCOLLECTION`
Aug 07, 2020 6:16:36 PM org.apache.beam.sdk.extensions.sql.impl.CalciteQueryPlanner convertToBeamRel
INFO: SQLPlan>
LogicalAggregate(group=[{}], EXPR$0=[COUNT()])
LogicalProject(id=[$0])
BeamIOSourceRel(table=[[beam, PCOLLECTION]])
Aug 07, 2020 6:16:36 PM org.apache.beam.sdk.extensions.sql.impl.CalciteQueryPlanner convertToBeamRel
INFO: BEAMPlan>
BeamAggregationRel(group=[{}], EXPR$0=[COUNT()])
BeamIOSourceRel(table=[[beam, PCOLLECTION]])
Aug 07, 2020 6:16:36 PM org.apache.beam.sdk.extensions.sql.impl.CalciteQueryPlanner convertToBeamRel
INFO: SQL:
SELECT `customers`.`name`, 'order id:' || CAST(`orders`.`id` AS VARCHAR)
FROM `beam`.`orders` AS `orders`
INNER JOIN `beam`.`customers` AS `customers` ON `orders`.`customerId` = `customers`.`id`
WHERE `customers`.`name` = 'Grault'
Aug 07, 2020 6:16:36 PM org.apache.beam.sdk.extensions.sql.impl.CalciteQueryPlanner convertToBeamRel
INFO: SQLPlan>
LogicalProject(name=[$3], EXPR$1=[||('order id:', CAST($1):VARCHAR NOT NULL)])
LogicalFilter(condition=[=($3, 'Grault')])
LogicalJoin(condition=[=($0, $4)], joinType=[inner])
BeamIOSourceRel(table=[[beam, orders]])
BeamIOSourceRel(table=[[beam, customers]])
Aug 07, 2020 6:16:37 PM org.apache.beam.sdk.extensions.sql.impl.CalciteQueryPlanner convertToBeamRel
INFO: BEAMPlan>
BeamCalcRel(expr#0..4=[{inputs}], expr#5=['order id:'], expr#6=[CAST($t1):VARCHAR NOT NULL], expr#7=[||($t5, $t6)], name=[$t3], EXPR$1=[$t7])
BeamCoGBKJoinRel(condition=[=($0, $4)], joinType=[inner])
BeamIOSourceRel(table=[[beam, orders]])
BeamCalcRel(expr#0..2=[{inputs}], expr#3=['Grault':VARCHAR], expr#4=[=($t1, $t3)], proj#0..2=[{exprs}], $condition=[$t4])
BeamIOSourceRel(table=[[beam, customers]])
Aug 07, 2020 6:16:37 PM org.apache.beam.sdk.Pipeline validate
WARNING: The following transforms do not have stable unique names: Create.Values, MapElements, SqlTransform
[4, Grault]: is from Wonderland
[3, Baz]: is from Wonderland
[1, Foo]: is from Wonderland
[3]: total customers in Wonderland
[Grault, order id:8]: ordered by 'Grault'
[Grault, order id:7]: ordered by 'Grault'
> Task :sdks:java:testing:nexmark:check
> Task :sdks:java:testing:nexmark:build
> Task :sdks:java:testing:nexmark:buildDependents
> Task :sdks:java:extensions:sql:zetasql:buildDependents
FAILURE: Build failed with an exception.
* What went wrong:
Execution failed for task ':sdks:java:extensions:sql:spotbugsMain'.
> SpotBugs rule violations were found. See the report at: file://<https://ci-beam.apache.org/job/beam_PreCommit_SQL_Cron/ws/src/sdks/java/extensions/sql/build/reports/spotbugs/main.xml>
* Try:
Run with --stacktrace option to get the stack trace. Run with --info or --debug option to get more log output. Run with --scan to get full insights.
* Get more help at https://help.gradle.org
Deprecated Gradle features were used in this build, making it incompatible with Gradle 6.0.
Use '--warning-mode all' to show the individual deprecation warnings.
See https://docs.gradle.org/5.2.1/userguide/command_line_interface.html#sec:command_line_warnings
BUILD FAILED in 14m 29s
219 actionable tasks: 185 executed, 34 from cache
Publishing build scan...
https://gradle.com/s/6u76d56hqbui6
Build step 'Invoke Gradle script' changed build result to FAILURE
Build step 'Invoke Gradle script' marked build as failure
---------------------------------------------------------------------
To unsubscribe, e-mail: builds-unsubscribe@beam.apache.org
For additional commands, e-mail: builds-help@beam.apache.org
Build failed in Jenkins: beam_PreCommit_SQL_Cron #1079
Posted by Apache Jenkins Server <je...@builds.apache.org>.
See <https://ci-beam.apache.org/job/beam_PreCommit_SQL_Cron/1079/display/redirect?page=changes>
Changes:
[noreply] [BEAM-10630] Check load tests as part of the release process (#12455)
------------------------------------------
[...truncated 92.65 KB...]
> Task :sdks:java:extensions:sql:spotbugsMain
SLF4J: Failed to load class "org.slf4j.impl.StaticLoggerBinder".
SLF4J: Defaulting to no-operation (NOP) logger implementation
SLF4J: See http://www.slf4j.org/codes.html#StaticLoggerBinder for further details.
> Task :sdks:java:extensions:sql:jdbc:shadowJar
> Task :sdks:java:extensions:sql:shell:compileJava NO-SOURCE
> Task :sdks:java:extensions:sql:shell:classes UP-TO-DATE
> Task :sdks:java:extensions:sql:shell:jar
> Task :sdks:java:extensions:sql:zetasql:test
> Task :sdks:java:extensions:sql:shell:distTar
> Task :sdks:java:testing:nexmark:test
> Task :sdks:java:extensions:sql:jdbc:shadowTestJar
> Task :sdks:java:extensions:sql:shell:distZip
> Task :sdks:java:extensions:sql:expansion-service:compileTestJava NO-SOURCE
> Task :sdks:java:extensions:sql:expansion-service:testClasses UP-TO-DATE
> Task :sdks:java:extensions:sql:expansion-service:packageTests
> Task :sdks:java:extensions:sql:expansion-service:assemble
> Task :sdks:java:extensions:sql:expansion-service:analyzeClassesDependencies SKIPPED
> Task :sdks:java:extensions:sql:expansion-service:analyzeTestClassesDependencies SKIPPED
> Task :sdks:java:extensions:sql:expansion-service:analyzeDependencies SKIPPED
> Task :sdks:java:extensions:sql:expansion-service:checkstyleMain
> Task :sdks:java:extensions:sql:expansion-service:checkstyleTest NO-SOURCE
> Task :sdks:java:extensions:sql:shell:assemble
> Task :sdks:java:extensions:sql:expansion-service:javadoc
> Task :sdks:java:extensions:sql:expansion-service:spotbugsMain
SLF4J: Class path contains multiple SLF4J bindings.
SLF4J: Found binding in [jar:file:/home/jenkins/.gradle/caches/modules-2/files-2.1/org.slf4j/slf4j-simple/1.7.25/8dacf9514f0c707cbbcdd6fd699e8940d42fb54e/slf4j-simple-1.7.25.jar!/org/slf4j/impl/StaticLoggerBinder.class]
SLF4J: Found binding in [jar:file:/home/jenkins/.gradle/wrapper/dists/gradle-5.2.1-all/bviwmvmbexq6idcscbicws5me/gradle-5.2.1/lib/gradle-logging-5.2.1.jar!/org/slf4j/impl/StaticLoggerBinder.class]
SLF4J: See http://www.slf4j.org/codes.html#multiple_bindings for an explanation.
SLF4J: Actual binding is of type [org.slf4j.impl.SimpleLoggerFactory]
[main] INFO org.gradle.internal.nativeintegration.services.NativeServices - Initialized native services in: /home/jenkins/.gradle/native
> Task :runners:flink:1.8:job-server:distTar
> Task :runners:flink:1.10:job-server:distTar
> Task :sdks:java:extensions:sql:expansion-service:spotbugsMain
SLF4J: Failed to load class "org.slf4j.impl.StaticLoggerBinder".
SLF4J: Defaulting to no-operation (NOP) logger implementation
SLF4J: See http://www.slf4j.org/codes.html#StaticLoggerBinder for further details.
> Task :runners:flink:1.9:job-server:distTar
> Task :sdks:java:extensions:sql:spotbugsMain FAILED
> Task :sdks:java:extensions:sql:shell:analyzeClassesDependencies
> Task :sdks:java:extensions:sql:shell:compileTestJava NO-SOURCE
> Task :sdks:java:extensions:sql:shell:testClasses UP-TO-DATE
> Task :sdks:java:extensions:sql:shell:analyzeTestClassesDependencies
> Task :sdks:java:extensions:sql:shell:analyzeDependencies
> Task :sdks:java:extensions:sql:shell:test NO-SOURCE
> Task :sdks:java:extensions:sql:shell:check
> Task :sdks:java:extensions:sql:shell:build
> Task :sdks:java:extensions:sql:shell:buildDependents
> Task :sdks:java:extensions:sql:expansion-service:test NO-SOURCE
> Task :sdks:java:extensions:sql:expansion-service:check
> Task :sdks:java:extensions:sql:expansion-service:build
> Task :runners:flink:1.8:job-server:distZip
> Task :runners:flink:1.10:job-server:distZip
> Task :runners:flink:1.9:job-server:distZip
> Task :sdks:java:extensions:sql:test
> Task :sdks:java:extensions:sql:jdbc:test
> Task :runners:flink:1.10:job-server:shadowJar
> Task :runners:flink:1.8:job-server:shadowJar
> Task :runners:flink:1.9:job-server:shadowJar
> Task :sdks:java:extensions:sql:jdbc:check
> Task :sdks:java:extensions:sql:jdbc:build
> Task :sdks:java:extensions:sql:jdbc:buildDependents
> Task :runners:flink:1.8:job-server:startShadowScripts
> Task :runners:flink:1.8:job-server:shadowDistTar
> Task :runners:flink:1.10:job-server:startShadowScripts
> Task :sdks:java:extensions:sql:zetasql:check
> Task :sdks:java:extensions:sql:zetasql:build
> Task :runners:flink:1.9:job-server:startShadowScripts
> Task :runners:flink:1.10:job-server:shadowDistTar
> Task :runners:flink:1.9:job-server:shadowDistTar
> Task :runners:flink:1.8:job-server:shadowDistZip
> Task :runners:flink:1.10:job-server:shadowDistZip
> Task :runners:flink:1.9:job-server:shadowDistZip
> Task :runners:flink:1.8:job-server:assemble
> Task :runners:flink:1.8:job-server:spotbugsMain NO-SOURCE
> Task :runners:flink:1.8:job-server:test NO-SOURCE
> Task :runners:flink:1.8:job-server:check UP-TO-DATE
> Task :runners:flink:1.8:job-server:build
> Task :runners:flink:1.8:job-server:buildDependents
> Task :runners:flink:1.10:job-server:assemble
> Task :runners:flink:1.10:job-server:spotbugsMain NO-SOURCE
> Task :runners:flink:1.10:job-server:test NO-SOURCE
> Task :runners:flink:1.10:job-server:check UP-TO-DATE
> Task :runners:flink:1.10:job-server:build
> Task :runners:flink:1.10:job-server:buildDependents
> Task :runners:flink:1.9:job-server:assemble
> Task :runners:flink:1.9:job-server:spotbugsMain NO-SOURCE
> Task :runners:flink:1.9:job-server:test NO-SOURCE
> Task :runners:flink:1.9:job-server:check UP-TO-DATE
> Task :runners:flink:1.9:job-server:build
> Task :runners:flink:1.9:job-server:buildDependents
> Task :sdks:java:extensions:sql:expansion-service:buildDependents
> Task :sdks:java:extensions:sql:testJar
> Task :sdks:java:extensions:sql:perf-tests:compileTestJava FROM-CACHE
> Task :sdks:java:extensions:sql:perf-tests:testClasses UP-TO-DATE
> Task :sdks:java:extensions:sql:perf-tests:analyzeTestClassesDependencies SKIPPED
> Task :sdks:java:extensions:sql:perf-tests:analyzeDependencies SKIPPED
> Task :sdks:java:extensions:sql:perf-tests:checkstyleTest
> Task :sdks:java:extensions:sql:perf-tests:test NO-SOURCE
> Task :sdks:java:extensions:sql:perf-tests:check
> Task :sdks:java:extensions:sql:perf-tests:build
> Task :sdks:java:extensions:sql:perf-tests:buildDependents
> Task :sdks:java:extensions:sql:runBasicExample
SLF4J: Class path contains multiple SLF4J bindings.
SLF4J: Found binding in [jar:file:/home/jenkins/.gradle/caches/modules-2/files-2.1/org.slf4j/slf4j-jdk14/1.7.25/bccda40ebc8067491b32a88f49615a747d20082d/slf4j-jdk14-1.7.25.jar!/org/slf4j/impl/StaticLoggerBinder.class]
SLF4J: Found binding in [jar:file:/home/jenkins/.gradle/caches/modules-2/files-2.1/org.slf4j/slf4j-log4j12/1.7.25/110cefe2df103412849d72ef7a67e4e91e4266b4/slf4j-log4j12-1.7.25.jar!/org/slf4j/impl/StaticLoggerBinder.class]
SLF4J: See http://www.slf4j.org/codes.html#multiple_bindings for an explanation.
SLF4J: Actual binding is of type [org.slf4j.impl.JDK14LoggerFactory]
Aug 07, 2020 12:19:48 PM org.apache.beam.sdk.extensions.sql.impl.CalciteQueryPlanner convertToBeamRel
INFO: SQL:
SELECT `PCOLLECTION`.`c1`, `PCOLLECTION`.`c2`, `PCOLLECTION`.`c3`
FROM `beam`.`PCOLLECTION` AS `PCOLLECTION`
WHERE `PCOLLECTION`.`c1` > 1
Aug 07, 2020 12:19:50 PM org.apache.beam.sdk.extensions.sql.impl.CalciteQueryPlanner convertToBeamRel
INFO: SQLPlan>
LogicalProject(c1=[$0], c2=[$1], c3=[$2])
LogicalFilter(condition=[>($0, 1)])
BeamIOSourceRel(table=[[beam, PCOLLECTION]])
Aug 07, 2020 12:19:51 PM org.apache.beam.sdk.extensions.sql.impl.CalciteQueryPlanner convertToBeamRel
INFO: BEAMPlan>
BeamCalcRel(expr#0..2=[{inputs}], expr#3=[1], expr#4=[>($t0, $t3)], proj#0..2=[{exprs}], $condition=[$t4])
BeamIOSourceRel(table=[[beam, PCOLLECTION]])
Aug 07, 2020 12:19:54 PM org.apache.beam.sdk.extensions.sql.impl.CalciteQueryPlanner convertToBeamRel
INFO: SQL:
SELECT `CASE1_RESULT`.`c2`, SUM(`CASE1_RESULT`.`c3`)
FROM `beam`.`CASE1_RESULT` AS `CASE1_RESULT`
GROUP BY `CASE1_RESULT`.`c2`
Aug 07, 2020 12:19:54 PM org.apache.beam.sdk.extensions.sql.impl.CalciteQueryPlanner convertToBeamRel
INFO: SQLPlan>
LogicalAggregate(group=[{0}], EXPR$1=[SUM($1)])
LogicalProject(c2=[$1], c3=[$2])
BeamIOSourceRel(table=[[beam, CASE1_RESULT]])
Aug 07, 2020 12:19:56 PM org.apache.beam.sdk.extensions.sql.impl.CalciteQueryPlanner convertToBeamRel
INFO: BEAMPlan>
BeamAggregationRel(group=[{1}], EXPR$1=[SUM($2)])
BeamIOSourceRel(table=[[beam, CASE1_RESULT]])
Aug 07, 2020 12:19:57 PM org.apache.beam.sdk.Pipeline validate
WARNING: The following transforms do not have stable unique names: log_result, SqlTransform
PCOLLECTION: [2, row, 2.0]
PCOLLECTION: [3, row, 3.0]
CASE1_RESULT: [row, 5.0]
> Task :sdks:java:extensions:sql:runPojoExample
SLF4J: Class path contains multiple SLF4J bindings.
SLF4J: Found binding in [jar:file:/home/jenkins/.gradle/caches/modules-2/files-2.1/org.slf4j/slf4j-jdk14/1.7.25/bccda40ebc8067491b32a88f49615a747d20082d/slf4j-jdk14-1.7.25.jar!/org/slf4j/impl/StaticLoggerBinder.class]
SLF4J: Found binding in [jar:file:/home/jenkins/.gradle/caches/modules-2/files-2.1/org.slf4j/slf4j-log4j12/1.7.25/110cefe2df103412849d72ef7a67e4e91e4266b4/slf4j-log4j12-1.7.25.jar!/org/slf4j/impl/StaticLoggerBinder.class]
SLF4J: See http://www.slf4j.org/codes.html#multiple_bindings for an explanation.
SLF4J: Actual binding is of type [org.slf4j.impl.JDK14LoggerFactory]
Aug 07, 2020 12:20:26 PM org.apache.beam.sdk.extensions.sql.impl.CalciteQueryPlanner convertToBeamRel
INFO: SQL:
SELECT `PCOLLECTION`.`id`, `PCOLLECTION`.`name`
FROM `beam`.`PCOLLECTION` AS `PCOLLECTION`
WHERE `PCOLLECTION`.`countryOfResidence` = 'Wonderland'
Aug 07, 2020 12:20:28 PM org.apache.beam.sdk.extensions.sql.impl.CalciteQueryPlanner convertToBeamRel
INFO: SQLPlan>
LogicalProject(id=[$2], name=[$1])
LogicalFilter(condition=[=($0, 'Wonderland')])
BeamIOSourceRel(table=[[beam, PCOLLECTION]])
Aug 07, 2020 12:20:29 PM org.apache.beam.sdk.extensions.sql.impl.CalciteQueryPlanner convertToBeamRel
INFO: BEAMPlan>
BeamCalcRel(expr#0..2=[{inputs}], expr#3=['Wonderland':VARCHAR], expr#4=[=($t0, $t3)], id=[$t2], name=[$t1], $condition=[$t4])
BeamIOSourceRel(table=[[beam, PCOLLECTION]])
Aug 07, 2020 12:20:31 PM org.apache.beam.sdk.extensions.sql.impl.CalciteQueryPlanner convertToBeamRel
INFO: SQL:
SELECT COUNT(`PCOLLECTION`.`id`)
FROM `beam`.`PCOLLECTION` AS `PCOLLECTION`
Aug 07, 2020 12:20:32 PM org.apache.beam.sdk.extensions.sql.impl.CalciteQueryPlanner convertToBeamRel
INFO: SQLPlan>
LogicalAggregate(group=[{}], EXPR$0=[COUNT()])
LogicalProject(id=[$0])
BeamIOSourceRel(table=[[beam, PCOLLECTION]])
Aug 07, 2020 12:20:32 PM org.apache.beam.sdk.extensions.sql.impl.CalciteQueryPlanner convertToBeamRel
INFO: BEAMPlan>
BeamAggregationRel(group=[{}], EXPR$0=[COUNT()])
BeamIOSourceRel(table=[[beam, PCOLLECTION]])
Aug 07, 2020 12:20:33 PM org.apache.beam.sdk.extensions.sql.impl.CalciteQueryPlanner convertToBeamRel
INFO: SQL:
SELECT `customers`.`name`, 'order id:' || CAST(`orders`.`id` AS VARCHAR)
FROM `beam`.`orders` AS `orders`
INNER JOIN `beam`.`customers` AS `customers` ON `orders`.`customerId` = `customers`.`id`
WHERE `customers`.`name` = 'Grault'
Aug 07, 2020 12:20:33 PM org.apache.beam.sdk.extensions.sql.impl.CalciteQueryPlanner convertToBeamRel
INFO: SQLPlan>
LogicalProject(name=[$3], EXPR$1=[||('order id:', CAST($1):VARCHAR NOT NULL)])
LogicalFilter(condition=[=($3, 'Grault')])
LogicalJoin(condition=[=($0, $4)], joinType=[inner])
BeamIOSourceRel(table=[[beam, orders]])
BeamIOSourceRel(table=[[beam, customers]])
Aug 07, 2020 12:20:34 PM org.apache.beam.sdk.extensions.sql.impl.CalciteQueryPlanner convertToBeamRel
INFO: BEAMPlan>
BeamCalcRel(expr#0..4=[{inputs}], expr#5=['order id:'], expr#6=[CAST($t1):VARCHAR NOT NULL], expr#7=[||($t5, $t6)], name=[$t3], EXPR$1=[$t7])
BeamCoGBKJoinRel(condition=[=($0, $4)], joinType=[inner])
BeamIOSourceRel(table=[[beam, orders]])
BeamCalcRel(expr#0..2=[{inputs}], expr#3=['Grault':VARCHAR], expr#4=[=($t1, $t3)], proj#0..2=[{exprs}], $condition=[$t4])
BeamIOSourceRel(table=[[beam, customers]])
Aug 07, 2020 12:20:36 PM org.apache.beam.sdk.Pipeline validate
WARNING: The following transforms do not have stable unique names: Create.Values, MapElements, SqlTransform
[4, Grault]: is from Wonderland
[3, Baz]: is from Wonderland
[1, Foo]: is from Wonderland
[3]: total customers in Wonderland
[Grault, order id:7]: ordered by 'Grault'
[Grault, order id:8]: ordered by 'Grault'
> Task :sdks:java:testing:nexmark:check
> Task :sdks:java:testing:nexmark:build
> Task :sdks:java:testing:nexmark:buildDependents
> Task :sdks:java:extensions:sql:zetasql:buildDependents
FAILURE: Build failed with an exception.
* What went wrong:
Execution failed for task ':sdks:java:extensions:sql:spotbugsMain'.
> SpotBugs rule violations were found. See the report at: file://<https://ci-beam.apache.org/job/beam_PreCommit_SQL_Cron/ws/src/sdks/java/extensions/sql/build/reports/spotbugs/main.xml>
* Try:
Run with --stacktrace option to get the stack trace. Run with --info or --debug option to get more log output. Run with --scan to get full insights.
* Get more help at https://help.gradle.org
Deprecated Gradle features were used in this build, making it incompatible with Gradle 6.0.
Use '--warning-mode all' to show the individual deprecation warnings.
See https://docs.gradle.org/5.2.1/userguide/command_line_interface.html#sec:command_line_warnings
BUILD FAILED in 37m 32s
219 actionable tasks: 170 executed, 49 from cache
Publishing build scan...
https://gradle.com/s/ggaqbubsptdhq
Build step 'Invoke Gradle script' changed build result to FAILURE
Build step 'Invoke Gradle script' marked build as failure
---------------------------------------------------------------------
To unsubscribe, e-mail: builds-unsubscribe@beam.apache.org
For additional commands, e-mail: builds-help@beam.apache.org
Build failed in Jenkins: beam_PreCommit_SQL_Cron #1078
Posted by Apache Jenkins Server <je...@builds.apache.org>.
See <https://ci-beam.apache.org/job/beam_PreCommit_SQL_Cron/1078/display/redirect?page=changes>
Changes:
[dcavazos] [BEAM-7390] Add sum code snippets
------------------------------------------
[...truncated 92.30 KB...]
<https://ci-beam.apache.org/job/beam_PreCommit_SQL_Cron/ws/src/sdks/java/extensions/sql/src/main/java/org/apache/beam/sdk/extensions/sql/SqlTransform.java>:192: warning - Tag @link:illegal character: "62" in "#withQueryPlannerClass(Class<? extends QueryPlanner>)"
3 warnings
> Task :sdks:java:extensions:sql:jdbc:shadowJar
[main] INFO org.gradle.internal.nativeintegration.services.NativeServices - Initialized native services in: /home/jenkins/.gradle/native
> Task :sdks:java:extensions:sql:spotbugsMain
SLF4J: Failed to load class "org.slf4j.impl.StaticLoggerBinder".
SLF4J: Defaulting to no-operation (NOP) logger implementation
SLF4J: See http://www.slf4j.org/codes.html#StaticLoggerBinder for further details.
> Task :sdks:java:extensions:sql:shell:compileJava NO-SOURCE
> Task :sdks:java:extensions:sql:shell:classes UP-TO-DATE
> Task :sdks:java:extensions:sql:shell:jar
> Task :sdks:java:extensions:sql:shell:distTar
> Task :sdks:java:extensions:sql:zetasql:test
> Task :sdks:java:testing:nexmark:test
> Task :sdks:java:extensions:sql:jdbc:shadowTestJar
> Task :sdks:java:extensions:sql:shell:distZip
> Task :sdks:java:extensions:sql:expansion-service:compileTestJava NO-SOURCE
> Task :sdks:java:extensions:sql:expansion-service:testClasses UP-TO-DATE
> Task :sdks:java:extensions:sql:shell:assemble
> Task :sdks:java:extensions:sql:expansion-service:packageTests
> Task :sdks:java:extensions:sql:expansion-service:assemble
> Task :sdks:java:extensions:sql:expansion-service:analyzeClassesDependencies SKIPPED
> Task :sdks:java:extensions:sql:expansion-service:analyzeTestClassesDependencies SKIPPED
> Task :sdks:java:extensions:sql:expansion-service:analyzeDependencies SKIPPED
> Task :sdks:java:extensions:sql:expansion-service:checkstyleMain
> Task :sdks:java:extensions:sql:expansion-service:checkstyleTest NO-SOURCE
> Task :runners:flink:1.9:job-server:distTar
> Task :runners:flink:1.10:job-server:distTar
> Task :sdks:java:extensions:sql:expansion-service:javadoc
> Task :runners:flink:1.8:job-server:distTar
[main] INFO org.gradle.internal.nativeintegration.services.NativeServices - Initialized native services in: /home/jenkins/.gradle/native
> Task :sdks:java:extensions:sql:expansion-service:spotbugsMain
SLF4J: Failed to load class "org.slf4j.impl.StaticLoggerBinder".
SLF4J: Defaulting to no-operation (NOP) logger implementation
SLF4J: See http://www.slf4j.org/codes.html#StaticLoggerBinder for further details.
> Task :sdks:java:extensions:sql:shell:analyzeClassesDependencies
> Task :sdks:java:extensions:sql:shell:compileTestJava NO-SOURCE
> Task :sdks:java:extensions:sql:shell:testClasses UP-TO-DATE
> Task :sdks:java:extensions:sql:shell:analyzeTestClassesDependencies
> Task :sdks:java:extensions:sql:shell:analyzeDependencies
> Task :sdks:java:extensions:sql:shell:test NO-SOURCE
> Task :sdks:java:extensions:sql:shell:check
> Task :sdks:java:extensions:sql:shell:build
> Task :sdks:java:extensions:sql:shell:buildDependents
> Task :sdks:java:extensions:sql:expansion-service:test NO-SOURCE
> Task :sdks:java:extensions:sql:expansion-service:check
> Task :sdks:java:extensions:sql:expansion-service:build
> Task :sdks:java:extensions:sql:spotbugsMain FAILED
> Task :runners:flink:1.9:job-server:distZip
> Task :runners:flink:1.10:job-server:distZip
> Task :runners:flink:1.8:job-server:distZip
> Task :sdks:java:extensions:sql:test
> Task :sdks:java:extensions:sql:jdbc:test
> Task :runners:flink:1.10:job-server:shadowJar
> Task :runners:flink:1.9:job-server:shadowJar
> Task :sdks:java:extensions:sql:jdbc:check
> Task :sdks:java:extensions:sql:jdbc:build
> Task :sdks:java:extensions:sql:jdbc:buildDependents
> Task :runners:flink:1.8:job-server:shadowJar
> Task :runners:flink:1.8:job-server:startShadowScripts
> Task :runners:flink:1.9:job-server:startShadowScripts
> Task :runners:flink:1.8:job-server:shadowDistTar
> Task :runners:flink:1.9:job-server:shadowDistTar
> Task :runners:flink:1.10:job-server:startShadowScripts
> Task :runners:flink:1.10:job-server:shadowDistTar
> Task :runners:flink:1.8:job-server:shadowDistZip
> Task :runners:flink:1.9:job-server:shadowDistZip
> Task :runners:flink:1.10:job-server:shadowDistZip
> Task :runners:flink:1.8:job-server:assemble
> Task :runners:flink:1.8:job-server:spotbugsMain NO-SOURCE
> Task :runners:flink:1.8:job-server:test NO-SOURCE
> Task :runners:flink:1.8:job-server:check UP-TO-DATE
> Task :runners:flink:1.8:job-server:build
> Task :runners:flink:1.8:job-server:buildDependents
> Task :runners:flink:1.9:job-server:assemble
> Task :runners:flink:1.9:job-server:spotbugsMain NO-SOURCE
> Task :runners:flink:1.9:job-server:test NO-SOURCE
> Task :runners:flink:1.9:job-server:check UP-TO-DATE
> Task :runners:flink:1.9:job-server:build
> Task :runners:flink:1.9:job-server:buildDependents
> Task :runners:flink:1.10:job-server:assemble
> Task :runners:flink:1.10:job-server:spotbugsMain NO-SOURCE
> Task :runners:flink:1.10:job-server:test NO-SOURCE
> Task :runners:flink:1.10:job-server:check UP-TO-DATE
> Task :runners:flink:1.10:job-server:build
> Task :runners:flink:1.10:job-server:buildDependents
> Task :sdks:java:extensions:sql:expansion-service:buildDependents
> Task :sdks:java:extensions:sql:zetasql:check
> Task :sdks:java:extensions:sql:zetasql:build
> Task :sdks:java:extensions:sql:testJar
> Task :sdks:java:extensions:sql:runBasicExample
SLF4J: Class path contains multiple SLF4J bindings.
SLF4J: Found binding in [jar:file:/home/jenkins/.gradle/caches/modules-2/files-2.1/org.slf4j/slf4j-jdk14/1.7.25/bccda40ebc8067491b32a88f49615a747d20082d/slf4j-jdk14-1.7.25.jar!/org/slf4j/impl/StaticLoggerBinder.class]
SLF4J: Found binding in [jar:file:/home/jenkins/.gradle/caches/modules-2/files-2.1/org.slf4j/slf4j-log4j12/1.7.25/110cefe2df103412849d72ef7a67e4e91e4266b4/slf4j-log4j12-1.7.25.jar!/org/slf4j/impl/StaticLoggerBinder.class]
SLF4J: See http://www.slf4j.org/codes.html#multiple_bindings for an explanation.
SLF4J: Actual binding is of type [org.slf4j.impl.JDK14LoggerFactory]
> Task :sdks:java:extensions:sql:perf-tests:compileTestJava
> Task :sdks:java:extensions:sql:perf-tests:testClasses
> Task :sdks:java:extensions:sql:perf-tests:analyzeTestClassesDependencies SKIPPED
> Task :sdks:java:extensions:sql:perf-tests:analyzeDependencies SKIPPED
> Task :sdks:java:extensions:sql:perf-tests:checkstyleTest
> Task :sdks:java:extensions:sql:perf-tests:test NO-SOURCE
> Task :sdks:java:extensions:sql:perf-tests:check
> Task :sdks:java:extensions:sql:perf-tests:build
> Task :sdks:java:extensions:sql:perf-tests:buildDependents
> Task :sdks:java:extensions:sql:runBasicExample
Aug 07, 2020 6:13:14 AM org.apache.beam.sdk.extensions.sql.impl.CalciteQueryPlanner convertToBeamRel
INFO: SQL:
SELECT `PCOLLECTION`.`c1`, `PCOLLECTION`.`c2`, `PCOLLECTION`.`c3`
FROM `beam`.`PCOLLECTION` AS `PCOLLECTION`
WHERE `PCOLLECTION`.`c1` > 1
Aug 07, 2020 6:13:16 AM org.apache.beam.sdk.extensions.sql.impl.CalciteQueryPlanner convertToBeamRel
INFO: SQLPlan>
LogicalProject(c1=[$0], c2=[$1], c3=[$2])
LogicalFilter(condition=[>($0, 1)])
BeamIOSourceRel(table=[[beam, PCOLLECTION]])
Aug 07, 2020 6:13:17 AM org.apache.beam.sdk.extensions.sql.impl.CalciteQueryPlanner convertToBeamRel
INFO: BEAMPlan>
BeamCalcRel(expr#0..2=[{inputs}], expr#3=[1], expr#4=[>($t0, $t3)], proj#0..2=[{exprs}], $condition=[$t4])
BeamIOSourceRel(table=[[beam, PCOLLECTION]])
Aug 07, 2020 6:13:19 AM org.apache.beam.sdk.extensions.sql.impl.CalciteQueryPlanner convertToBeamRel
INFO: SQL:
SELECT `CASE1_RESULT`.`c2`, SUM(`CASE1_RESULT`.`c3`)
FROM `beam`.`CASE1_RESULT` AS `CASE1_RESULT`
GROUP BY `CASE1_RESULT`.`c2`
Aug 07, 2020 6:13:19 AM org.apache.beam.sdk.extensions.sql.impl.CalciteQueryPlanner convertToBeamRel
INFO: SQLPlan>
LogicalAggregate(group=[{0}], EXPR$1=[SUM($1)])
LogicalProject(c2=[$1], c3=[$2])
BeamIOSourceRel(table=[[beam, CASE1_RESULT]])
Aug 07, 2020 6:13:20 AM org.apache.beam.sdk.extensions.sql.impl.CalciteQueryPlanner convertToBeamRel
INFO: BEAMPlan>
BeamAggregationRel(group=[{1}], EXPR$1=[SUM($2)])
BeamIOSourceRel(table=[[beam, CASE1_RESULT]])
Aug 07, 2020 6:13:21 AM org.apache.beam.sdk.Pipeline validate
WARNING: The following transforms do not have stable unique names: log_result, SqlTransform
PCOLLECTION: [3, row, 3.0]
PCOLLECTION: [2, row, 2.0]
CASE1_RESULT: [row, 5.0]
> Task :sdks:java:extensions:sql:runPojoExample
SLF4J: Class path contains multiple SLF4J bindings.
SLF4J: Found binding in [jar:file:/home/jenkins/.gradle/caches/modules-2/files-2.1/org.slf4j/slf4j-jdk14/1.7.25/bccda40ebc8067491b32a88f49615a747d20082d/slf4j-jdk14-1.7.25.jar!/org/slf4j/impl/StaticLoggerBinder.class]
SLF4J: Found binding in [jar:file:/home/jenkins/.gradle/caches/modules-2/files-2.1/org.slf4j/slf4j-log4j12/1.7.25/110cefe2df103412849d72ef7a67e4e91e4266b4/slf4j-log4j12-1.7.25.jar!/org/slf4j/impl/StaticLoggerBinder.class]
SLF4J: See http://www.slf4j.org/codes.html#multiple_bindings for an explanation.
SLF4J: Actual binding is of type [org.slf4j.impl.JDK14LoggerFactory]
Aug 07, 2020 6:13:43 AM org.apache.beam.sdk.extensions.sql.impl.CalciteQueryPlanner convertToBeamRel
INFO: SQL:
SELECT `PCOLLECTION`.`id`, `PCOLLECTION`.`name`
FROM `beam`.`PCOLLECTION` AS `PCOLLECTION`
WHERE `PCOLLECTION`.`countryOfResidence` = 'Wonderland'
Aug 07, 2020 6:13:44 AM org.apache.beam.sdk.extensions.sql.impl.CalciteQueryPlanner convertToBeamRel
INFO: SQLPlan>
LogicalProject(id=[$2], name=[$1])
LogicalFilter(condition=[=($0, 'Wonderland')])
BeamIOSourceRel(table=[[beam, PCOLLECTION]])
Aug 07, 2020 6:13:45 AM org.apache.beam.sdk.extensions.sql.impl.CalciteQueryPlanner convertToBeamRel
INFO: BEAMPlan>
BeamCalcRel(expr#0..2=[{inputs}], expr#3=['Wonderland':VARCHAR], expr#4=[=($t0, $t3)], id=[$t2], name=[$t1], $condition=[$t4])
BeamIOSourceRel(table=[[beam, PCOLLECTION]])
Aug 07, 2020 6:13:46 AM org.apache.beam.sdk.extensions.sql.impl.CalciteQueryPlanner convertToBeamRel
INFO: SQL:
SELECT COUNT(`PCOLLECTION`.`id`)
FROM `beam`.`PCOLLECTION` AS `PCOLLECTION`
Aug 07, 2020 6:13:47 AM org.apache.beam.sdk.extensions.sql.impl.CalciteQueryPlanner convertToBeamRel
INFO: SQLPlan>
LogicalAggregate(group=[{}], EXPR$0=[COUNT()])
LogicalProject(id=[$0])
BeamIOSourceRel(table=[[beam, PCOLLECTION]])
Aug 07, 2020 6:13:47 AM org.apache.beam.sdk.extensions.sql.impl.CalciteQueryPlanner convertToBeamRel
INFO: BEAMPlan>
BeamAggregationRel(group=[{}], EXPR$0=[COUNT()])
BeamIOSourceRel(table=[[beam, PCOLLECTION]])
Aug 07, 2020 6:13:48 AM org.apache.beam.sdk.extensions.sql.impl.CalciteQueryPlanner convertToBeamRel
INFO: SQL:
SELECT `customers`.`name`, 'order id:' || CAST(`orders`.`id` AS VARCHAR)
FROM `beam`.`orders` AS `orders`
INNER JOIN `beam`.`customers` AS `customers` ON `orders`.`customerId` = `customers`.`id`
WHERE `customers`.`name` = 'Grault'
Aug 07, 2020 6:13:48 AM org.apache.beam.sdk.extensions.sql.impl.CalciteQueryPlanner convertToBeamRel
INFO: SQLPlan>
LogicalProject(name=[$3], EXPR$1=[||('order id:', CAST($1):VARCHAR NOT NULL)])
LogicalFilter(condition=[=($3, 'Grault')])
LogicalJoin(condition=[=($0, $4)], joinType=[inner])
BeamIOSourceRel(table=[[beam, orders]])
BeamIOSourceRel(table=[[beam, customers]])
Aug 07, 2020 6:13:49 AM org.apache.beam.sdk.extensions.sql.impl.CalciteQueryPlanner convertToBeamRel
INFO: BEAMPlan>
BeamCalcRel(expr#0..4=[{inputs}], expr#5=['order id:'], expr#6=[CAST($t1):VARCHAR NOT NULL], expr#7=[||($t5, $t6)], name=[$t3], EXPR$1=[$t7])
BeamCoGBKJoinRel(condition=[=($0, $4)], joinType=[inner])
BeamIOSourceRel(table=[[beam, orders]])
BeamCalcRel(expr#0..2=[{inputs}], expr#3=['Grault':VARCHAR], expr#4=[=($t1, $t3)], proj#0..2=[{exprs}], $condition=[$t4])
BeamIOSourceRel(table=[[beam, customers]])
Aug 07, 2020 6:13:50 AM org.apache.beam.sdk.Pipeline validate
WARNING: The following transforms do not have stable unique names: Create.Values, MapElements, SqlTransform
[4, Grault]: is from Wonderland
[3, Baz]: is from Wonderland
[1, Foo]: is from Wonderland
[3]: total customers in Wonderland
[Grault, order id:8]: ordered by 'Grault'
[Grault, order id:7]: ordered by 'Grault'
> Task :sdks:java:testing:nexmark:check
> Task :sdks:java:testing:nexmark:build
> Task :sdks:java:testing:nexmark:buildDependents
> Task :sdks:java:extensions:sql:zetasql:buildDependents
FAILURE: Build failed with an exception.
* What went wrong:
Execution failed for task ':sdks:java:extensions:sql:spotbugsMain'.
> SpotBugs rule violations were found. See the report at: file://<https://ci-beam.apache.org/job/beam_PreCommit_SQL_Cron/ws/src/sdks/java/extensions/sql/build/reports/spotbugs/main.xml>
* Try:
Run with --stacktrace option to get the stack trace. Run with --info or --debug option to get more log output. Run with --scan to get full insights.
* Get more help at https://help.gradle.org
Deprecated Gradle features were used in this build, making it incompatible with Gradle 6.0.
Use '--warning-mode all' to show the individual deprecation warnings.
See https://docs.gradle.org/5.2.1/userguide/command_line_interface.html#sec:command_line_warnings
BUILD FAILED in 20m 51s
219 actionable tasks: 177 executed, 42 from cache
Publishing build scan...
https://gradle.com/s/jjjstcios6xfs
Build step 'Invoke Gradle script' changed build result to FAILURE
Build step 'Invoke Gradle script' marked build as failure
---------------------------------------------------------------------
To unsubscribe, e-mail: builds-unsubscribe@beam.apache.org
For additional commands, e-mail: builds-help@beam.apache.org