You are viewing a plain text version of this content. The canonical link for it is here.
Posted to dev@lucene.apache.org by Policeman Jenkins Server <je...@thetaphi.de> on 2014/06/13 04:43:41 UTC
[JENKINS] Lucene-Solr-4.x-Linux (64bit/jdk1.8.0_05) - Build # 10426
- Still Failing!
Build: http://jenkins.thetaphi.de/job/Lucene-Solr-4.x-Linux/10426/
Java: 64bit/jdk1.8.0_05 -XX:+UseCompressedOops -XX:+UseG1GC
3 tests failed.
REGRESSION: org.apache.solr.cloud.HttpPartitionTest.testDistribSearch
Error Message:
createcollection the collection error [Watcher fired on path: null state: SyncConnected type None]
Stack Trace:
org.apache.solr.client.solrj.impl.HttpSolrServer$RemoteSolrException: createcollection the collection error [Watcher fired on path: null state: SyncConnected type None]
at __randomizedtesting.SeedInfo.seed([28A2A804290B2957:A944261C5E54496B]:0)
at org.apache.solr.client.solrj.impl.HttpSolrServer.executeMethod(HttpSolrServer.java:554)
at org.apache.solr.client.solrj.impl.HttpSolrServer.request(HttpSolrServer.java:210)
at org.apache.solr.client.solrj.impl.HttpSolrServer.request(HttpSolrServer.java:206)
at org.apache.solr.cloud.AbstractFullDistribZkTestBase.createCollection(AbstractFullDistribZkTestBase.java:1508)
at org.apache.solr.cloud.AbstractFullDistribZkTestBase.createCollection(AbstractFullDistribZkTestBase.java:1468)
at org.apache.solr.cloud.AbstractFullDistribZkTestBase.createCollection(AbstractFullDistribZkTestBase.java:1527)
at org.apache.solr.cloud.AbstractFullDistribZkTestBase.createCollection(AbstractFullDistribZkTestBase.java:1464)
at org.apache.solr.cloud.HttpPartitionTest.testRf3(HttpPartitionTest.java:223)
at org.apache.solr.cloud.HttpPartitionTest.doTest(HttpPartitionTest.java:145)
at org.apache.solr.BaseDistributedSearchTestCase.testDistribSearch(BaseDistributedSearchTestCase.java:865)
at sun.reflect.NativeMethodAccessorImpl.invoke0(Native Method)
at sun.reflect.NativeMethodAccessorImpl.invoke(NativeMethodAccessorImpl.java:62)
at sun.reflect.DelegatingMethodAccessorImpl.invoke(DelegatingMethodAccessorImpl.java:43)
at java.lang.reflect.Method.invoke(Method.java:483)
at com.carrotsearch.randomizedtesting.RandomizedRunner.invoke(RandomizedRunner.java:1618)
at com.carrotsearch.randomizedtesting.RandomizedRunner$6.evaluate(RandomizedRunner.java:827)
at com.carrotsearch.randomizedtesting.RandomizedRunner$7.evaluate(RandomizedRunner.java:863)
at com.carrotsearch.randomizedtesting.RandomizedRunner$8.evaluate(RandomizedRunner.java:877)
at com.carrotsearch.randomizedtesting.rules.SystemPropertiesRestoreRule$1.evaluate(SystemPropertiesRestoreRule.java:53)
at org.apache.lucene.util.TestRuleSetupTeardownChained$1.evaluate(TestRuleSetupTeardownChained.java:50)
at org.apache.lucene.util.TestRuleFieldCacheSanity$1.evaluate(TestRuleFieldCacheSanity.java:51)
at org.apache.lucene.util.AbstractBeforeAfterRule$1.evaluate(AbstractBeforeAfterRule.java:46)
at com.carrotsearch.randomizedtesting.rules.SystemPropertiesInvariantRule$1.evaluate(SystemPropertiesInvariantRule.java:55)
at org.apache.lucene.util.TestRuleThreadAndTestName$1.evaluate(TestRuleThreadAndTestName.java:49)
at org.apache.lucene.util.TestRuleIgnoreAfterMaxFailures$1.evaluate(TestRuleIgnoreAfterMaxFailures.java:65)
at org.apache.lucene.util.TestRuleMarkFailure$1.evaluate(TestRuleMarkFailure.java:48)
at com.carrotsearch.randomizedtesting.rules.StatementAdapter.evaluate(StatementAdapter.java:36)
at com.carrotsearch.randomizedtesting.ThreadLeakControl$StatementRunner.run(ThreadLeakControl.java:360)
at com.carrotsearch.randomizedtesting.ThreadLeakControl.forkTimeoutingTask(ThreadLeakControl.java:793)
at com.carrotsearch.randomizedtesting.ThreadLeakControl$3.evaluate(ThreadLeakControl.java:453)
at com.carrotsearch.randomizedtesting.RandomizedRunner.runSingleTest(RandomizedRunner.java:836)
at com.carrotsearch.randomizedtesting.RandomizedRunner$3.evaluate(RandomizedRunner.java:738)
at com.carrotsearch.randomizedtesting.RandomizedRunner$4.evaluate(RandomizedRunner.java:772)
at com.carrotsearch.randomizedtesting.RandomizedRunner$5.evaluate(RandomizedRunner.java:783)
at com.carrotsearch.randomizedtesting.rules.StatementAdapter.evaluate(StatementAdapter.java:36)
at com.carrotsearch.randomizedtesting.rules.SystemPropertiesRestoreRule$1.evaluate(SystemPropertiesRestoreRule.java:53)
at org.apache.lucene.util.AbstractBeforeAfterRule$1.evaluate(AbstractBeforeAfterRule.java:46)
at org.apache.lucene.util.TestRuleStoreClassName$1.evaluate(TestRuleStoreClassName.java:42)
at com.carrotsearch.randomizedtesting.rules.SystemPropertiesInvariantRule$1.evaluate(SystemPropertiesInvariantRule.java:55)
at com.carrotsearch.randomizedtesting.rules.NoShadowingOrOverridesOnMethodsRule$1.evaluate(NoShadowingOrOverridesOnMethodsRule.java:39)
at com.carrotsearch.randomizedtesting.rules.NoShadowingOrOverridesOnMethodsRule$1.evaluate(NoShadowingOrOverridesOnMethodsRule.java:39)
at com.carrotsearch.randomizedtesting.rules.StatementAdapter.evaluate(StatementAdapter.java:36)
at com.carrotsearch.randomizedtesting.rules.StatementAdapter.evaluate(StatementAdapter.java:36)
at com.carrotsearch.randomizedtesting.rules.StatementAdapter.evaluate(StatementAdapter.java:36)
at org.apache.lucene.util.TestRuleAssertionsRequired$1.evaluate(TestRuleAssertionsRequired.java:43)
at org.apache.lucene.util.TestRuleMarkFailure$1.evaluate(TestRuleMarkFailure.java:48)
at org.apache.lucene.util.TestRuleIgnoreAfterMaxFailures$1.evaluate(TestRuleIgnoreAfterMaxFailures.java:65)
at org.apache.lucene.util.TestRuleIgnoreTestSuites$1.evaluate(TestRuleIgnoreTestSuites.java:55)
at com.carrotsearch.randomizedtesting.rules.StatementAdapter.evaluate(StatementAdapter.java:36)
at com.carrotsearch.randomizedtesting.ThreadLeakControl$StatementRunner.run(ThreadLeakControl.java:360)
at java.lang.Thread.run(Thread.java:745)
REGRESSION: org.apache.solr.cloud.ShardSplitTest.testDistribSearch
Error Message:
shard1_0 is not active expected:<[active]> but was:<[recovery]>
Stack Trace:
org.junit.ComparisonFailure: shard1_0 is not active expected:<[active]> but was:<[recovery]>
at __randomizedtesting.SeedInfo.seed([28A2A804290B2957:A944261C5E54496B]:0)
at org.junit.Assert.assertEquals(Assert.java:125)
at org.apache.solr.cloud.ShardSplitTest.checkDocCountsAndShardStates(ShardSplitTest.java:433)
at org.apache.solr.cloud.ShardSplitTest.splitByUniqueKeyTest(ShardSplitTest.java:240)
at org.apache.solr.cloud.ShardSplitTest.doTest(ShardSplitTest.java:104)
at org.apache.solr.BaseDistributedSearchTestCase.testDistribSearch(BaseDistributedSearchTestCase.java:865)
at sun.reflect.NativeMethodAccessorImpl.invoke0(Native Method)
at sun.reflect.NativeMethodAccessorImpl.invoke(NativeMethodAccessorImpl.java:62)
at sun.reflect.DelegatingMethodAccessorImpl.invoke(DelegatingMethodAccessorImpl.java:43)
at java.lang.reflect.Method.invoke(Method.java:483)
at com.carrotsearch.randomizedtesting.RandomizedRunner.invoke(RandomizedRunner.java:1618)
at com.carrotsearch.randomizedtesting.RandomizedRunner$6.evaluate(RandomizedRunner.java:827)
at com.carrotsearch.randomizedtesting.RandomizedRunner$7.evaluate(RandomizedRunner.java:863)
at com.carrotsearch.randomizedtesting.RandomizedRunner$8.evaluate(RandomizedRunner.java:877)
at com.carrotsearch.randomizedtesting.rules.SystemPropertiesRestoreRule$1.evaluate(SystemPropertiesRestoreRule.java:53)
at org.apache.lucene.util.TestRuleSetupTeardownChained$1.evaluate(TestRuleSetupTeardownChained.java:50)
at org.apache.lucene.util.TestRuleFieldCacheSanity$1.evaluate(TestRuleFieldCacheSanity.java:51)
at org.apache.lucene.util.AbstractBeforeAfterRule$1.evaluate(AbstractBeforeAfterRule.java:46)
at com.carrotsearch.randomizedtesting.rules.SystemPropertiesInvariantRule$1.evaluate(SystemPropertiesInvariantRule.java:55)
at org.apache.lucene.util.TestRuleThreadAndTestName$1.evaluate(TestRuleThreadAndTestName.java:49)
at org.apache.lucene.util.TestRuleIgnoreAfterMaxFailures$1.evaluate(TestRuleIgnoreAfterMaxFailures.java:65)
at org.apache.lucene.util.TestRuleMarkFailure$1.evaluate(TestRuleMarkFailure.java:48)
at com.carrotsearch.randomizedtesting.rules.StatementAdapter.evaluate(StatementAdapter.java:36)
at com.carrotsearch.randomizedtesting.ThreadLeakControl$StatementRunner.run(ThreadLeakControl.java:360)
at com.carrotsearch.randomizedtesting.ThreadLeakControl.forkTimeoutingTask(ThreadLeakControl.java:793)
at com.carrotsearch.randomizedtesting.ThreadLeakControl$3.evaluate(ThreadLeakControl.java:453)
at com.carrotsearch.randomizedtesting.RandomizedRunner.runSingleTest(RandomizedRunner.java:836)
at com.carrotsearch.randomizedtesting.RandomizedRunner$3.evaluate(RandomizedRunner.java:738)
at com.carrotsearch.randomizedtesting.RandomizedRunner$4.evaluate(RandomizedRunner.java:772)
at com.carrotsearch.randomizedtesting.RandomizedRunner$5.evaluate(RandomizedRunner.java:783)
at com.carrotsearch.randomizedtesting.rules.StatementAdapter.evaluate(StatementAdapter.java:36)
at com.carrotsearch.randomizedtesting.rules.SystemPropertiesRestoreRule$1.evaluate(SystemPropertiesRestoreRule.java:53)
at org.apache.lucene.util.AbstractBeforeAfterRule$1.evaluate(AbstractBeforeAfterRule.java:46)
at org.apache.lucene.util.TestRuleStoreClassName$1.evaluate(TestRuleStoreClassName.java:42)
at com.carrotsearch.randomizedtesting.rules.SystemPropertiesInvariantRule$1.evaluate(SystemPropertiesInvariantRule.java:55)
at com.carrotsearch.randomizedtesting.rules.NoShadowingOrOverridesOnMethodsRule$1.evaluate(NoShadowingOrOverridesOnMethodsRule.java:39)
at com.carrotsearch.randomizedtesting.rules.NoShadowingOrOverridesOnMethodsRule$1.evaluate(NoShadowingOrOverridesOnMethodsRule.java:39)
at com.carrotsearch.randomizedtesting.rules.StatementAdapter.evaluate(StatementAdapter.java:36)
at com.carrotsearch.randomizedtesting.rules.StatementAdapter.evaluate(StatementAdapter.java:36)
at com.carrotsearch.randomizedtesting.rules.StatementAdapter.evaluate(StatementAdapter.java:36)
at org.apache.lucene.util.TestRuleAssertionsRequired$1.evaluate(TestRuleAssertionsRequired.java:43)
at org.apache.lucene.util.TestRuleMarkFailure$1.evaluate(TestRuleMarkFailure.java:48)
at org.apache.lucene.util.TestRuleIgnoreAfterMaxFailures$1.evaluate(TestRuleIgnoreAfterMaxFailures.java:65)
at org.apache.lucene.util.TestRuleIgnoreTestSuites$1.evaluate(TestRuleIgnoreTestSuites.java:55)
at com.carrotsearch.randomizedtesting.rules.StatementAdapter.evaluate(StatementAdapter.java:36)
at com.carrotsearch.randomizedtesting.ThreadLeakControl$StatementRunner.run(ThreadLeakControl.java:360)
at java.lang.Thread.run(Thread.java:745)
FAILED: org.apache.solr.cloud.SyncSliceTest.testDistribSearch
Error Message:
No live SolrServers available to handle this request
Stack Trace:
org.apache.solr.client.solrj.SolrServerException: No live SolrServers available to handle this request
at __randomizedtesting.SeedInfo.seed([28A2A804290B2957:A944261C5E54496B]:0)
at org.apache.solr.client.solrj.impl.LBHttpSolrServer.request(LBHttpSolrServer.java:317)
at org.apache.solr.client.solrj.impl.CloudSolrServer.request(CloudSolrServer.java:659)
at org.apache.solr.client.solrj.request.QueryRequest.process(QueryRequest.java:91)
at org.apache.solr.client.solrj.SolrServer.query(SolrServer.java:301)
at org.apache.solr.cloud.AbstractFullDistribZkTestBase.checkShardConsistency(AbstractFullDistribZkTestBase.java:1149)
at org.apache.solr.cloud.AbstractFullDistribZkTestBase.checkShardConsistency(AbstractFullDistribZkTestBase.java:1118)
at org.apache.solr.cloud.SyncSliceTest.doTest(SyncSliceTest.java:236)
at org.apache.solr.BaseDistributedSearchTestCase.testDistribSearch(BaseDistributedSearchTestCase.java:865)
at sun.reflect.NativeMethodAccessorImpl.invoke0(Native Method)
at sun.reflect.NativeMethodAccessorImpl.invoke(NativeMethodAccessorImpl.java:62)
at sun.reflect.DelegatingMethodAccessorImpl.invoke(DelegatingMethodAccessorImpl.java:43)
at java.lang.reflect.Method.invoke(Method.java:483)
at com.carrotsearch.randomizedtesting.RandomizedRunner.invoke(RandomizedRunner.java:1618)
at com.carrotsearch.randomizedtesting.RandomizedRunner$6.evaluate(RandomizedRunner.java:827)
at com.carrotsearch.randomizedtesting.RandomizedRunner$7.evaluate(RandomizedRunner.java:863)
at com.carrotsearch.randomizedtesting.RandomizedRunner$8.evaluate(RandomizedRunner.java:877)
at com.carrotsearch.randomizedtesting.rules.SystemPropertiesRestoreRule$1.evaluate(SystemPropertiesRestoreRule.java:53)
at org.apache.lucene.util.TestRuleSetupTeardownChained$1.evaluate(TestRuleSetupTeardownChained.java:50)
at org.apache.lucene.util.TestRuleFieldCacheSanity$1.evaluate(TestRuleFieldCacheSanity.java:51)
at org.apache.lucene.util.AbstractBeforeAfterRule$1.evaluate(AbstractBeforeAfterRule.java:46)
at com.carrotsearch.randomizedtesting.rules.SystemPropertiesInvariantRule$1.evaluate(SystemPropertiesInvariantRule.java:55)
at org.apache.lucene.util.TestRuleThreadAndTestName$1.evaluate(TestRuleThreadAndTestName.java:49)
at org.apache.lucene.util.TestRuleIgnoreAfterMaxFailures$1.evaluate(TestRuleIgnoreAfterMaxFailures.java:65)
at org.apache.lucene.util.TestRuleMarkFailure$1.evaluate(TestRuleMarkFailure.java:48)
at com.carrotsearch.randomizedtesting.rules.StatementAdapter.evaluate(StatementAdapter.java:36)
at com.carrotsearch.randomizedtesting.ThreadLeakControl$StatementRunner.run(ThreadLeakControl.java:360)
at com.carrotsearch.randomizedtesting.ThreadLeakControl.forkTimeoutingTask(ThreadLeakControl.java:793)
at com.carrotsearch.randomizedtesting.ThreadLeakControl$3.evaluate(ThreadLeakControl.java:453)
at com.carrotsearch.randomizedtesting.RandomizedRunner.runSingleTest(RandomizedRunner.java:836)
at com.carrotsearch.randomizedtesting.RandomizedRunner$3.evaluate(RandomizedRunner.java:738)
at com.carrotsearch.randomizedtesting.RandomizedRunner$4.evaluate(RandomizedRunner.java:772)
at com.carrotsearch.randomizedtesting.RandomizedRunner$5.evaluate(RandomizedRunner.java:783)
at com.carrotsearch.randomizedtesting.rules.StatementAdapter.evaluate(StatementAdapter.java:36)
at com.carrotsearch.randomizedtesting.rules.SystemPropertiesRestoreRule$1.evaluate(SystemPropertiesRestoreRule.java:53)
at org.apache.lucene.util.AbstractBeforeAfterRule$1.evaluate(AbstractBeforeAfterRule.java:46)
at org.apache.lucene.util.TestRuleStoreClassName$1.evaluate(TestRuleStoreClassName.java:42)
at com.carrotsearch.randomizedtesting.rules.SystemPropertiesInvariantRule$1.evaluate(SystemPropertiesInvariantRule.java:55)
at com.carrotsearch.randomizedtesting.rules.NoShadowingOrOverridesOnMethodsRule$1.evaluate(NoShadowingOrOverridesOnMethodsRule.java:39)
at com.carrotsearch.randomizedtesting.rules.NoShadowingOrOverridesOnMethodsRule$1.evaluate(NoShadowingOrOverridesOnMethodsRule.java:39)
at com.carrotsearch.randomizedtesting.rules.StatementAdapter.evaluate(StatementAdapter.java:36)
at com.carrotsearch.randomizedtesting.rules.StatementAdapter.evaluate(StatementAdapter.java:36)
at com.carrotsearch.randomizedtesting.rules.StatementAdapter.evaluate(StatementAdapter.java:36)
at org.apache.lucene.util.TestRuleAssertionsRequired$1.evaluate(TestRuleAssertionsRequired.java:43)
at org.apache.lucene.util.TestRuleMarkFailure$1.evaluate(TestRuleMarkFailure.java:48)
at org.apache.lucene.util.TestRuleIgnoreAfterMaxFailures$1.evaluate(TestRuleIgnoreAfterMaxFailures.java:65)
at org.apache.lucene.util.TestRuleIgnoreTestSuites$1.evaluate(TestRuleIgnoreTestSuites.java:55)
at com.carrotsearch.randomizedtesting.rules.StatementAdapter.evaluate(StatementAdapter.java:36)
at com.carrotsearch.randomizedtesting.ThreadLeakControl$StatementRunner.run(ThreadLeakControl.java:360)
at java.lang.Thread.run(Thread.java:745)
Build Log:
[...truncated 11097 lines...]
[junit4] Suite: org.apache.solr.cloud.HttpPartitionTest
[junit4] 2> Creating dataDir: /mnt/ssd/jenkins/workspace/Lucene-Solr-4.x-Linux/solr/build/solr-core/test/J1/./solr.cloud.HttpPartitionTest-28A2A804290B2957-001/init-core-data-001
[junit4] 2> 535170 T1643 oas.BaseDistributedSearchTestCase.initHostContext Setting hostContext system property: /
[junit4] 2> 535172 T1643 oas.SolrTestCaseJ4.setUp ###Starting testDistribSearch
[junit4] 2> 535173 T1643 oasc.ZkTestServer.run STARTING ZK TEST SERVER
[junit4] 1> client port:0.0.0.0/0.0.0.0:0
[junit4] 2> 535173 T1644 oasc.ZkTestServer$ZKServerMain.runFromConfig Starting server
[junit4] 2> 535273 T1643 oasc.ZkTestServer.run start zk server on port:51084
[junit4] 2> 535274 T1643 oascc.ConnectionManager.waitForConnected Waiting for client to connect to ZooKeeper
[junit4] 2> 535431 T1650 oascc.ConnectionManager.process Watcher org.apache.solr.common.cloud.ConnectionManager@7229c18e name:ZooKeeperConnection Watcher:127.0.0.1:51084 got event WatchedEvent state:SyncConnected type:None path:null path:null type:None
[junit4] 2> 535432 T1643 oascc.ConnectionManager.waitForConnected Client is connected to ZooKeeper
[junit4] 2> 535432 T1643 oascc.SolrZkClient.makePath makePath: /solr
[junit4] 2> 535438 T1643 oascc.ConnectionManager.waitForConnected Waiting for client to connect to ZooKeeper
[junit4] 2> 535440 T1652 oascc.ConnectionManager.process Watcher org.apache.solr.common.cloud.ConnectionManager@3fc3e674 name:ZooKeeperConnection Watcher:127.0.0.1:51084/solr got event WatchedEvent state:SyncConnected type:None path:null path:null type:None
[junit4] 2> 535440 T1643 oascc.ConnectionManager.waitForConnected Client is connected to ZooKeeper
[junit4] 2> 535441 T1643 oascc.SolrZkClient.makePath makePath: /collections/collection1
[junit4] 2> 535444 T1643 oascc.SolrZkClient.makePath makePath: /collections/collection1/shards
[junit4] 2> 535448 T1643 oascc.SolrZkClient.makePath makePath: /collections/control_collection
[junit4] 2> 535450 T1643 oascc.SolrZkClient.makePath makePath: /collections/control_collection/shards
[junit4] 2> 535452 T1643 oasc.AbstractZkTestCase.putConfig put /mnt/ssd/jenkins/workspace/Lucene-Solr-4.x-Linux/solr/core/src/test-files/solr/collection1/conf/solrconfig-tlog.xml to /configs/conf1/solrconfig.xml
[junit4] 2> 535453 T1643 oascc.SolrZkClient.makePath makePath: /configs/conf1/solrconfig.xml
[junit4] 2> 535457 T1643 oasc.AbstractZkTestCase.putConfig put /mnt/ssd/jenkins/workspace/Lucene-Solr-4.x-Linux/solr/core/src/test-files/solr/collection1/conf/schema.xml to /configs/conf1/schema.xml
[junit4] 2> 535458 T1643 oascc.SolrZkClient.makePath makePath: /configs/conf1/schema.xml
[junit4] 2> 535461 T1643 oasc.AbstractZkTestCase.putConfig put /mnt/ssd/jenkins/workspace/Lucene-Solr-4.x-Linux/solr/core/src/test-files/solr/collection1/conf/solrconfig.snippet.randomindexconfig.xml to /configs/conf1/solrconfig.snippet.randomindexconfig.xml
[junit4] 2> 535462 T1643 oascc.SolrZkClient.makePath makePath: /configs/conf1/solrconfig.snippet.randomindexconfig.xml
[junit4] 2> 535465 T1643 oasc.AbstractZkTestCase.putConfig put /mnt/ssd/jenkins/workspace/Lucene-Solr-4.x-Linux/solr/core/src/test-files/solr/collection1/conf/stopwords.txt to /configs/conf1/stopwords.txt
[junit4] 2> 535465 T1643 oascc.SolrZkClient.makePath makePath: /configs/conf1/stopwords.txt
[junit4] 2> 535467 T1643 oasc.AbstractZkTestCase.putConfig put /mnt/ssd/jenkins/workspace/Lucene-Solr-4.x-Linux/solr/core/src/test-files/solr/collection1/conf/protwords.txt to /configs/conf1/protwords.txt
[junit4] 2> 535468 T1643 oascc.SolrZkClient.makePath makePath: /configs/conf1/protwords.txt
[junit4] 2> 535472 T1643 oasc.AbstractZkTestCase.putConfig put /mnt/ssd/jenkins/workspace/Lucene-Solr-4.x-Linux/solr/core/src/test-files/solr/collection1/conf/currency.xml to /configs/conf1/currency.xml
[junit4] 2> 535472 T1643 oascc.SolrZkClient.makePath makePath: /configs/conf1/currency.xml
[junit4] 2> 535475 T1643 oasc.AbstractZkTestCase.putConfig put /mnt/ssd/jenkins/workspace/Lucene-Solr-4.x-Linux/solr/core/src/test-files/solr/collection1/conf/enumsConfig.xml to /configs/conf1/enumsConfig.xml
[junit4] 2> 535476 T1643 oascc.SolrZkClient.makePath makePath: /configs/conf1/enumsConfig.xml
[junit4] 2> 535479 T1643 oasc.AbstractZkTestCase.putConfig put /mnt/ssd/jenkins/workspace/Lucene-Solr-4.x-Linux/solr/core/src/test-files/solr/collection1/conf/open-exchange-rates.json to /configs/conf1/open-exchange-rates.json
[junit4] 2> 535479 T1643 oascc.SolrZkClient.makePath makePath: /configs/conf1/open-exchange-rates.json
[junit4] 2> 535481 T1643 oasc.AbstractZkTestCase.putConfig put /mnt/ssd/jenkins/workspace/Lucene-Solr-4.x-Linux/solr/core/src/test-files/solr/collection1/conf/mapping-ISOLatin1Accent.txt to /configs/conf1/mapping-ISOLatin1Accent.txt
[junit4] 2> 535482 T1643 oascc.SolrZkClient.makePath makePath: /configs/conf1/mapping-ISOLatin1Accent.txt
[junit4] 2> 535485 T1643 oasc.AbstractZkTestCase.putConfig put /mnt/ssd/jenkins/workspace/Lucene-Solr-4.x-Linux/solr/core/src/test-files/solr/collection1/conf/old_synonyms.txt to /configs/conf1/old_synonyms.txt
[junit4] 2> 535486 T1643 oascc.SolrZkClient.makePath makePath: /configs/conf1/old_synonyms.txt
[junit4] 2> 535488 T1643 oasc.AbstractZkTestCase.putConfig put /mnt/ssd/jenkins/workspace/Lucene-Solr-4.x-Linux/solr/core/src/test-files/solr/collection1/conf/synonyms.txt to /configs/conf1/synonyms.txt
[junit4] 2> 535489 T1643 oascc.SolrZkClient.makePath makePath: /configs/conf1/synonyms.txt
[junit4] 2> 535720 T1643 oejs.Server.doStart jetty-8.1.10.v20130312
[junit4] 2> 535739 T1643 oejs.AbstractConnector.doStart Started SelectChannelConnector@127.0.0.1:37779
[junit4] 2> 535740 T1643 oass.SolrDispatchFilter.init SolrDispatchFilter.init()
[junit4] 2> 535740 T1643 oasc.SolrResourceLoader.locateSolrHome JNDI not configured for solr (NoInitialContextEx)
[junit4] 2> 535741 T1643 oasc.SolrResourceLoader.locateSolrHome using system property solr.solr.home: ./solr.cloud.HttpPartitionTest-28A2A804290B2957-001/tempDir-002
[junit4] 2> 535742 T1643 oasc.SolrResourceLoader.<init> new SolrResourceLoader for directory: './solr.cloud.HttpPartitionTest-28A2A804290B2957-001/tempDir-002/'
[junit4] 2> 535767 T1643 oasc.ConfigSolr.fromFile Loading container configuration from /mnt/ssd/jenkins/workspace/Lucene-Solr-4.x-Linux/solr/build/solr-core/test/J1/./solr.cloud.HttpPartitionTest-28A2A804290B2957-001/tempDir-002/solr.xml
[junit4] 2> 535774 T1643 oasc.CoreContainer.<init> New CoreContainer 710906667
[junit4] 2> 535774 T1643 oasc.CoreContainer.load Loading cores into CoreContainer [instanceDir=./solr.cloud.HttpPartitionTest-28A2A804290B2957-001/tempDir-002/]
[junit4] 2> 535774 T1643 oashc.HttpShardHandlerFactory.getParameter Setting socketTimeout to: 90000
[junit4] 2> 535775 T1643 oashc.HttpShardHandlerFactory.getParameter Setting urlScheme to:
[junit4] 2> 535775 T1643 oashc.HttpShardHandlerFactory.getParameter Setting connTimeout to: 15000
[junit4] 2> 535775 T1643 oashc.HttpShardHandlerFactory.getParameter Setting maxConnectionsPerHost to: 20
[junit4] 2> 535775 T1643 oashc.HttpShardHandlerFactory.getParameter Setting corePoolSize to: 0
[junit4] 2> 535776 T1643 oashc.HttpShardHandlerFactory.getParameter Setting maximumPoolSize to: 2147483647
[junit4] 2> 535776 T1643 oashc.HttpShardHandlerFactory.getParameter Setting maxThreadIdleTime to: 5
[junit4] 2> 535776 T1643 oashc.HttpShardHandlerFactory.getParameter Setting sizeOfQueue to: -1
[junit4] 2> 535776 T1643 oashc.HttpShardHandlerFactory.getParameter Setting fairnessPolicy to: false
[junit4] 2> 535777 T1643 oasl.LogWatcher.createWatcher SLF4J impl is org.slf4j.impl.Log4jLoggerFactory
[junit4] 2> 535777 T1643 oasl.LogWatcher.newRegisteredLogWatcher Registering Log Listener [Log4j (org.slf4j.impl.Log4jLoggerFactory)]
[junit4] 2> 535777 T1643 oasc.CoreContainer.load Host Name: 127.0.0.1
[junit4] 2> 535778 T1643 oasc.ZkContainer.initZooKeeper Zookeeper client=127.0.0.1:51084/solr
[junit4] 2> 535778 T1643 oasc.ZkController.checkChrootPath zkHost includes chroot
[junit4] 2> 535779 T1643 oascc.ConnectionManager.waitForConnected Waiting for client to connect to ZooKeeper
[junit4] 2> 535781 T1663 oascc.ConnectionManager.process Watcher org.apache.solr.common.cloud.ConnectionManager@101660e7 name:ZooKeeperConnection Watcher:127.0.0.1:51084 got event WatchedEvent state:SyncConnected type:None path:null path:null type:None
[junit4] 2> 535782 T1643 oascc.ConnectionManager.waitForConnected Client is connected to ZooKeeper
[junit4] 2> 535785 T1643 oascc.ConnectionManager.waitForConnected Waiting for client to connect to ZooKeeper
[junit4] 2> 535787 T1665 oascc.ConnectionManager.process Watcher org.apache.solr.common.cloud.ConnectionManager@3f98bbb name:ZooKeeperConnection Watcher:127.0.0.1:51084/solr got event WatchedEvent state:SyncConnected type:None path:null path:null type:None
[junit4] 2> 535787 T1643 oascc.ConnectionManager.waitForConnected Client is connected to ZooKeeper
[junit4] 2> 535789 T1643 oascc.SolrZkClient.makePath makePath: /overseer/queue
[junit4] 2> 535793 T1643 oascc.SolrZkClient.makePath makePath: /overseer/collection-queue-work
[junit4] 2> 535797 T1643 oascc.SolrZkClient.makePath makePath: /overseer/collection-map-running
[junit4] 2> 535802 T1643 oascc.SolrZkClient.makePath makePath: /overseer/collection-map-completed
[junit4] 2> 535807 T1643 oascc.SolrZkClient.makePath makePath: /overseer/collection-map-failure
[junit4] 2> 535816 T1643 oascc.SolrZkClient.makePath makePath: /live_nodes
[junit4] 2> 535819 T1643 oasc.ZkController.createEphemeralLiveNode Register node as live in ZooKeeper:/live_nodes/127.0.0.1:37875_
[junit4] 2> 535821 T1643 oascc.SolrZkClient.makePath makePath: /live_nodes/127.0.0.1:37875_
[junit4] 2> 535825 T1643 oascc.SolrZkClient.makePath makePath: /overseer_elect
[junit4] 2> 535828 T1643 oascc.SolrZkClient.makePath makePath: /overseer_elect/election
[junit4] 2> 535834 T1643 oasc.OverseerElectionContext.runLeaderProcess I am going to be the leader 127.0.0.1:37875_
[junit4] 2> 535835 T1643 oascc.SolrZkClient.makePath makePath: /overseer_elect/leader
[junit4] 2> 535838 T1643 oasc.Overseer.start Overseer (id=91922496264798211-127.0.0.1:37875_-n_0000000000) starting
[junit4] 2> 535843 T1643 oascc.SolrZkClient.makePath makePath: /overseer/queue-work
[junit4] 2> 535857 T1667 oasc.OverseerCollectionProcessor.run Process current queue of collection creations
[junit4] 2> 535858 T1643 oascc.SolrZkClient.makePath makePath: /clusterstate.json
[junit4] 2> 535861 T1643 oascc.SolrZkClient.makePath makePath: /aliases.json
[junit4] 2> 535864 T1643 oascc.ZkStateReader.createClusterStateWatchersAndUpdate Updating cluster state from ZooKeeper...
[junit4] 2> 535865 T1666 oasc.Overseer$ClusterStateUpdater.run Starting to work on the main queue
[junit4] 2> 535867 T1668 oasc.ZkController.publish publishing core=collection1 state=down collection=control_collection
[junit4] 2> 535867 T1668 oasc.ZkController.publish numShards not found on descriptor - reading it from system property
[junit4] 2> 535867 T1665 oasc.DistributedQueue$LatchChildWatcher.process LatchChildWatcher fired on path: /overseer/queue state: SyncConnected type NodeChildrenChanged
[junit4] 2> 535867 T1668 oasc.ZkController.waitForCoreNodeName look for our core node name
[junit4] 2> 535868 T1666 oascc.ZkStateReader.updateClusterState Updating cloud state from ZooKeeper...
[junit4] 2> 535869 T1666 oasc.Overseer$ClusterStateUpdater.updateState Update state numShards=1 message={
[junit4] 2> "operation":"state",
[junit4] 2> "state":"down",
[junit4] 2> "base_url":"http://127.0.0.1:37875",
[junit4] 2> "core":"collection1",
[junit4] 2> "roles":null,
[junit4] 2> "node_name":"127.0.0.1:37875_",
[junit4] 2> "shard":null,
[junit4] 2> "collection":"control_collection",
[junit4] 2> "numShards":"1",
[junit4] 2> "core_node_name":null}
[junit4] 2> 535869 T1666 oasc.Overseer$ClusterStateUpdater.createCollection Create collection control_collection with shards [shard1]
[junit4] 2> 535869 T1666 oasc.Overseer$ClusterStateUpdater.updateState Assigning new node to shard shard=shard1
[junit4] 2> 535870 T1665 oasc.DistributedQueue$LatchChildWatcher.process LatchChildWatcher fired on path: /overseer/queue state: SyncConnected type NodeChildrenChanged
[junit4] 2> 535871 T1665 oascc.ZkStateReader$2.process A cluster state change: WatchedEvent state:SyncConnected type:NodeDataChanged path:/clusterstate.json, has occurred - updating... (live nodes size: 1)
[junit4] 2> 536868 T1668 oasc.ZkController.waitForShardId waiting to find shard id in clusterstate for collection1
[junit4] 2> 536868 T1668 oasc.ZkController.createCollectionZkNode Check for collection zkNode:control_collection
[junit4] 2> 536869 T1668 oasc.ZkController.createCollectionZkNode Collection zkNode exists
[junit4] 2> 536869 T1668 oascc.ZkStateReader.readConfigName Load collection config from:/collections/control_collection
[junit4] 2> 536870 T1668 oascc.ZkStateReader.readConfigName path=/collections/control_collection configName=conf1 specified config exists in ZooKeeper
[junit4] 2> 536870 T1668 oasc.SolrResourceLoader.<init> new SolrResourceLoader for directory: './solr.cloud.HttpPartitionTest-28A2A804290B2957-001/tempDir-002/collection1/'
[junit4] 2> 536870 T1668 oasc.SolrResourceLoader.replaceClassLoader Adding 'file:/mnt/ssd/jenkins/workspace/Lucene-Solr-4.x-Linux/solr/build/solr-core/test/J1/solr.cloud.HttpPartitionTest-28A2A804290B2957-001/tempDir-002/collection1/lib/.svn/' to classloader
[junit4] 2> 536870 T1668 oasc.SolrResourceLoader.replaceClassLoader Adding 'file:/mnt/ssd/jenkins/workspace/Lucene-Solr-4.x-Linux/solr/build/solr-core/test/J1/solr.cloud.HttpPartitionTest-28A2A804290B2957-001/tempDir-002/collection1/lib/classes/' to classloader
[junit4] 2> 536871 T1668 oasc.SolrResourceLoader.replaceClassLoader Adding 'file:/mnt/ssd/jenkins/workspace/Lucene-Solr-4.x-Linux/solr/build/solr-core/test/J1/solr.cloud.HttpPartitionTest-28A2A804290B2957-001/tempDir-002/collection1/lib/README' to classloader
[junit4] 2> 536888 T1668 oasc.SolrConfig.<init> Using Lucene MatchVersion: LUCENE_4_9
[junit4] 2> 536896 T1668 oasc.SolrConfig.<init> Loaded SolrConfig: solrconfig.xml
[junit4] 2> 536897 T1668 oass.IndexSchema.readSchema Reading Solr Schema from schema.xml
[junit4] 2> 536901 T1668 oass.IndexSchema.readSchema [collection1] Schema name=test
[junit4] 2> 536985 T1668 oass.ByteField.init WARN ByteField is deprecated and will be removed in 5.0. You should use TrieIntField instead.
[junit4] 2> 536986 T1668 oass.ShortField.init WARN ShortField is deprecated and will be removed in 5.0. You should use TrieIntField instead.
[junit4] 2> 536986 T1668 oass.OpenExchangeRatesOrgProvider.init Initialized with rates=open-exchange-rates.json, refreshInterval=1440.
[junit4] 2> 536990 T1668 oass.IndexSchema.readSchema default search field in schema is text
[junit4] 2> 536991 T1668 oass.IndexSchema.readSchema unique key field: id
[junit4] 2> 536999 T1668 oass.FileExchangeRateProvider.reload Reloading exchange rates from file currency.xml
[junit4] 2> 537001 T1668 oass.FileExchangeRateProvider.reload Reloading exchange rates from file currency.xml
[junit4] 2> 537002 T1668 oass.OpenExchangeRatesOrgProvider.reload Reloading exchange rates from open-exchange-rates.json
[junit4] 2> 537003 T1668 oass.OpenExchangeRatesOrgProvider$OpenExchangeRates.<init> WARN Unknown key IMPORTANT NOTE
[junit4] 2> 537003 T1668 oass.OpenExchangeRatesOrgProvider$OpenExchangeRates.<init> WARN Expected key, got STRING
[junit4] 2> 537003 T1668 oass.OpenExchangeRatesOrgProvider.reload Reloading exchange rates from open-exchange-rates.json
[junit4] 2> 537004 T1668 oass.OpenExchangeRatesOrgProvider$OpenExchangeRates.<init> WARN Unknown key IMPORTANT NOTE
[junit4] 2> 537004 T1668 oass.OpenExchangeRatesOrgProvider$OpenExchangeRates.<init> WARN Expected key, got STRING
[junit4] 2> 537004 T1668 oasc.CoreContainer.create Creating SolrCore 'collection1' using configuration from collection control_collection
[junit4] 2> 537005 T1668 oasc.SolrCore.initDirectoryFactory org.apache.solr.core.MockDirectoryFactory
[junit4] 2> 537005 T1668 oasc.SolrCore.<init> [collection1] Opening new SolrCore at ./solr.cloud.HttpPartitionTest-28A2A804290B2957-001/tempDir-002/collection1/, dataDir=./solr.cloud.HttpPartitionTest-28A2A804290B2957-001/tempDir-001/control/data/
[junit4] 2> 537005 T1668 oasc.JmxMonitoredMap.<init> JMX monitoring is enabled. Adding Solr mbeans to JMX Server: com.sun.jmx.mbeanserver.JmxMBeanServer@4fc763fa
[junit4] 2> 537005 T1668 oasc.CachingDirectoryFactory.get return new directory for ./solr.cloud.HttpPartitionTest-28A2A804290B2957-001/tempDir-001/control/data
[junit4] 2> 537006 T1668 oasc.SolrCore.getNewIndexDir New index directory detected: old=null new=./solr.cloud.HttpPartitionTest-28A2A804290B2957-001/tempDir-001/control/data/index/
[junit4] 2> 537006 T1668 oasc.SolrCore.initIndex WARN [collection1] Solr index directory './solr.cloud.HttpPartitionTest-28A2A804290B2957-001/tempDir-001/control/data/index' doesn't exist. Creating new index...
[junit4] 2> 537006 T1668 oasc.CachingDirectoryFactory.get return new directory for ./solr.cloud.HttpPartitionTest-28A2A804290B2957-001/tempDir-001/control/data/index
[junit4] 2> 537006 T1668 oasu.RandomMergePolicy.<init> RandomMergePolicy wrapping class org.apache.lucene.index.TieredMergePolicy: [TieredMergePolicy: maxMergeAtOnce=29, maxMergeAtOnceExplicit=33, maxMergedSegmentMB=71.505859375, floorSegmentMB=1.7490234375, forceMergeDeletesPctAllowed=5.424670760772601, segmentsPerTier=48.0, maxCFSSegmentSizeMB=8.796093022207999E12, noCFSRatio=0.0
[junit4] 2> 537007 T1668 oasc.SolrDeletionPolicy.onCommit SolrDeletionPolicy.onCommit: commits: num=1
[junit4] 2> commit{dir=MockDirectoryWrapper(RAMDirectory@2638c5a6 lockFactory=org.apache.lucene.store.SingleInstanceLockFactory@36cf5051),segFN=segments_1,generation=1}
[junit4] 2> 537007 T1668 oasc.SolrDeletionPolicy.updateCommits newest commit generation = 1
[junit4] 2> 537009 T1668 oasup.UpdateRequestProcessorChain.init creating updateRequestProcessorChain "nodistrib"
[junit4] 2> 537009 T1668 oasup.UpdateRequestProcessorChain.init creating updateRequestProcessorChain "dedupe"
[junit4] 2> 537009 T1668 oasup.UpdateRequestProcessorChain.init inserting DistributedUpdateProcessorFactory into updateRequestProcessorChain "dedupe"
[junit4] 2> 537009 T1668 oasup.UpdateRequestProcessorChain.init creating updateRequestProcessorChain "stored_sig"
[junit4] 2> 537009 T1668 oasup.UpdateRequestProcessorChain.init inserting DistributedUpdateProcessorFactory into updateRequestProcessorChain "stored_sig"
[junit4] 2> 537010 T1668 oasup.UpdateRequestProcessorChain.init creating updateRequestProcessorChain "distrib-dup-test-chain-explicit"
[junit4] 2> 537010 T1668 oasup.UpdateRequestProcessorChain.init creating updateRequestProcessorChain "distrib-dup-test-chain-implicit"
[junit4] 2> 537010 T1668 oasup.UpdateRequestProcessorChain.init inserting DistributedUpdateProcessorFactory into updateRequestProcessorChain "distrib-dup-test-chain-implicit"
[junit4] 2> 537010 T1668 oasc.SolrCore.loadUpdateProcessorChains no updateRequestProcessorChain defined as default, creating implicit default
[junit4] 2> 537010 T1668 oasc.RequestHandlers.initHandlersFromConfig created standard: solr.StandardRequestHandler
[junit4] 2> 537011 T1668 oasc.RequestHandlers.initHandlersFromConfig created /get: solr.RealTimeGetHandler
[junit4] 2> 537011 T1668 oasc.RequestHandlers.initHandlersFromConfig adding lazy requestHandler: solr.ReplicationHandler
[junit4] 2> 537011 T1668 oasc.RequestHandlers.initHandlersFromConfig created /replication: solr.ReplicationHandler
[junit4] 2> 537011 T1668 oasc.RequestHandlers.initHandlersFromConfig created /update: solr.UpdateRequestHandler
[junit4] 2> 537012 T1668 oasc.RequestHandlers.initHandlersFromConfig created /admin/: org.apache.solr.handler.admin.AdminHandlers
[junit4] 2> 537012 T1668 oasc.RequestHandlers.initHandlersFromConfig created /admin/file: solr.admin.ShowFileRequestHandler
[junit4] 2> 537013 T1668 oashl.XMLLoader.init xsltCacheLifetimeSeconds=60
[junit4] 2> 537014 T1668 oasu.CommitTracker.<init> Hard AutoCommit: disabled
[junit4] 2> 537015 T1668 oasu.CommitTracker.<init> Soft AutoCommit: disabled
[junit4] 2> 537015 T1668 oasu.RandomMergePolicy.<init> RandomMergePolicy wrapping class org.apache.lucene.index.TieredMergePolicy: [TieredMergePolicy: maxMergeAtOnce=36, maxMergeAtOnceExplicit=37, maxMergedSegmentMB=3.4560546875, floorSegmentMB=2.0302734375, forceMergeDeletesPctAllowed=20.00552080589751, segmentsPerTier=20.0, maxCFSSegmentSizeMB=8.796093022207999E12, noCFSRatio=0.4540328940412207
[junit4] 2> 537016 T1668 oasc.SolrDeletionPolicy.onInit SolrDeletionPolicy.onInit: commits: num=1
[junit4] 2> commit{dir=MockDirectoryWrapper(RAMDirectory@2638c5a6 lockFactory=org.apache.lucene.store.SingleInstanceLockFactory@36cf5051),segFN=segments_1,generation=1}
[junit4] 2> 537016 T1668 oasc.SolrDeletionPolicy.updateCommits newest commit generation = 1
[junit4] 2> 537016 T1668 oass.SolrIndexSearcher.<init> Opening Searcher@61e08c26[collection1] main
[junit4] 2> 537016 T1668 oascc.ZkStateReader.readConfigName Load collection config from:/collections/control_collection
[junit4] 2> 537017 T1668 oascc.ZkStateReader.readConfigName path=/collections/control_collection configName=conf1 specified config exists in ZooKeeper
[junit4] 2> 537017 T1668 oasr.ManagedResourceStorage.newStorageIO Setting up ZooKeeper-based storage for the RestManager with znodeBase: /configs/conf1
[junit4] 2> 537018 T1668 oasr.ManagedResourceStorage$ZooKeeperStorageIO.configure Configured ZooKeeperStorageIO with znodeBase: /configs/conf1
[junit4] 2> 537018 T1668 oasr.RestManager.init Initializing RestManager with initArgs: {}
[junit4] 2> 537018 T1668 oasr.ManagedResourceStorage.load Reading _rest_managed.json using ZooKeeperStorageIO:path=/configs/conf1
[junit4] 2> 537018 T1668 oasr.ManagedResourceStorage$ZooKeeperStorageIO.openInputStream No data found for znode /configs/conf1/_rest_managed.json
[junit4] 2> 537018 T1668 oasr.ManagedResourceStorage.load Loaded null at path _rest_managed.json using ZooKeeperStorageIO:path=/configs/conf1
[junit4] 2> 537019 T1668 oasr.ManagedResource.notifyObserversDuringInit WARN No registered observers for /rest/managed
[junit4] 2> 537019 T1668 oasr.RestManager.init Initializing 0 registered ManagedResources
[junit4] 2> 537020 T1669 oasc.SolrCore.registerSearcher [collection1] Registered new searcher Searcher@61e08c26[collection1] main{StandardDirectoryReader(segments_1:1:nrt)}
[junit4] 2> 537021 T1668 oasc.CoreContainer.registerCore registering core: collection1
[junit4] 2> 537021 T1672 oasc.ZkController.register Register replica - core:collection1 address:http://127.0.0.1:37875 collection:control_collection shard:shard1
[junit4] 2> 537021 T1643 oass.SolrDispatchFilter.init user.dir=/mnt/ssd/jenkins/workspace/Lucene-Solr-4.x-Linux/solr/build/solr-core/test/J1
[junit4] 2> 537022 T1672 oascc.SolrZkClient.makePath makePath: /collections/control_collection/leader_elect/shard1/election
[junit4] 2> 537022 T1643 oass.SolrDispatchFilter.init SolrDispatchFilter.init() done
[junit4] 2> 537025 T1643 oascc.ConnectionManager.waitForConnected Waiting for client to connect to ZooKeeper
[junit4] 2> 537025 T1672 oasc.ShardLeaderElectionContext.runLeaderProcess Running the leader process for shard shard1
[junit4] 2> 537030 T1665 oasc.DistributedQueue$LatchChildWatcher.process LatchChildWatcher fired on path: /overseer/queue state: SyncConnected type NodeChildrenChanged
[junit4] 2> 537030 T1672 oasc.ShardLeaderElectionContext.waitForReplicasToComeUp Enough replicas found to continue.
[junit4] 2> 537030 T1672 oasc.ShardLeaderElectionContext.runLeaderProcess I may be the new leader - try and sync
[junit4] 2> ASYNC NEW_CORE C538 name=collection1 org.apache.solr.core.SolrCore@1d24d0c7 url=http://127.0.0.1:37875/collection1 node=127.0.0.1:37875_ C538_STATE=coll:control_collection core:collection1 props:{state=down, base_url=http://127.0.0.1:37875, core=collection1, node_name=127.0.0.1:37875_}
[junit4] 2> 537030 T1672 C538 P37875 oasc.SyncStrategy.sync Sync replicas to http://127.0.0.1:37875/collection1/
[junit4] 2> 537031 T1666 oascc.ZkStateReader.updateClusterState Updating cloud state from ZooKeeper...
[junit4] 2> 537031 T1672 C538 P37875 oasc.SyncStrategy.syncReplicas Sync Success - now sync replicas to me
[junit4] 2> 537031 T1672 C538 P37875 oasc.SyncStrategy.syncToMe http://127.0.0.1:37875/collection1/ has no replicas
[junit4] 2> 537031 T1672 oasc.ShardLeaderElectionContext.runLeaderProcess I am the new leader: http://127.0.0.1:37875/collection1/ shard1
[junit4] 2> 537031 T1675 oascc.ConnectionManager.process Watcher org.apache.solr.common.cloud.ConnectionManager@14ae9554 name:ZooKeeperConnection Watcher:127.0.0.1:51084/solr got event WatchedEvent state:SyncConnected type:None path:null path:null type:None
[junit4] 2> 537031 T1672 oascc.SolrZkClient.makePath makePath: /collections/control_collection/leaders/shard1
[junit4] 2> 537032 T1643 oascc.ConnectionManager.waitForConnected Client is connected to ZooKeeper
[junit4] 2> 537036 T1665 oasc.DistributedQueue$LatchChildWatcher.process LatchChildWatcher fired on path: /overseer/queue state: SyncConnected type NodeChildrenChanged
[junit4] 2> 537036 T1643 oascc.ZkStateReader.createClusterStateWatchersAndUpdate Updating cluster state from ZooKeeper...
[junit4] 2> 537038 T1665 oasc.DistributedQueue$LatchChildWatcher.process LatchChildWatcher fired on path: /overseer/queue state: SyncConnected type NodeChildrenChanged
[junit4] 2> 537038 T1643 oasc.ChaosMonkey.monkeyLog monkey: init - expire sessions:false cause connection loss:false
[junit4] 2> 537041 T1665 oasc.DistributedQueue$LatchChildWatcher.process LatchChildWatcher fired on path: /overseer/queue state: SyncConnected type NodeChildrenChanged
[junit4] 2> 537143 T1675 oascc.ZkStateReader$2.process A cluster state change: WatchedEvent state:SyncConnected type:NodeDataChanged path:/clusterstate.json, has occurred - updating... (live nodes size: 1)
[junit4] 2> 537143 T1665 oascc.ZkStateReader$2.process A cluster state change: WatchedEvent state:SyncConnected type:NodeDataChanged path:/clusterstate.json, has occurred - updating... (live nodes size: 1)
[junit4] 2> 537189 T1672 oasc.ZkController.register We are http://127.0.0.1:37875/collection1/ and leader is http://127.0.0.1:37875/collection1/
[junit4] 2> 537189 T1672 oasc.ZkController.register No LogReplay needed for core=collection1 baseURL=http://127.0.0.1:37875
[junit4] 2> 537189 T1672 oasc.ZkController.checkRecovery I am the leader, no recovery necessary
[junit4] 2> 537189 T1672 oasc.ZkController.publish publishing core=collection1 state=active collection=control_collection
[junit4] 2> 537189 T1672 oasc.ZkController.publish numShards not found on descriptor - reading it from system property
[junit4] 2> 537191 T1665 oasc.DistributedQueue$LatchChildWatcher.process LatchChildWatcher fired on path: /overseer/queue state: SyncConnected type NodeChildrenChanged
[junit4] 2> 537191 T1665 oasc.DistributedQueue$LatchChildWatcher.process LatchChildWatcher fired on path: /overseer/queue state: SyncConnected type NodeChildrenChanged
[junit4] 2> 537191 T1672 oascc.ZkStateReader.updateClusterState Updating cloud state from ZooKeeper...
[junit4] 2> 537191 T1665 oasc.DistributedQueue$LatchChildWatcher.process LatchChildWatcher fired on path: /overseer/queue state: SyncConnected type NodeChildrenChanged
[junit4] 2> 537192 T1666 oascc.ZkStateReader.updateClusterState Updating cloud state from ZooKeeper...
[junit4] 2> 537192 T1666 oasc.Overseer$ClusterStateUpdater.updateState Update state numShards=2 message={
[junit4] 2> "operation":"state",
[junit4] 2> "state":"active",
[junit4] 2> "base_url":"http://127.0.0.1:37875",
[junit4] 2> "core":"collection1",
[junit4] 2> "roles":null,
[junit4] 2> "node_name":"127.0.0.1:37875_",
[junit4] 2> "shard":"shard1",
[junit4] 2> "collection":"control_collection",
[junit4] 2> "numShards":"2",
[junit4] 2> "core_node_name":"core_node1"}
[junit4] 2> 537194 T1665 oasc.DistributedQueue$LatchChildWatcher.process LatchChildWatcher fired on path: /overseer/queue state: SyncConnected type NodeChildrenChanged
[junit4] 2> 537277 T1643 oasc.AbstractFullDistribZkTestBase.createJettys create jetty 1
[junit4] 2> 537278 T1643 oejs.Server.doStart jetty-8.1.10.v20130312
[junit4] 2> 537280 T1643 oejs.AbstractConnector.doStart Started SelectChannelConnector@127.0.0.1:59602
[junit4] 2> 537281 T1643 oass.SolrDispatchFilter.init SolrDispatchFilter.init()
[junit4] 2> 537281 T1643 oasc.SolrResourceLoader.locateSolrHome JNDI not configured for solr (NoInitialContextEx)
[junit4] 2> 537281 T1643 oasc.SolrResourceLoader.locateSolrHome using system property solr.solr.home: ./solr.cloud.HttpPartitionTest-28A2A804290B2957-001/tempDir-003
[junit4] 2> 537282 T1643 oasc.SolrResourceLoader.<init> new SolrResourceLoader for directory: './solr.cloud.HttpPartitionTest-28A2A804290B2957-001/tempDir-003/'
[junit4] 2> 537294 T1643 oasc.ConfigSolr.fromFile Loading container configuration from /mnt/ssd/jenkins/workspace/Lucene-Solr-4.x-Linux/solr/build/solr-core/test/J1/./solr.cloud.HttpPartitionTest-28A2A804290B2957-001/tempDir-003/solr.xml
[junit4] 2> 537295 T1675 oascc.ZkStateReader$2.process A cluster state change: WatchedEvent state:SyncConnected type:NodeDataChanged path:/clusterstate.json, has occurred - updating... (live nodes size: 1)
[junit4] 2> 537295 T1665 oascc.ZkStateReader$2.process A cluster state change: WatchedEvent state:SyncConnected type:NodeDataChanged path:/clusterstate.json, has occurred - updating... (live nodes size: 1)
[junit4] 2> 537318 T1643 oasc.CoreContainer.<init> New CoreContainer 34999867
[junit4] 2> 537319 T1643 oasc.CoreContainer.load Loading cores into CoreContainer [instanceDir=./solr.cloud.HttpPartitionTest-28A2A804290B2957-001/tempDir-003/]
[junit4] 2> 537319 T1643 oashc.HttpShardHandlerFactory.getParameter Setting socketTimeout to: 90000
[junit4] 2> 537319 T1643 oashc.HttpShardHandlerFactory.getParameter Setting urlScheme to:
[junit4] 2> 537320 T1643 oashc.HttpShardHandlerFactory.getParameter Setting connTimeout to: 15000
[junit4] 2> 537320 T1643 oashc.HttpShardHandlerFactory.getParameter Setting maxConnectionsPerHost to: 20
[junit4] 2> 537320 T1643 oashc.HttpShardHandlerFactory.getParameter Setting corePoolSize to: 0
[junit4] 2> 537320 T1643 oashc.HttpShardHandlerFactory.getParameter Setting maximumPoolSize to: 2147483647
[junit4] 2> 537321 T1643 oashc.HttpShardHandlerFactory.getParameter Setting maxThreadIdleTime to: 5
[junit4] 2> 537321 T1643 oashc.HttpShardHandlerFactory.getParameter Setting sizeOfQueue to: -1
[junit4] 2> 537321 T1643 oashc.HttpShardHandlerFactory.getParameter Setting fairnessPolicy to: false
[junit4] 2> 537322 T1643 oasl.LogWatcher.createWatcher SLF4J impl is org.slf4j.impl.Log4jLoggerFactory
[junit4] 2> 537322 T1643 oasl.LogWatcher.newRegisteredLogWatcher Registering Log Listener [Log4j (org.slf4j.impl.Log4jLoggerFactory)]
[junit4] 2> 537322 T1643 oasc.CoreContainer.load Host Name: 127.0.0.1
[junit4] 2> 537322 T1643 oasc.ZkContainer.initZooKeeper Zookeeper client=127.0.0.1:51084/solr
[junit4] 2> 537323 T1643 oasc.ZkController.checkChrootPath zkHost includes chroot
[junit4] 2> 537323 T1643 oascc.ConnectionManager.waitForConnected Waiting for client to connect to ZooKeeper
[junit4] 2> 537325 T1686 oascc.ConnectionManager.process Watcher org.apache.solr.common.cloud.ConnectionManager@675ace59 name:ZooKeeperConnection Watcher:127.0.0.1:51084 got event WatchedEvent state:SyncConnected type:None path:null path:null type:None
[junit4] 2> 537326 T1643 oascc.ConnectionManager.waitForConnected Client is connected to ZooKeeper
[junit4] 2> 537328 T1643 oascc.ConnectionManager.waitForConnected Waiting for client to connect to ZooKeeper
[junit4] 2> 537330 T1688 oascc.ConnectionManager.process Watcher org.apache.solr.common.cloud.ConnectionManager@345d871b name:ZooKeeperConnection Watcher:127.0.0.1:51084/solr got event WatchedEvent state:SyncConnected type:None path:null path:null type:None
[junit4] 2> 537330 T1643 oascc.ConnectionManager.waitForConnected Client is connected to ZooKeeper
[junit4] 2> 537334 T1643 oascc.ZkStateReader.createClusterStateWatchersAndUpdate Updating cluster state from ZooKeeper...
[junit4] 2> 538336 T1643 oasc.ZkController.createEphemeralLiveNode Register node as live in ZooKeeper:/live_nodes/127.0.0.1:42332_
[junit4] 2> 538337 T1643 oascc.SolrZkClient.makePath makePath: /live_nodes/127.0.0.1:42332_
[junit4] 2> 538343 T1675 oascc.ZkStateReader$3.process Updating live nodes... (2)
[junit4] 2> 538343 T1665 oascc.ZkStateReader$3.process Updating live nodes... (2)
[junit4] 2> 538344 T1688 oascc.ZkStateReader$3.process Updating live nodes... (2)
[junit4] 2> 538347 T1689 oasc.ZkController.publish publishing core=collection1 state=down collection=collection1
[junit4] 2> 538348 T1689 oasc.ZkController.publish numShards not found on descriptor - reading it from system property
[junit4] 2> 538348 T1665 oasc.DistributedQueue$LatchChildWatcher.process LatchChildWatcher fired on path: /overseer/queue state: SyncConnected type NodeChildrenChanged
[junit4] 2> 538348 T1689 oasc.ZkController.waitForCoreNodeName look for our core node name
[junit4] 2> 538348 T1665 oasc.DistributedQueue$LatchChildWatcher.process LatchChildWatcher fired on path: /overseer/queue state: SyncConnected type NodeChildrenChanged
[junit4] 2> 538349 T1665 oasc.DistributedQueue$LatchChildWatcher.process LatchChildWatcher fired on path: /overseer/queue state: SyncConnected type NodeChildrenChanged
[junit4] 2> 538349 T1666 oascc.ZkStateReader.updateClusterState Updating cloud state from ZooKeeper...
[junit4] 2> 538350 T1666 oasc.Overseer$ClusterStateUpdater.updateState Update state numShards=2 message={
[junit4] 2> "operation":"state",
[junit4] 2> "state":"down",
[junit4] 2> "base_url":"http://127.0.0.1:42332",
[junit4] 2> "core":"collection1",
[junit4] 2> "roles":null,
[junit4] 2> "node_name":"127.0.0.1:42332_",
[junit4] 2> "shard":null,
[junit4] 2> "collection":"collection1",
[junit4] 2> "numShards":"2",
[junit4] 2> "core_node_name":null}
[junit4] 2> 538350 T1666 oasc.Overseer$ClusterStateUpdater.createCollection Create collection collection1 with shards [shard1, shard2]
[junit4] 2> 538350 T1666 oasc.Overseer$ClusterStateUpdater.updateState Assigning new node to shard shard=shard2
[junit4] 2> 538352 T1665 oasc.DistributedQueue$LatchChildWatcher.process LatchChildWatcher fired on path: /overseer/queue state: SyncConnected type NodeChildrenChanged
[junit4] 2> 538454 T1675 oascc.ZkStateReader$2.process A cluster state change: WatchedEvent state:SyncConnected type:NodeDataChanged path:/clusterstate.json, has occurred - updating... (live nodes size: 2)
[junit4] 2> 538454 T1665 oascc.ZkStateReader$2.process A cluster state change: WatchedEvent state:SyncConnected type:NodeDataChanged path:/clusterstate.json, has occurred - updating... (live nodes size: 2)
[junit4] 2> 538454 T1688 oascc.ZkStateReader$2.process A cluster state change: WatchedEvent state:SyncConnected type:NodeDataChanged path:/clusterstate.json, has occurred - updating... (live nodes size: 2)
[junit4] 2> 539349 T1689 oasc.ZkController.waitForShardId waiting to find shard id in clusterstate for collection1
[junit4] 2> 539349 T1689 oasc.ZkController.createCollectionZkNode Check for collection zkNode:collection1
[junit4] 2> 539350 T1689 oasc.ZkController.createCollectionZkNode Collection zkNode exists
[junit4] 2> 539350 T1689 oascc.ZkStateReader.readConfigName Load collection config from:/collections/collection1
[junit4] 2> 539351 T1689 oascc.ZkStateReader.readConfigName path=/collections/collection1 configName=conf1 specified config exists in ZooKeeper
[junit4] 2> 539351 T1689 oasc.SolrResourceLoader.<init> new SolrResourceLoader for directory: './solr.cloud.HttpPartitionTest-28A2A804290B2957-001/tempDir-003/collection1/'
[junit4] 2> 539351 T1689 oasc.SolrResourceLoader.replaceClassLoader Adding 'file:/mnt/ssd/jenkins/workspace/Lucene-Solr-4.x-Linux/solr/build/solr-core/test/J1/solr.cloud.HttpPartitionTest-28A2A804290B2957-001/tempDir-003/collection1/lib/.svn/' to classloader
[junit4] 2> 539352 T1689 oasc.SolrResourceLoader.replaceClassLoader Adding 'file:/mnt/ssd/jenkins/workspace/Lucene-Solr-4.x-Linux/solr/build/solr-core/test/J1/solr.cloud.HttpPartitionTest-28A2A804290B2957-001/tempDir-003/collection1/lib/classes/' to classloader
[junit4] 2> 539352 T1689 oasc.SolrResourceLoader.replaceClassLoader Adding 'file:/mnt/ssd/jenkins/workspace/Lucene-Solr-4.x-Linux/solr/build/solr-core/test/J1/solr.cloud.HttpPartitionTest-28A2A804290B2957-001/tempDir-003/collection1/lib/README' to classloader
[junit4] 2> 539373 T1689 oasc.SolrConfig.<init> Using Lucene MatchVersion: LUCENE_4_9
[junit4] 2> 539381 T1689 oasc.SolrConfig.<init> Loaded SolrConfig: solrconfig.xml
[junit4] 2> 539382 T1689 oass.IndexSchema.readSchema Reading Solr Schema from schema.xml
[junit4] 2> 539387 T1689 oass.IndexSchema.readSchema [collection1] Schema name=test
[junit4] 2> 539471 T1689 oass.ByteField.init WARN ByteField is deprecated and will be removed in 5.0. You should use TrieIntField instead.
[junit4] 2> 539472 T1689 oass.ShortField.init WARN ShortField is deprecated and will be removed in 5.0. You should use TrieIntField instead.
[junit4] 2> 539472 T1689 oass.OpenExchangeRatesOrgProvider.init Initialized with rates=open-exchange-rates.json, refreshInterval=1440.
[junit4] 2> 539476 T1689 oass.IndexSchema.readSchema default search field in schema is text
[junit4] 2> 539477 T1689 oass.IndexSchema.readSchema unique key field: id
[junit4] 2> 539484 T1689 oass.FileExchangeRateProvider.reload Reloading exchange rates from file currency.xml
[junit4] 2> 539486 T1689 oass.FileExchangeRateProvider.reload Reloading exchange rates from file currency.xml
[junit4] 2> 539487 T1689 oass.OpenExchangeRatesOrgProvider.reload Reloading exchange rates from open-exchange-rates.json
[junit4] 2> 539488 T1689 oass.OpenExchangeRatesOrgProvider$OpenExchangeRates.<init> WARN Unknown key IMPORTANT NOTE
[junit4] 2> 539488 T1689 oass.OpenExchangeRatesOrgProvider$OpenExchangeRates.<init> WARN Expected key, got STRING
[junit4] 2> 539489 T1689 oass.OpenExchangeRatesOrgProvider.reload Reloading exchange rates from open-exchange-rates.json
[junit4] 2> 539489 T1689 oass.OpenExchangeRatesOrgProvider$OpenExchangeRates.<init> WARN Unknown key IMPORTANT NOTE
[junit4] 2> 539489 T1689 oass.OpenExchangeRatesOrgProvider$OpenExchangeRates.<init> WARN Expected key, got STRING
[junit4] 2> 539489 T1689 oasc.CoreContainer.create Creating SolrCore 'collection1' using configuration from collection collection1
[junit4] 2> 539490 T1689 oasc.SolrCore.initDirectoryFactory org.apache.solr.core.MockDirectoryFactory
[junit4] 2> 539490 T1689 oasc.SolrCore.<init> [collection1] Opening new SolrCore at ./solr.cloud.HttpPartitionTest-28A2A804290B2957-001/tempDir-003/collection1/, dataDir=./solr.cloud.HttpPartitionTest-28A2A804290B2957-001/tempDir-001/jetty1/
[junit4] 2> 539490 T1689 oasc.JmxMonitoredMap.<init> JMX monitoring is enabled. Adding Solr mbeans to JMX Server: com.sun.jmx.mbeanserver.JmxMBeanServer@4fc763fa
[junit4] 2> 539491 T1689 oasc.CachingDirectoryFactory.get return new directory for ./solr.cloud.HttpPartitionTest-28A2A804290B2957-001/tempDir-001/jetty1
[junit4] 2> 539491 T1689 oasc.SolrCore.getNewIndexDir New index directory detected: old=null new=./solr.cloud.HttpPartitionTest-28A2A804290B2957-001/tempDir-001/jetty1/index/
[junit4] 2> 539491 T1689 oasc.SolrCore.initIndex WARN [collection1] Solr index directory './solr.cloud.HttpPartitionTest-28A2A804290B2957-001/tempDir-001/jetty1/index' doesn't exist. Creating new index...
[junit4] 2> 539491 T1689 oasc.CachingDirectoryFactory.get return new directory for ./solr.cloud.HttpPartitionTest-28A2A804290B2957-001/tempDir-001/jetty1/index
[junit4] 2> 539491 T1689 oasu.RandomMergePolicy.<init> RandomMergePolicy wrapping class org.apache.lucene.index.TieredMergePolicy: [TieredMergePolicy: maxMergeAtOnce=29, maxMergeAtOnceExplicit=33, maxMergedSegmentMB=71.505859375, floorSegmentMB=1.7490234375, forceMergeDeletesPctAllowed=5.424670760772601, segmentsPerTier=48.0, maxCFSSegmentSizeMB=8.796093022207999E12, noCFSRatio=0.0
[junit4] 2> 539492 T1689 oasc.SolrDeletionPolicy.onCommit SolrDeletionPolicy.onCommit: commits: num=1
[junit4] 2> commit{dir=MockDirectoryWrapper(RAMDirectory@5f3f67a9 lockFactory=org.apache.lucene.store.SingleInstanceLockFactory@46de0947),segFN=segments_1,generation=1}
[junit4] 2> 539492 T1689 oasc.SolrDeletionPolicy.updateCommits newest commit generation = 1
[junit4] 2> 539494 T1689 oasup.UpdateRequestProcessorChain.init creating updateRequestProcessorChain "nodistrib"
[junit4] 2> 539494 T1689 oasup.UpdateRequestProcessorChain.init creating updateRequestProcessorChain "dedupe"
[junit4] 2> 539494 T1689 oasup.UpdateRequestProcessorChain.init inserting DistributedUpdateProcessorFactory into updateRequestProcessorChain "dedupe"
[junit4] 2> 539495 T1689 oasup.UpdateRequestProcessorChain.init creating updateRequestProcessorChain "stored_sig"
[junit4] 2> 539495 T1689 oasup.UpdateRequestProcessorChain.init inserting DistributedUpdateProcessorFactory into updateRequestProcessorChain "stored_sig"
[junit4] 2> 539495 T1689 oasup.UpdateRequestProcessorChain.init creating updateRequestProcessorChain "distrib-dup-test-chain-explicit"
[junit4] 2> 539495 T1689 oasup.UpdateRequestProcessorChain.init creating updateRequestProcessorChain "distrib-dup-test-chain-implicit"
[junit4] 2> 539495 T1689 oasup.UpdateRequestProcessorChain.init inserting DistributedUpdateProcessorFactory into updateRequestProcessorChain "distrib-dup-test-chain-implicit"
[junit4] 2> 539495 T1689 oasc.SolrCore.loadUpdateProcessorChains no updateRequestProcessorChain defined as default, creating implicit default
[junit4] 2> 539496 T1689 oasc.RequestHandlers.initHandlersFromConfig created standard: solr.StandardRequestHandler
[junit4] 2> 539496 T1689 oasc.RequestHandlers.initHandlersFromConfig created /get: solr.RealTimeGetHandler
[junit4] 2> 539496 T1689 oasc.RequestHandlers.initHandlersFromConfig adding lazy requestHandler: solr.ReplicationHandler
[junit4] 2> 539496 T1689 oasc.RequestHandlers.initHandlersFromConfig created /replication: solr.ReplicationHandler
[junit4] 2> 539497 T1689 oasc.RequestHandlers.initHandlersFromConfig created /update: solr.UpdateRequestHandler
[junit4] 2> 539497 T1689 oasc.RequestHandlers.initHandlersFromConfig created /admin/: org.apache.solr.handler.admin.AdminHandlers
[junit4] 2> 539497 T1689 oasc.RequestHandlers.initHandlersFromConfig created /admin/file: solr.admin.ShowFileRequestHandler
[junit4] 2> 539499 T1689 oashl.XMLLoader.init xsltCacheLifetimeSeconds=60
[junit4] 2> 539500 T1689 oasu.CommitTracker.<init> Hard AutoCommit: disabled
[junit4] 2> 539500 T1689 oasu.CommitTracker.<init> Soft AutoCommit: disabled
[junit4] 2> 539500 T1689 oasu.RandomMergePolicy.<init> RandomMergePolicy wrapping class org.apache.lucene.index.TieredMergePolicy: [TieredMergePolicy: maxMergeAtOnce=36, maxMergeAtOnceExplicit=37, maxMergedSegmentMB=3.4560546875, floorSegmentMB=2.0302734375, forceMergeDeletesPctAllowed=20.00552080589751, segmentsPerTier=20.0, maxCFSSegmentSizeMB=8.796093022207999E12, noCFSRatio=0.4540328940412207
[junit4] 2> 539501 T1689 oasc.SolrDeletionPolicy.onInit SolrDeletionPolicy.onInit: commits: num=1
[junit4] 2> commit{dir=MockDirectoryWrapper(RAMDirectory@5f3f67a9 lockFactory=org.apache.lucene.store.SingleInstanceLockFactory@46de0947),segFN=segments_1,generation=1}
[junit4] 2> 539501 T1689 oasc.SolrDeletionPolicy.updateCommits newest commit generation = 1
[junit4] 2> 539501 T1689 oass.SolrIndexSearcher.<init> Opening Searcher@9e3f209[collection1] main
[junit4] 2> 539501 T1689 oascc.ZkStateReader.readConfigName Load collection config from:/collections/collection1
[junit4] 2> 539502 T1689 oascc.ZkStateReader.readConfigName path=/collections/collection1 configName=conf1 specified config exists in ZooKeeper
[junit4] 2> 539502 T1689 oasr.ManagedResourceStorage.newStorageIO Setting up ZooKeeper-based storage for the RestManager with znodeBase: /configs/conf1
[junit4] 2> 539502 T1689 oasr.ManagedResourceStorage$ZooKeeperStorageIO.configure Configured ZooKeeperStorageIO with znodeBase: /configs/conf1
[junit4] 2> 539503 T1689 oasr.RestManager.init Initializing RestManager with initArgs: {}
[junit4] 2> 539503 T1689 oasr.ManagedResourceStorage.load Reading _rest_managed.json using ZooKeeperStorageIO:path=/configs/conf1
[junit4] 2> 539503 T1689 oasr.ManagedResourceStorage$ZooKeeperStorageIO.openInputStream No data found for znode /configs/conf1/_rest_managed.json
[junit4] 2> 539503 T1689 oasr.ManagedResourceStorage.load Loaded null at path _rest_managed.json using ZooKeeperStorageIO:path=/configs/conf1
[junit4] 2> 539503 T1689 oasr.ManagedResource.notifyObserversDuringInit WARN No registered observers for /rest/managed
[junit4] 2> 539504 T1689 oasr.RestManager.init Initializing 0 registered ManagedResources
[junit4] 2> 539505 T1690 oasc.SolrCore.registerSearcher [collection1] Registered new searcher Searcher@9e3f209[collection1] main{StandardDirectoryReader(segments_1:1:nrt)}
[junit4] 2> 539507 T1689 oasc.CoreContainer.registerCore registering core: collection1
[junit4] 2> 539507 T1693 oasc.ZkController.register Register replica - core:collection1 address:http://127.0.0.1:42332 collection:collection1 shard:shard2
[junit4] 2> 539507 T1643 oass.SolrDispatchFilter.init user.dir=/mnt/ssd/jenkins/workspace/Lucene-Solr-4.x-Linux/solr/build/solr-core/test/J1
[junit4] 2> 539508 T1693 oascc.SolrZkClient.makePath makePath: /collections/collection1/leader_elect/shard2/election
[junit4] 2> 539508 T1643 oass.SolrDispatchFilter.init SolrDispatchFilter.init() done
[junit4] 2> 539511 T1693 oasc.ShardLeaderElectionContext.runLeaderProcess Running the leader process for shard shard2
[junit4] 2> 539512 T1665 oasc.DistributedQueue$LatchChildWatcher.process LatchChildWatcher fired on path: /overseer/queue state: SyncConnected type NodeChildrenChanged
[junit4] 2> 539512 T1665 oasc.DistributedQueue$LatchChildWatcher.process LatchChildWatcher fired on path: /overseer/queue state: SyncConnected type NodeChildrenChanged
[junit4] 2> 539512 T1693 oasc.ShardLeaderElectionContext.waitForReplicasToComeUp Enough replicas found to continue.
[junit4] 2> 539512 T1693 oasc.ShardLeaderElectionContext.runLeaderProcess I may be the new leader - try and sync
[junit4] 2> 539512 T1665 oasc.DistributedQueue$LatchChildWatcher.process LatchChildWatcher fired on path: /overseer/queue state: SyncConnected type NodeChildrenChanged
[junit4] 2> ASYNC NEW_CORE C539 name=collection1 org.apache.solr.core.SolrCore@79de98e8 url=http://127.0.0.1:42332/collection1 node=127.0.0.1:42332_ C539_STATE=coll:collection1 core:collection1 props:{state=down, base_url=http://127.0.0.1:42332, core=collection1, node_name=127.0.0.1:42332_}
[junit4] 2> 539512 T1693 C539 P42332 oasc.SyncStrategy.sync Sync replicas to http://127.0.0.1:42332/collection1/
[junit4] 2> 539513 T1693 C539 P42332 oasc.SyncStrategy.syncReplicas Sync Success - now sync replicas to me
[junit4] 2> 539513 T1693 C539 P42332 oasc.SyncStrategy.syncToMe http://127.0.0.1:42332/collection1/ has no replicas
[junit4] 2> 539513 T1693 oasc.ShardLeaderElectionContext.runLeaderProcess I am the new leader: http://127.0.0.1:42332/collection1/ shard2
[junit4] 2> 539513 T1666 oascc.ZkStateReader.updateClusterState Updating cloud state from ZooKeeper...
[junit4] 2> 539513 T1693 oascc.SolrZkClient.makePath makePath: /collections/collection1/leaders/shard2
[junit4] 2> 539515 T1665 oasc.DistributedQueue$LatchChildWatcher.process LatchChildWatcher fired on path: /overseer/queue state: SyncConnected type NodeChildrenChanged
[junit4] 2> 539516 T1665 oasc.DistributedQueue$LatchChildWatcher.process LatchChildWatcher fired on path: /overseer/queue state: SyncConnected type NodeChildrenChanged
[junit4] 2> 539519 T1665 oasc.DistributedQueue$LatchChildWatcher.process LatchChildWatcher fired on path: /overseer/queue state: SyncConnected type NodeChildrenChanged
[junit4] 2> 539621 T1675 oascc.ZkStateReader$2.process A cluster state change: WatchedEvent state:SyncConnected type:NodeDataChanged path:/clusterstate.json, has occurred - updating... (live nodes size: 2)
[junit4] 2> 539621 T1665 oascc.ZkStateReader$2.process A cluster state change: WatchedEvent state:SyncConnected type:NodeDataChanged path:/clusterstate.json, has occurred - updating... (live nodes size: 2)
[junit4] 2> 539621 T1688 oascc.ZkStateReader$2.process A cluster state change: WatchedEvent state:SyncConnected type:NodeDataChanged path:/clusterstate.json, has occurred - updating... (live nodes size: 2)
[junit4] 2> 539667 T1693 oasc.ZkController.register We are http://127.0.0.1:42332/collection1/ and leader is http://127.0.0.1:42332/collection1/
[junit4] 2> 539667 T1693 oasc.ZkController.register No LogReplay needed for core=collection1 baseURL=http://127.0.0.1:42332
[junit4] 2> 539668 T1693 oasc.ZkController.checkRecovery I am the leader, no recovery necessary
[junit4] 2> 539668 T1693 oasc.ZkController.publish publishing core=collection1 state=active collection=collection1
[junit4] 2> 539668 T1693 oasc.ZkController.publish numShards not found on descriptor - reading it from system property
[junit4] 2> 539669 T1665 oasc.DistributedQueue$LatchChildWatcher.process LatchChildWatcher fired on path: /overseer/queue state: SyncConnected type NodeChildrenChanged
[junit4] 2> 539669 T1665 oasc.DistributedQueue$LatchChildWatcher.process LatchChildWatcher fired on path: /overseer/queue state: SyncConnected type NodeChildrenChanged
[junit4] 2> 539669 T1693 oascc.ZkStateReader.updateClusterState Updating cloud state from ZooKeeper...
[junit4] 2> 539669 T1665 oasc.DistributedQueue$LatchChildWatcher.process LatchChildWatcher fired on path: /overseer/queue state: SyncConnected type NodeChildrenChanged
[junit4] 2> 539670 T1666 oascc.ZkStateReader.updateClusterState Updating cloud state from ZooKeeper...
[junit4] 2> 539671 T1666 oasc.Overseer$ClusterStateUpdater.updateState Update state numShards=2 message={
[junit4] 2> "operation":"state",
[junit4] 2> "state":"active",
[junit4] 2> "base_url":"http://127.0.0.1:42332",
[junit4] 2> "core":"collection1",
[junit4] 2> "roles":null,
[junit4] 2> "node_name":"127.0.0.1:42332_",
[junit4] 2> "shard":"shard2",
[junit4] 2> "collection":"collection1",
[junit4] 2> "numShards":"2",
[junit4] 2> "core_node_name":"core_node1"}
[junit4] 2> 539673 T1665 oasc.DistributedQueue$LatchChildWatcher.process LatchChildWatcher fired on path: /overseer/queue state: SyncConnected type NodeChildrenChanged
[junit4] 2> 539762 T1643 oasc.AbstractFullDistribZkTestBase.createJettys create jetty 2
[junit4] 2> 539763 T1643 oejs.Server.doStart jetty-8.1.10.v20130312
[junit4] 2> 539765 T1643 oejs.AbstractConnector.doStart Started SelectChannelConnector@127.0.0.1:59179
[junit4] 2> 539766 T1643 oass.SolrDispatchFilter.init SolrDispatchFilter.init()
[junit4] 2> 539766 T1643 oasc.SolrResourceLoader.locateSolrHome JNDI not configured for solr (NoInitialContextEx)
[junit4] 2> 539766 T1643 oasc.SolrResourceLoader.locateSolrHome using system property solr.solr.home: ./solr.cloud.HttpPartitionTest-28A2A804290B2957-001/tempDir-004
[junit4] 2> 539767 T1643 oasc.SolrResourceLoader.<init> new SolrResourceLoader for directory: './solr.cloud.HttpPartitionTest-28A2A804290B2957-001/tempDir-004/'
[junit4] 2> 539774 T1688 oascc.ZkStateReader$2.process A cluster state change: WatchedEvent state:SyncConnected type:NodeDataChanged path:/clusterstate.json, has occurred - updating... (live nodes size: 2)
[junit4] 2> 539774 T1665 oascc.ZkStateReader$2.process A cluster state change: WatchedEvent state:SyncConnected type:NodeDataChanged path:/clusterstate.json, has occurred - updating... (live nodes size: 2)
[junit4] 2> 539774 T1675 oascc.ZkStateReader$2.process A cluster state change: WatchedEvent state:SyncConnected type:NodeDataChanged path:/clusterstate.json, has occurred - updating... (live nodes size: 2)
[junit4] 2> 539781 T1643 oasc.ConfigSolr.fromFile Loading container configuration from /mnt/ssd/jenkins/workspace/Lucene-Solr-4.x-Linux/solr/build/solr-core/test/J1/./solr.cloud.HttpPartitionTest-28A2A804290B2957-001/tempDir-004/solr.xml
[junit4] 2> 539788 T1643 oasc.CoreContainer.<init> New CoreContainer 1095116504
[junit4] 2> 539789 T1643 oasc.CoreContainer.load Loading cores into CoreContainer [instanceDir=./solr.cloud.HttpPartitionTest-28A2A804290B2957-001/tempDir-004/]
[junit4] 2> 539789 T1643 oashc.HttpShardHandlerFactory.getParameter Setting socketTimeout to: 90000
[junit4] 2> 539790 T1643 oashc.HttpShardHandlerFactory.getParameter Setting urlScheme to:
[junit4] 2> 539790 T1643 oashc.HttpShardHandlerFactory.getParameter Setting connTimeout to: 15000
[junit4] 2> 539790 T1643 oashc.HttpShardHandlerFactory.getParameter Setting maxConnectionsPerHost to: 20
[junit4] 2> 539790 T1643 oashc.HttpShardHandlerFactory.getParameter Setting corePoolSize to: 0
[junit4] 2> 539790 T1643 oashc.HttpShardHandlerFactory.getParameter Setting maximumPoolSize to: 2147483647
[junit4] 2> 539791 T1643 oashc.HttpShardHandlerFactory.getParameter Setting maxThreadIdleTime to: 5
[junit4] 2> 539791 T1643 oashc.HttpShardHandlerFactory.getParameter Setting sizeOfQueue to: -1
[junit4] 2> 539791 T1643 oashc.HttpShardHandlerFactory.getParameter Setting fairnessPolicy to: false
[junit4] 2> 539792 T1643 oasl.LogWatcher.createWatcher SLF4J impl is org.slf4j.impl.Log4jLoggerFactory
[junit4] 2> 539792 T1643 oasl.LogWatcher.newRegisteredLogWatcher Registering Log Listener [Log4j (org.slf4j.impl.Log4jLoggerFactory)]
[junit4] 2> 539793 T1643 oasc.CoreContainer.load Host Name: 127.0.0.1
[junit4] 2> 539793 T1643 oasc.ZkContainer.initZooKeeper Zookeeper client=127.0.0.1:51084/solr
[junit4] 2> 539793 T1643 oasc.ZkController.checkChrootPath zkHost includes chroot
[junit4] 2> 539794 T1643 oascc.ConnectionManager.waitForConnected Waiting for client to connect to ZooKeeper
[junit4] 2> 539796 T1705 oascc.ConnectionManager.process Watcher org.apache.solr.common.cloud.ConnectionManager@4a4b11d4 name:ZooKeeperConnection Watcher:127.0.0.1:51084 got event WatchedEvent state:SyncConnected type:None path:null path:null type:None
[junit4] 2> 539797 T1643 oascc.ConnectionManager.waitForConnected Client is connected to ZooKeeper
[junit4] 2> 539799 T1643 oascc.ConnectionManager.waitForConnected Waiting for client to connect to ZooKeeper
[junit4] 2> 539800 T1707 oascc.ConnectionManager.process Watcher org.apache.solr.common.cloud.ConnectionManager@311540e3 name:ZooKeeperConnection Watcher:127.0.0.1:51084/solr got event WatchedEvent state:SyncConnected type:None path:null path:null type:None
[junit4] 2> 539800 T1643 oascc.ConnectionManager.waitForConnected Client is connected to ZooKeeper
[junit4] 2> 539804 T1643 oascc.ZkStateReader.createClusterStateWatchersAndUpdate Updating cluster state from ZooKeeper...
[junit4] 2> 540806 T1643 oasc.ZkController.createEphemeralLiveNode Register node as live in ZooKeeper:/live_nodes/127.0.0.1:37136_
[junit4] 2> 540807 T1643 oascc.SolrZkClient.makePath makePath: /live_nodes/127.0.0.1:37136_
[junit4] 2> 540813 T1675 oascc.ZkStateReader$3.process Updating live nodes... (3)
[junit4] 2> 540813 T1665 oascc.ZkStateReader$3.process Updating live nodes... (3)
[junit4] 2> 540813 T1707 oascc.ZkStateReader$3.process Updating live nodes... (3)
[junit4] 2> 540813 T1688 oascc.ZkStateReader$3.process Updating live nodes... (3)
[junit4] 2> 540817 T1708 oasc.ZkController.publish publishing core=collection1 state=down collection=collection1
[junit4] 2> 540817 T1708 oasc.ZkController.publish numShards not found on descriptor - reading it from system property
[junit4] 2> 540818 T1665 oasc.DistributedQueue$LatchChildWatcher.process LatchChildWatcher fired on path: /overseer/queue state: SyncConnected type NodeChildrenChanged
[junit4] 2> 540818 T1665 oasc.DistributedQueue$LatchChildWatcher.process LatchChildWatcher fired on path: /overseer/queue state: SyncConnected type NodeChildrenChanged
[junit4] 2> 540818 T1708 oasc.ZkController.waitForCoreNodeName look for our core node name
[junit4] 2> 540818 T1665 oasc.DistributedQueue$LatchChildWatcher.process LatchChildWatcher fired on path: /overseer/queue state: SyncConnected type NodeChildrenChanged
[junit4] 2> 540819 T1666 oascc.ZkStateReader.updateClusterState Updating cloud state from ZooKeeper...
[junit4] 2> 540819 T1666 oasc.Overseer$ClusterStateUpdater.updateState Update state numShards=2 message={
[junit4] 2> "operation":"state",
[junit4] 2> "state":"down",
[junit4] 2> "base_url":"http://127.0.0.1:37136",
[junit4] 2> "core":"collection1",
[junit4] 2> "roles":null,
[junit4] 2> "node_name":"127.0.0.1:37136_",
[junit4] 2> "shard":null,
[junit4] 2> "collection":"collection1",
[junit4] 2> "numShards":"2",
[junit4] 2> "core_node_name":null}
[junit4] 2> 540819 T1666 oasc.Overseer$ClusterStateUpdater.updateState Collection already exists with numShards=2
[junit4] 2> 540819 T1666 oasc.Overseer$ClusterStateUpdater.updateState Assigning new node to shard shard=shard1
[junit4] 2> 540823 T1665 oasc.DistributedQueue$LatchChildWatcher.process LatchChildWatcher fired on path: /overseer/queue state: SyncConnected type NodeChildrenChanged
[junit4] 2> 540924 T1675 oascc.ZkStateReader$2.process A cluster state change: WatchedEvent state:SyncConnected type:NodeDataChanged path:/clusterstate.json, has occurred - updating... (live nodes size: 3)
[junit4] 2> 540924 T1707 oascc.ZkStateReader$2.process A cluster state change: WatchedEvent state:SyncConnected type:NodeDataChanged path:/clusterstate.json, has occurred - updating... (live nodes size: 3)
[junit4] 2> 540924 T1688 oascc.ZkStateReader$2.process A cluster state change: WatchedEvent state:SyncConnected type:NodeDataChanged path:/clusterstate.json, has occurred - updating... (live nodes size: 3)
[junit4] 2> 540924 T1665 oascc.ZkStateReader$2.process A cluster state change: WatchedEvent state:SyncConnected type:NodeDataChanged path:/clusterstate.json, has occurred - updating... (live nodes size: 3)
[junit4] 2> 541818 T1708 oasc.ZkController.waitForShardId waiting to find shard id in clusterstate for collection1
[junit4] 2> 541819 T1708 oasc.ZkController.createCollectionZkNode Check for collection zkNode:collection1
[junit4] 2> 541820 T1708 oasc.ZkController.createCollectionZkNode Collection zkNode exists
[junit4] 2> 541820 T1708 oascc.ZkStateReader.readConfigName Load collection config from:/collections/collection1
[junit4] 2> 541822 T1708 oascc.ZkStateReader.readConfigName path=/collections/collection1 configName=conf1 specified config exists in ZooKeeper
[junit4] 2> 541822 T1708 oasc.SolrResourceLoader.<init> new SolrResourceLoader for directory: './solr.cloud.HttpPartitionTest-28A2A804290B2957-001/tempDir-004/collection1/'
[junit4] 2> 541823 T1708 oasc.SolrResourceLoader.replaceClassLoader Adding 'file:/mnt/ssd/jenkins/workspace/Lucene-Solr-4.x-Linux/solr/build/solr-core/test/J1/solr.cloud.HttpPartitionTest-28A2A804290B2957-001/tempDir-004/collection1/lib/.svn/' to classloader
[junit4] 2> 541823 T1708 oasc.SolrResourceLoader.replaceClassLoader Adding 'file:/mnt/ssd/jenkins/workspace/Lucene-Solr-4.x-Linux/solr/build/solr-core/test/J1/solr.cloud.HttpPartitionTest-28A2A804290B2957-001/tempDir-004/collection1/lib/classes/' to classloader
[junit4] 2> 541824 T1708 oasc.SolrResourceLoader.replaceClassLoader Adding 'file:/mnt/ssd/jenkins/workspace/Lucene-Solr-4.x-Linux/solr/build/solr-core/test/J1/solr.cloud.HttpPartitionTest-28A2A804290B2957-001/tempDir-004/collection1/lib/README' to classloader
[junit4] 2> 541851 T1708 oasc.SolrConfig.<init> Using Lucene MatchVersion: LUCENE_4_9
[junit4] 2> 541861 T1708 oasc.SolrConfig.<init> Loaded SolrConfig: solrconfig.xml
[junit4] 2> 541863 T1708 oass.IndexSchema.readSchema Reading Solr Schema from schema.xml
[junit4] 2> 541867 T1708 oass.IndexSchema.readSchema [collection1] Schema name=test
[junit4] 2> 541967 T1708 oass.ByteField.init WARN ByteField is deprecated and will be removed in 5.0. You should use TrieIntField instead.
[junit4] 2> 541968 T1708 oass.ShortField.init WARN ShortField is deprecated and will be removed in 5.0. You should use TrieIntField instead.
[junit4] 2> 541968 T1708 oass.OpenExchangeRatesOrgProvider.init Initialized with rates=open-exchange-rates.json, refreshInterval=1440.
[junit4] 2> 541971 T1708 oass.IndexSchema.readSchema default search field in schema is text
[junit4] 2> 541972 T1708 oass.IndexSchema.readSchema unique key field: id
[junit4] 2> 541986 T1708 oass.FileExchangeRateProvider.reload Reloading exchange rates from file currency.xml
[junit4] 2> 541988 T1708 oass.FileExchangeRateProvider.reload Reloading exchange rates from file currency.xml
[junit4] 2> 541990 T1708 oass.OpenExchangeRatesOrgProvider.reload Reloading exchange rates from open-exchange-rates.json
[junit4] 2> 541990 T1708 oass.OpenExchangeRatesOrgProvider$OpenExchangeRates.<init> WARN Unknown key IMPORTANT NOTE
[junit4] 2> 541990 T1708 oass.OpenExchangeRatesOrgProvider$OpenExchangeRates.<init> WARN Expected key, got STRING
[junit4] 2> 541991 T1708 oass.OpenExchangeRatesOrgProvider.reload Reloading exchange rates from open-exchange-rates.json
[junit4] 2> 541992 T1708 oass.OpenExchangeRatesOrgProvider$OpenExchangeRates.<init> WARN Unknown key IMPORTANT NOTE
[junit4] 2> 541992 T1708 oass.OpenExchangeRatesOrgProvider$OpenExchangeRates.<init> WARN Expected key, got STRING
[junit4] 2> 541992 T1708 oasc.CoreContainer.create Creating SolrCore 'collection1' using configuration from collection collection1
[junit4] 2> 541993 T1708 oasc.SolrCore.initDirectoryFactory org.apache.solr.core.MockDirectoryFactory
[junit4] 2> 541993 T1708 oasc.SolrCore.<init> [collection1] Opening new SolrCore at ./solr.cloud.HttpPartitionTest-28A2A804290B2957-001/tempDir-004/collection1/, dataDir=./solr.cloud.HttpPartitionTest-28A2A804290B2957-001/tempDir-001/jetty2/
[junit4] 2> 541993 T1708 oasc.JmxMonitoredMap.<init> JMX monitoring is enabled. Adding Solr mbeans to JMX Server: com.sun.jmx.mbeanserver.JmxMBeanServer@4fc763fa
[junit4] 2> 541994 T1708 oasc.CachingDirectoryFactory.get return new directory for ./solr.cloud.HttpPartitionTest-28A2A804290B2957-001/tempDir-001/jetty2
[junit4] 2> 541995 T1708 oasc.SolrCore.getNewIndexDir New index directory detected: old=null new=./solr.cloud.HttpPartitionTest-28A2A804290B2957-001/tempDir-001/jetty2/index/
[junit4] 2> 541995 T1708 oasc.SolrCore.initIndex WARN [collection1] Solr index directory './solr.cloud.HttpPartitionTest-28A2A804290B2957-001/tempDir-001/jetty2/index' doesn't exist. Creating new index...
[junit4] 2> 541995 T1708 oasc.CachingDirectoryFactory.get return new directory for ./solr.cloud.HttpPartitionTest-28A2A804290B2957-001/tempDir-001/jetty2/index
[junit4] 2> 541996 T1708 oasu.RandomMergePolicy.<init> RandomMergePolicy wrapping class org.apache.lucene.index.TieredMergePolicy: [TieredMergePolicy: maxMergeAtOnce=29, maxMergeAtOnceExplicit=33, maxMergedSegmentMB=71.505859375, floorSegmentMB=1.7490234375, forceMergeDeletesPctAllowed=5.424670760772601, segmentsPerTier=48.0, maxCFSSegmentSizeMB=8.796093022207999E12, noCFSRatio=0.0
[junit4] 2> 541997 T1708 oasc.SolrDeletionPolicy.onCommit SolrDeletionPolicy.onCommit: commits: num=1
[junit4] 2> commit{dir=MockDirectoryWrapper(RAMDirectory@cbb2b51 lockFactory=org.apache.lucene.store.SingleInstanceLockFactory@436b308c),segFN=segments_1,generation=1}
[junit4] 2> 541997 T1708 oasc.SolrDeletionPolicy.updateCommits newest commit generation = 1
[junit4] 2> 542002 T1708 oasup.UpdateRequestProcessorChain.init creating updateRequestProcessorChain "nodistrib"
[junit4] 2> 542003 T1708 oasup.UpdateRequestProcessorChain.init creating updateRequestProcessorChain "dedupe"
[junit4] 2> 542003 T1708 oasup.UpdateRequestProcessorChain.init inserting DistributedUpdateProcessorFactory into updateRequestProcessorChain "dedupe"
[junit4] 2> 542003 T1708 oasup.UpdateRequestProcessorChain.init creating updateRequestProcessorChain "stored_sig"
[junit4] 2> 542004 T1708 oasup.UpdateRequestProcessorChain.init inserting DistributedUpdateProcessorFactory into updateRequestProcessorChain "stored_sig"
[junit4] 2> 542004 T1708 oasup.UpdateRequestProcessorChain.init creating updateRequestProcessorChain "distrib-dup-test-chain-explicit"
[junit4] 2> 542004 T1708 oasup.UpdateRequestProcessorChain.init creating updateRequestProcessorChain "distrib-dup-test-chain-implicit"
[junit4] 2> 542004 T1708 oasup.UpdateRequestProcessorChain.init inserting DistributedUpdateProcessorFactory into updateRequestProcessorChain "distrib-dup-test-chain-implicit"
[junit4] 2> 542005 T1708 oasc.SolrCore.loadUpdateProcessorChains no updateRequestProcessorChain defined as default, creating implicit default
[junit4] 2> 542005 T1708 oasc.RequestHandlers.initHandlersFromConfig created standard: solr.StandardRequestHandler
[junit4] 2> 542005 T1708 oasc.RequestHandlers.initHandlersFromConfig created /get: solr.RealTimeGetHandler
[junit4] 2> 542005 T1708 oasc.RequestHandlers.initHandlersFromConfig adding lazy requestHandler: solr.ReplicationHandler
[junit4] 2> 542006 T1708 oasc.RequestHandlers.initHandlersFromConfig created /replication: solr.ReplicationHandler
[junit4] 2> 542006 T1708 oasc.RequestHandlers.initHandlersFromConfig created /update: solr.UpdateRequestHandler
[junit4] 2> 542006 T1708 oasc.RequestHandlers.initHandlersFromConfig created /admin/: org.apache.solr.handler.admin.AdminHandlers
[junit4] 2> 542007 T1708 oasc.RequestHandlers.initHandlersFromConfig created /admin/file: solr.admin.ShowFileRequestHandler
[junit4] 2> 542008 T1708 oashl.XMLLoader.init xsltCacheLifetimeSeconds=60
[junit4] 2> 542009 T1708 oasu.CommitTracker.<init> Hard AutoCommit: disabled
[junit4] 2> 542009 T1708 oasu.CommitTracker.<init> Soft AutoCommit: disabled
[junit4] 2> 542010 T1708 oasu.RandomMergePolicy.<init> RandomMergePolicy wrapping class org.apache.lucene.index.TieredMergePolicy: [TieredMergePolicy: maxMergeAtOnce=36, maxMergeAtOnceExplicit=37, maxMergedSegmentMB=3.4560546875, floorSegmentMB=2.0302734375, forceMergeDeletesPctAllowed=20.00552080589751, segmentsPerTier=20.0, maxCFSSegmentSizeMB=8.796093022207999E12, noCFSRatio=0.4540328940412207
[junit4] 2> 542010 T1708 oasc.SolrDeletionPolicy.onInit SolrDeletionPolicy.onInit: commits: num=1
[junit4] 2> commit{dir=MockDirectoryWrapper(RAMDirectory@cbb2b51 lockFactory=org.apache.lucene.store.SingleInstanceLockFactory@436b308c),segFN=segments_1,generation=1}
[junit4] 2> 542010 T1708 oasc.SolrDeletionPolicy.updateCommits newest commit generation = 1
[junit4] 2> 542010 T1708 oass.SolrIndexSearcher.<init> Opening Searcher@4bae02fd[collection1] main
[junit4] 2> 542010 T1708 oascc.ZkStateReader.readConfigName Load collection config from:/collections/collection1
[junit4] 2> 542011 T1708 oascc.ZkStateReader.readConfigName path=/collections/collection1 configName=conf1 specified config exists in ZooKeeper
[junit4] 2> 542011 T1708 oasr.ManagedResourceStorage.newStorageIO Setting up ZooKeeper-based storage for the RestManager with znodeBase: /configs/conf1
[junit4] 2> 542012 T1708 oasr.ManagedResourceStorage$ZooKeeperStorageIO.configure Configured ZooKeeperStorageIO with znodeBase: /configs/conf1
[junit4] 2> 542012 T1708 oasr.RestManager.init Initializing RestManager with initArgs: {}
[junit4] 2> 542012 T1708 oasr.ManagedResourceStorage.load Reading _rest_managed.json using ZooKeeperStorageIO:path=/configs/conf1
[junit4] 2> 542013 T1708 oasr.ManagedResourceStorage$ZooKeeperStorageIO.openInputStream No data found for znode /configs/conf1/_rest_managed.json
[junit4] 2> 542013 T1708 oasr.ManagedResourceStorage.load Loaded null at path _rest_managed.json using ZooKeeperStorageIO:path=/configs/conf1
[junit4] 2> 542013 T1708 oasr.ManagedResource.notifyObserversDuringInit WARN No registered observers for /rest/managed
[junit4] 2> 542013 T1708 oasr.RestManager.init Initializing 0 registered ManagedResources
[junit4] 2> 542015 T1709 oasc.SolrCore.registerSearcher [collection1] Registered new searcher Searcher@4bae02fd[collection1] main{StandardDirectoryReader(segments_1:1:nrt)}
[junit4] 2> 542016 T1708 oasc.CoreContainer.registerCore registering core: collection1
[junit4] 2> 542017 T1712 oasc.ZkController.register Register replica - core:collection1 address:http://127.0.0.1:37136 collection:collection1 shard:shard1
[junit4] 2> 542018 T1643 oass.SolrDispatchFilter.init user.dir=/mnt/ssd/jenkins/workspace/Lucene-Solr-4.x-Linux/solr/build/solr-core/test/J1
[junit4] 2> 542018 T1643 oass.SolrDispatchFilter.init SolrDispatchFilter.init() done
[junit4] 2> 542018 T1712 oascc.SolrZkClient.makePath makePath: /collections/collection1/leader_elect/shard1/election
[junit4] 2> 542020 T1643 oascc.ZkStateReader.updateClusterState Updating cloud state from ZooKeeper...
[junit4] 2> 542021 T1643 oasc.AbstractFullDistribZkTestBase.waitForThingsToLevelOut Wait for recoveries to finish - wait 30000 for each attempt
[junit4] 2> 542021 T1643 oasc.AbstractDistribZkTestBase.waitForRecoveriesToFinish Wait for recoveries to finish - collection: collection1 failOnTimeout:true timeout (sec):30000
[junit4] 2> 542022 T1643 oascc.ZkStateReader.updateClusterState Updating cloud state from ZooKeeper...
[junit4] 2> 542024 T1712 oasc.ShardLeaderElectionContext.runLeaderProcess Running the leader process for shard shard1
[junit4] 2> 542026 T1665 oasc.DistributedQueue$LatchChildWatcher.process LatchChildWatcher fired on path: /overseer/queue state: SyncConnected type NodeChildrenChanged
[junit4] 2> 542026 T1665 oasc.DistributedQueue$LatchChildWatcher.process LatchChildWatcher fired on path: /overseer/queue state: SyncConnected type NodeChildrenChanged
[junit4] 2> 542026 T1665 oasc.DistributedQueue$LatchChildWatcher.process LatchChildWatcher fired on path: /overseer/queue state: SyncConnected type NodeChildrenChanged
[junit4] 2> 542026 T1712 oasc.ShardLeaderElectionContext.waitForReplicasToComeUp Enough replicas found to continue.
[junit4] 2> 542027 T1712 oasc.ShardLeaderElectionContext.runLeaderProcess I may be the new leader - try and sync
[junit4] 2> ASYNC NEW_CORE C540 name=collection1 org.apache.solr.core.SolrCore@55afd0dc url=http://127.0.0.1:37136/collection1 node=127.0.0.1:37136_ C540_STATE=coll:collection1 core:collection1 props:{state=down, base_url=http://127.0.0.1:37136, core=collection1, node_name=127.0.0.1:37136_}
[junit4] 2> 542027 T1712 C540 P37136 oasc.SyncStrategy.sync Sync replicas to http://127.0.0.1:37136/collection1/
[junit4] 2> 542027 T1666 oascc.ZkStateReader.updateClusterState Updating cloud state from ZooKeeper...
[junit4] 2> 542027 T1712 C540 P37136 oasc.SyncStrategy.syncReplicas Sync Success - now sync replicas to me
[junit4] 2> 542028 T1712 C540 P37136 oasc.SyncStrategy.syncToMe http://127.0.0.1:37136/collection1/ has no replicas
[junit4] 2> 542028 T1712 oasc.ShardLeaderElectionContext.runLeaderProcess I am the new leader: http://127.0.0.1:37136/collection1/ shard1
[junit4] 2> 542028 T1712 oascc.SolrZkClient.makePath makePath: /collections/collection1/leaders/shard1
[junit4] 2> 542030 T1665 oasc.DistributedQueue$LatchChildWatcher.process LatchChildWatcher fired on path: /overseer/queue state: SyncConnected type NodeChildrenChanged
[junit4] 2> 542033 T1665 oasc.DistributedQueue$LatchChildWatcher.process LatchChildWatcher fired on path: /overseer/queue state: SyncConnected type NodeChild
[...truncated too long message...]
ctor.runIamLeaderProcess(LeaderElector.java:142)
[junit4] 2> at org.apache.solr.cloud.LeaderElector.checkIfIamLeader(LeaderElector.java:110)
[junit4] 2> at org.apache.solr.cloud.LeaderElector.joinElection(LeaderElector.java:267)
[junit4] 2> at org.apache.solr.cloud.ShardLeaderElectionContext.rejoinLeaderElection(ElectionContext.java:444)
[junit4] 2> at org.apache.solr.cloud.ShardLeaderElectionContext.runLeaderProcess(ElectionContext.java:208)
[junit4] 2> at org.apache.solr.cloud.LeaderElector.runIamLeaderProcess(LeaderElector.java:142)
[junit4] 2> at org.apache.solr.cloud.LeaderElector.checkIfIamLeader(LeaderElector.java:110)
[junit4] 2> at org.apache.solr.cloud.LeaderElector.joinElection(LeaderElector.java:267)
[junit4] 2> at org.apache.solr.cloud.ShardLeaderElectionContext.rejoinLeaderElection(ElectionContext.java:444)
[junit4] 2> at org.apache.solr.cloud.ShardLeaderElectionContext.runLeaderProcess(ElectionContext.java:208)
[junit4] 2> at org.apache.solr.cloud.LeaderElector.runIamLeaderProcess(LeaderElector.java:142)
[junit4] 2> at org.apache.solr.cloud.LeaderElector.checkIfIamLeader(LeaderElector.java:110)
[junit4] 2> at org.apache.solr.cloud.LeaderElector.joinElection(LeaderElector.java:267)
[junit4] 2> at org.apache.solr.cloud.ShardLeaderElectionContext.rejoinLeaderElection(ElectionContext.java:444)
[junit4] 2> at org.apache.solr.cloud.ShardLeaderElectionContext.runLeaderProcess(ElectionContext.java:208)
[junit4] 2> at org.apache.solr.cloud.LeaderElector.runIamLeaderProcess(LeaderElector.java:142)
[junit4] 2> at org.apache.solr.cloud.LeaderElector.checkIfIamLeader(LeaderElector.java:110)
[junit4] 2> at org.apache.solr.cloud.LeaderElector.access$200(LeaderElector.java:55)
[junit4] 2> at org.apache.solr.cloud.LeaderElector$ElectionWatcher.process(LeaderElector.java:303)
[junit4] 2> at org.apache.zookeeper.ClientCnxn$EventThread.processEvent(ClientCnxn.java:522)
[junit4] 2> at org.apache.zookeeper.ClientCnxn$EventThread.run(ClientCnxn.java:498)
[junit4] 2>
[junit4] 2> 1156415 T3678 oascc.ZkStateReader$2.process A cluster state change: WatchedEvent state:SyncConnected type:NodeDataChanged path:/clusterstate.json, has occurred - updating... (live nodes size: 4)
[junit4] 2> 1156415 T3678 oascc.ZkStateReader$2.process WARN ZooKeeper watch triggered, but Solr cannot talk to ZK
[junit4] 2> 1156415 T3678 oascc.ZkStateReader$3.process WARN ZooKeeper watch triggered, but Solr cannot talk to ZK
[junit4] 2> 1156415 T3678 oasc.LeaderElector$ElectionWatcher.process WARN org.apache.zookeeper.KeeperException$SessionExpiredException: KeeperErrorCode = Session expired for /overseer_elect/election
[junit4] 2> at org.apache.zookeeper.KeeperException.create(KeeperException.java:127)
[junit4] 2> at org.apache.zookeeper.KeeperException.create(KeeperException.java:51)
[junit4] 2> at org.apache.zookeeper.ZooKeeper.getChildren(ZooKeeper.java:1472)
[junit4] 2> at org.apache.solr.common.cloud.SolrZkClient$6.execute(SolrZkClient.java:260)
[junit4] 2> at org.apache.solr.common.cloud.SolrZkClient$6.execute(SolrZkClient.java:257)
[junit4] 2> at org.apache.solr.common.cloud.ZkCmdExecutor.retryOperation(ZkCmdExecutor.java:73)
[junit4] 2> at org.apache.solr.common.cloud.SolrZkClient.getChildren(SolrZkClient.java:257)
[junit4] 2> at org.apache.solr.cloud.LeaderElector.checkIfIamLeader(LeaderElector.java:94)
[junit4] 2> at org.apache.solr.cloud.LeaderElector.access$200(LeaderElector.java:55)
[junit4] 2> at org.apache.solr.cloud.LeaderElector$ElectionWatcher.process(LeaderElector.java:303)
[junit4] 2> at org.apache.zookeeper.ClientCnxn$EventThread.processEvent(ClientCnxn.java:522)
[junit4] 2> at org.apache.zookeeper.ClientCnxn$EventThread.run(ClientCnxn.java:498)
[junit4] 2>
[junit4] 2> 1156433 T3575 oejsh.ContextHandler.doStop stopped o.e.j.s.ServletContextHandler{/sh/pe,null}
[junit4] 2> 1156484 T3575 oas.SolrTestCaseJ4.tearDown ###Ending testDistribSearch
[junit4] 2> 1156486 T3575 oasc.ZkTestServer.send4LetterWord connecting to 127.0.0.1:59980 59980
[junit4] 2> 1157200 T3576 oasc.ZkTestServer.send4LetterWord connecting to 127.0.0.1:59980 59980
[junit4] 2> NOTE: reproduce with: ant test -Dtestcase=SyncSliceTest -Dtests.method=testDistribSearch -Dtests.seed=28A2A804290B2957 -Dtests.multiplier=3 -Dtests.slow=true -Dtests.locale=es_CO -Dtests.timezone=Europe/Prague -Dtests.file.encoding=UTF-8
[junit4] ERROR 56.5s J0 | SyncSliceTest.testDistribSearch <<<
[junit4] > Throwable #1: org.apache.solr.client.solrj.SolrServerException: No live SolrServers available to handle this request
[junit4] > at __randomizedtesting.SeedInfo.seed([28A2A804290B2957:A944261C5E54496B]:0)
[junit4] > at org.apache.solr.client.solrj.impl.LBHttpSolrServer.request(LBHttpSolrServer.java:317)
[junit4] > at org.apache.solr.client.solrj.impl.CloudSolrServer.request(CloudSolrServer.java:659)
[junit4] > at org.apache.solr.client.solrj.request.QueryRequest.process(QueryRequest.java:91)
[junit4] > at org.apache.solr.client.solrj.SolrServer.query(SolrServer.java:301)
[junit4] > at org.apache.solr.cloud.AbstractFullDistribZkTestBase.checkShardConsistency(AbstractFullDistribZkTestBase.java:1149)
[junit4] > at org.apache.solr.cloud.AbstractFullDistribZkTestBase.checkShardConsistency(AbstractFullDistribZkTestBase.java:1118)
[junit4] > at org.apache.solr.cloud.SyncSliceTest.doTest(SyncSliceTest.java:236)
[junit4] > at org.apache.solr.BaseDistributedSearchTestCase.testDistribSearch(BaseDistributedSearchTestCase.java:865)
[junit4] > at java.lang.Thread.run(Thread.java:745)
[junit4] 2> 1157206 T3575 oas.SolrTestCaseJ4.deleteCore ###deleteCore
[junit4] 2> NOTE: leaving temporary files on disk at: /mnt/ssd/jenkins/workspace/Lucene-Solr-4.x-Linux/solr/build/solr-core/test/J0/./solr.cloud.SyncSliceTest-28A2A804290B2957-001
[junit4] 2> NOTE: test params are: codec=Lucene3x, sim=RandomSimilarityProvider(queryNorm=false,coord=no): {}, locale=es_CO, timezone=Europe/Prague
[junit4] 2> NOTE: Linux 3.8.0-41-generic amd64/Oracle Corporation 1.8.0_05 (64-bit)/cpus=8,threads=1,free=76250896,total=316669952
[junit4] 2> NOTE: All tests run in this JVM: [TestDynamicFieldCollectionResource, FileBasedSpellCheckerTest, AnalyticsMergeStrategyTest, SampleTest, ShowFileRequestHandlerTest, RankQueryTest, QueryElevationComponentTest, SimpleFacetsTest, SolrCoreTest, SpellPossibilityIteratorTest, AtomicUpdatesTest, HdfsUnloadDistributedZkTest, MultiThreadedOCPTest, TestFieldResource, AliasIntegrationTest, TestPseudoReturnFields, StatelessScriptUpdateProcessorFactoryTest, TestSearchPerf, CSVRequestHandlerTest, TestSolrQueryParserDefaultOperatorResource, ZkCLITest, TestSolrQueryParser, SSLMigrationTest, PolyFieldTest, TermVectorComponentTest, SchemaVersionSpecificBehaviorTest, MBeansHandlerTest, TestJoin, UUIDFieldTest, DistributedTermsComponentTest, UpdateRequestProcessorFactoryTest, TestCloudManagedSchemaCopyFields, MoreLikeThisHandlerTest, TestCloudManagedSchemaAddField, TestExceedMaxTermLength, TestDistribDocBasedVersion, DocValuesMissingTest, DateMathParserTest, ShardSplitTest, CircularListTest, DOMUtilTest, TestManagedResourceStorage, SliceStateTest, TestManagedStopFilterFactory, TestFieldSortValues, CacheHeaderTest, LeaderElectionTest, TestSort, AutoCommitTest, ReturnFieldsTest, TestDocBasedVersionConstraints, TestMergePolicyConfig, OverseerCollectionProcessorTest, ClusterStateTest, PrimitiveFieldTypeTest, WordBreakSolrSpellCheckerTest, ClusterStateUpdateTest, CopyFieldTest, SolrXmlInZkTest, EnumFieldTest, TestRemoteStreaming, TestSystemIdResolver, LegacyHTMLStripCharFilterTest, DocExpirationUpdateProcessorFactoryTest, CoreAdminCreateDiscoverTest, OverseerTest, TestRestManager, TestChildDocTransformer, URLClassifyProcessorTest, TestConfig, HdfsBasicDistributedZkTest, TestUniqueKeyFieldResource, TestSolrDeletionPolicy1, TestManagedResource, TestLMJelinekMercerSimilarityFactory, TestCloudManagedSchema, TestDocSet, BlockCacheTest, CoreMergeIndexesAdminHandlerTest, LukeRequestHandlerTest, TestDefaultSearchFieldResource, SearchHandlerTest, TestSolrXmlPersistor, SuggesterFSTTest, BadComponentTest, RecoveryZkTest, TestFreeTextSuggestions, HdfsBasicDistributedZk2Test, TestGroupingSearch, PeerSyncTest, TestLRUCache, TestCharFilters, SyncSliceTest]
[junit4] Completed on J0 in 56.53s, 1 test, 1 error <<< FAILURES!
[...truncated 650 lines...]
BUILD FAILED
/mnt/ssd/jenkins/workspace/Lucene-Solr-4.x-Linux/build.xml:467: The following error occurred while executing this line:
/mnt/ssd/jenkins/workspace/Lucene-Solr-4.x-Linux/build.xml:447: The following error occurred while executing this line:
/mnt/ssd/jenkins/workspace/Lucene-Solr-4.x-Linux/build.xml:45: The following error occurred while executing this line:
/mnt/ssd/jenkins/workspace/Lucene-Solr-4.x-Linux/extra-targets.xml:37: The following error occurred while executing this line:
/mnt/ssd/jenkins/workspace/Lucene-Solr-4.x-Linux/solr/build.xml:189: The following error occurred while executing this line:
/mnt/ssd/jenkins/workspace/Lucene-Solr-4.x-Linux/solr/common-build.xml:496: The following error occurred while executing this line:
/mnt/ssd/jenkins/workspace/Lucene-Solr-4.x-Linux/lucene/common-build.xml:1297: The following error occurred while executing this line:
/mnt/ssd/jenkins/workspace/Lucene-Solr-4.x-Linux/lucene/common-build.xml:921: There were test failures: 404 suites, 1648 tests, 2 errors, 1 failure, 37 ignored (16 assumptions)
Total time: 69 minutes 46 seconds
Build step 'Invoke Ant' marked build as failure
Description set: Java: 64bit/jdk1.8.0_05 -XX:+UseCompressedOops -XX:+UseG1GC
Archiving artifacts
Recording test results
Email was triggered for: Failure - Any
Sending email for trigger: Failure - Any