You are viewing a plain text version of this content. The canonical link for it is here.
Posted to yarn-dev@hadoop.apache.org by Apache Jenkins Server <je...@builds.apache.org> on 2013/07/29 12:56:08 UTC
Hadoop-Yarn-trunk - Build # 285 - Still Failing
See https://builds.apache.org/job/Hadoop-Yarn-trunk/285/
###################################################################################
########################## LAST 60 LINES OF THE CONSOLE ###########################
[...truncated 14041 lines...]
at org.junit.runners.model.FrameworkMethod.invokeExplosively(FrameworkMethod.java:42)
at org.junit.internal.runners.statements.InvokeMethod.evaluate(InvokeMethod.java:20)
at org.junit.internal.runners.statements.FailOnTimeout$StatementThread.run(FailOnTimeout.java:62)
Running org.apache.hadoop.yarn.client.TestGetGroups
Tests run: 6, Failures: 0, Errors: 0, Skipped: 0, Time elapsed: 2.596 sec
Results :
Tests in error:
testNMClientNoCleanupOnStop(org.apache.hadoop.yarn.client.api.impl.TestNMClient): test timed out after 180000 milliseconds
Tests run: 43, Failures: 0, Errors: 1, Skipped: 0
[INFO] ------------------------------------------------------------------------
[INFO] Reactor Summary:
[INFO]
[INFO] hadoop-yarn ....................................... SUCCESS [2.803s]
[INFO] hadoop-yarn-api ................................... SUCCESS [1:53.897s]
[INFO] hadoop-yarn-common ................................ SUCCESS [2:05.682s]
[INFO] hadoop-yarn-server ................................ SUCCESS [0.108s]
[INFO] hadoop-yarn-server-common ......................... SUCCESS [26.861s]
[INFO] hadoop-yarn-server-nodemanager .................... SUCCESS [3:51.545s]
[INFO] hadoop-yarn-server-web-proxy ...................... SUCCESS [12.952s]
[INFO] hadoop-yarn-server-resourcemanager ................ SUCCESS [8:46.984s]
[INFO] hadoop-yarn-server-tests .......................... SUCCESS [37.024s]
[INFO] hadoop-yarn-client ................................ FAILURE [4:26.545s]
[INFO] hadoop-yarn-applications .......................... SKIPPED
[INFO] hadoop-yarn-applications-distributedshell ......... SKIPPED
[INFO] hadoop-yarn-applications-unmanaged-am-launcher .... SKIPPED
[INFO] hadoop-yarn-site .................................. SKIPPED
[INFO] hadoop-yarn-project ............................... SKIPPED
[INFO] ------------------------------------------------------------------------
[INFO] BUILD FAILURE
[INFO] ------------------------------------------------------------------------
[INFO] Total time: 22:25.667s
[INFO] Finished at: Mon Jul 29 10:56:06 UTC 2013
[INFO] Final Memory: 47M/765M
[INFO] ------------------------------------------------------------------------
[ERROR] Failed to execute goal org.apache.maven.plugins:maven-surefire-plugin:2.12.3:test (default-test) on project hadoop-yarn-client: There are test failures.
[ERROR]
[ERROR] Please refer to /home/jenkins/jenkins-slave/workspace/Hadoop-Yarn-trunk/trunk/hadoop-yarn-project/hadoop-yarn/hadoop-yarn-client/target/surefire-reports for the individual test results.
[ERROR] -> [Help 1]
[ERROR]
[ERROR] To see the full stack trace of the errors, re-run Maven with the -e switch.
[ERROR] Re-run Maven using the -X switch to enable full debug logging.
[ERROR]
[ERROR] For more information about the errors and possible solutions, please read the following articles:
[ERROR] [Help 1] http://cwiki.apache.org/confluence/display/MAVEN/MojoFailureException
[ERROR]
[ERROR] After correcting the problems, you can resume the build with the command
[ERROR] mvn <goals> -rf :hadoop-yarn-client
Build step 'Execute shell' marked build as failure
Archiving artifacts
Error updating JIRA issues. Saving issues for next build.
com.atlassian.jira.rpc.exception.RemoteAuthenticationException: Attempt to log in user 'hudson' failed. The maximum number of failed login attempts has been reached. Please log into the application through the web interface to reset the number of failed login attempts.
Sending e-mails to: yarn-dev@hadoop.apache.org
Email was triggered for: Failure
Sending email for trigger: Failure
###################################################################################
############################## FAILED TESTS (if any) ##############################
No tests ran.